You are viewing a plain text version of this content. The canonical link for it is here.
Posted to dev@poi.apache.org by Apache Jenkins Server <je...@builds.apache.org> on 2018/11/18 06:26:42 UTC
Build failed in Jenkins: POI-DSL-1.10 #43
See <https://builds.apache.org/job/POI-DSL-1.10/43/display/redirect?page=changes>
Changes:
[kiwiwings] #62921 - Provide OOXMLLite alternative for Java 12+
[kiwiwings] #62921 - Provide OOXMLLite alternative for Java 12+
[kiwiwings] #62921 - Provide OOXMLLite alternative for Java 12+
[kiwiwings] Multiproject test including Windows slaves
[kiwiwings] exclude H35 because of strange file permission errors
[kiwiwings] exclude H35 because of strange file permission errors
[kiwiwings] Try to fix ImageIO cache error
[centic] One more try to avoid the test-failures related to ImageIO-cache dir
[centic] Try to create the temporary directory for ImageIO to see if that makes
the tests work again when built with Maven
[fanningpj] put back XSSFColor(java.awt.Color clr) constructor
[fanningpj] fix sample code
[fanningpj] remove duplicate attempt to add column headers
[fanningpj] remove unused import
[fanningpj] [bug-62908] populate NamedColors
[fanningpj] fix typo
[fanningpj] add testcase for https://bz.apache.org/bugzilla/show_bug.cgi?id=62906
[fanningpj] add testcase for https://bz.apache.org/bugzilla/show_bug.cgi?id=62906
------------------------------------------
[...truncated 664.63 KB...]
[findbugs] java.text.ParseException
[findbugs] java.lang.NoSuchMethodException
[findbugs] javax.xml.transform.TransformerException
[findbugs] javax.xml.transform.OutputKeys
[findbugs] java.awt.geom.Arc2D
[findbugs] java.lang.ClassNotFoundException
[findbugs] javax.xml.crypto.XMLStructure
[findbugs] java.nio.charset.UnsupportedCharsetException
[findbugs] java.nio.MappedByteBuffer
[findbugs] java.lang.NoSuchFieldException
[findbugs] java.security.DigestException
[findbugs] java.security.spec.AlgorithmParameterSpec
[findbugs] org.ietf.jgss.GSSException
[findbugs] javax.xml.xpath.XPathExpressionException
[findbugs] java.security.SignatureException
[findbugs] java.security.AccessControlException
[findbugs] javax.xml.crypto.dsig.spec.C14NMethodParameterSpec
[findbugs] org.xml.sax.ContentHandler
[findbugs] java.awt.geom.RoundRectangle2D
[findbugs] javax.xml.crypto.Data
[findbugs] javax.crypto.ShortBufferException
[findbugs] Warnings generated: 62
[findbugs] Missing classes: 363
[findbugs] Calculating exit code...
[findbugs] Setting 'missing class' flag (2)
[findbugs] Setting 'bugs found' flag (1)
[findbugs] Exit code set to: 3
[findbugs] Java Result: 3
[findbugs] Classes needed for analysis were missing
[findbugs] Output saved to build/findbugs.xml
[xslt] Transforming into <https://builds.apache.org/job/POI-DSL-1.10/ws/build>
[xslt] Processing <https://builds.apache.org/job/POI-DSL-1.10/ws/build/findbugs.xml> to <https://builds.apache.org/job/POI-DSL-1.10/43/artifact/build/findbugs.html>
[xslt] Loading stylesheet jar:<https://builds.apache.org/job/POI-DSL-1.10/ws/build/findbugs/lib/findbugs.jar!/fancy-hist.xsl>
release-notes:
[copy] Copying 1 file to <https://builds.apache.org/job/POI-DSL-1.10/ws/build/dist>
rat-check:
[mkdir] Created dir: <https://builds.apache.org/job/POI-DSL-1.10/ws/build/rat>
[echo]
[echo] *****************************************************
[echo] Summary
[echo] -------
[echo] Generated at: 2018-11-18T06:24:47+00:00
[echo]
[echo] Notes: 0
[echo] Binaries: 102
[echo] Archives: 0
[echo] Standards: 3745
[echo]
[echo] Apache Licensed: 3745
[echo] Generated Documents: 0
[echo]
[echo] JavaDocs are generated, thus a license header is optional.
[echo] Generated files do not require license headers.
[echo]
[echo] 0 Unknown Licenses
[echo]
[echo] *****************************************************
[echo] Files with Apache License headers will be marked AL
[echo] Binary files (which do not require any license headers) will be marked B
[echo] Compressed archives will be marked A
[echo] Notices, licenses etc. will be marked N
[echo]
[echo] *****************************************************
forbidden-apis-check:
[forbiddenapis] Reading bundled API signatures: jdk-unsafe-1.8
[forbiddenapis] Reading bundled API signatures: jdk-deprecated-1.8
[forbiddenapis] Reading bundled API signatures: jdk-internal-1.8
[forbiddenapis] Reading bundled API signatures: jdk-non-portable
[forbiddenapis] Reading bundled API signatures: jdk-reflection
[forbiddenapis] Reading API signatures: <https://builds.apache.org/job/POI-DSL-1.10/ws/src/resources/devtools/forbidden-signatures.txt>
[forbiddenapis] Loading classes to check...
[forbiddenapis] Scanning classes for violations...
[forbiddenapis] Scanned 4216 class file(s) for forbidden API invocations (in 8.22s), 0 error(s).
[forbiddenapis] Reading API signatures: <https://builds.apache.org/job/POI-DSL-1.10/ws/src/resources/devtools/forbidden-signatures-prod.txt>
[forbiddenapis] Loading classes to check...
[forbiddenapis] Scanning classes for violations...
[forbiddenapis] Scanned 3282 class file(s) for forbidden API invocations (in 1.19s), 0 error(s).
jenkins:
BUILD SUCCESSFUL
Total time: 17 minutes 29 seconds
[integrationtest] $ /home/jenkins/tools/ant/apache-ant-1.9.9/bin/ant -file build.xml run -Djava9addmods=--add-modules=java.xml.bind -Djavadoc9addmods=--add-modules=java.xml.bind -Djava9addmodsvalue=-Dsun.reflect.debugModuleAccessChecks=true -Djava9addopens1=--add-opens=java.xml/com.sun.org.apache.xerces.internal.util=ALL-UNNAMED -Djava9addopens2=--add-opens=java.base/java.io=ALL-UNNAMED -Djava9addopens3=--add-opens=java.base/java.nio=ALL-UNNAMED -Djava9addopens4=--add-opens=java.base/java.lang=ALL-UNNAMED -Djava9addopens5=--add-opens=java.base/jdk.internal.ref=ALL-UNNAMED -Djava9addopens6=--add-opens=java.base/java.lang=java.xml.bind -Djava.locale.providers=JRE,CLDR
Buildfile: <https://builds.apache.org/job/POI-DSL-1.10/ws/src/integrationtest/build.xml>
init:
runSourceBuild:
[mkdir] Created dir: <https://builds.apache.org/job/POI-DSL-1.10/ws/build/distsourcebuild>
[echo] Found source package at <https://builds.apache.org/job/POI-DSL-1.10/ws/build/dist/poi-src-4.0.1-SNAPSHOT-20181118.zip>
[unzip] Expanding: <https://builds.apache.org/job/POI-DSL-1.10/ws/build/dist/poi-src-4.0.1-SNAPSHOT-20181118.zip> into <https://builds.apache.org/job/POI-DSL-1.10/ws/build/distsourcebuild>
[mkdir] Created dir: <https://builds.apache.org/job/POI-DSL-1.10/ws/build/distsourcebuild/poi-4.0.1-SNAPSHOT/lib>
[mkdir] Created dir: <https://builds.apache.org/job/POI-DSL-1.10/ws/build/distsourcebuild/poi-4.0.1-SNAPSHOT/ooxml-lib>
[mkdir] Created dir: <https://builds.apache.org/job/POI-DSL-1.10/ws/build/distsourcebuild/poi-4.0.1-SNAPSHOT/compile-lib>
[copy] Copying 35 files to <https://builds.apache.org/job/POI-DSL-1.10/ws/build/distsourcebuild/poi-4.0.1-SNAPSHOT/lib>
[copy] Copying 13 files to <https://builds.apache.org/job/POI-DSL-1.10/ws/build/distsourcebuild/poi-4.0.1-SNAPSHOT/ooxml-lib>
[copy] Copying 4 files to <https://builds.apache.org/job/POI-DSL-1.10/ws/build/distsourcebuild/poi-4.0.1-SNAPSHOT/compile-lib>
[echo] Building in temporary dir <https://builds.apache.org/job/POI-DSL-1.10/ws/build/distsourcebuild/poi-4.0.1-SNAPSHOT/>
check-jars:
fetch-jars:
check-ooxml-jars:
fetch-ooxml-jars:
init:
[mkdir] Created dir: <https://builds.apache.org/job/POI-DSL-1.10/ws/build/distsourcebuild/poi-4.0.1-SNAPSHOT/build>
[mkdir] Created dir: <https://builds.apache.org/job/POI-DSL-1.10/ws/build/distsourcebuild/poi-4.0.1-SNAPSHOT/build/classes>
[mkdir] Created dir: <https://builds.apache.org/job/POI-DSL-1.10/ws/build/distsourcebuild/poi-4.0.1-SNAPSHOT/build/test-classes>
[mkdir] Created dir: <https://builds.apache.org/job/POI-DSL-1.10/ws/build/distsourcebuild/poi-4.0.1-SNAPSHOT/build/test-results>
[mkdir] Created dir: <https://builds.apache.org/job/POI-DSL-1.10/ws/build/distsourcebuild/poi-4.0.1-SNAPSHOT/build/scratchpad-classes>
[mkdir] Created dir: <https://builds.apache.org/job/POI-DSL-1.10/ws/build/distsourcebuild/poi-4.0.1-SNAPSHOT/build/scratchpad-test-classes>
[mkdir] Created dir: <https://builds.apache.org/job/POI-DSL-1.10/ws/build/distsourcebuild/poi-4.0.1-SNAPSHOT/build/scratchpad-test-results>
[mkdir] Created dir: <https://builds.apache.org/job/POI-DSL-1.10/ws/build/distsourcebuild/poi-4.0.1-SNAPSHOT/build/geometry-java>
[mkdir] Created dir: <https://builds.apache.org/job/POI-DSL-1.10/ws/build/distsourcebuild/poi-4.0.1-SNAPSHOT/build/ooxml-classes>
[mkdir] Created dir: <https://builds.apache.org/job/POI-DSL-1.10/ws/build/distsourcebuild/poi-4.0.1-SNAPSHOT/build/ooxml-test-classes>
[mkdir] Created dir: <https://builds.apache.org/job/POI-DSL-1.10/ws/build/distsourcebuild/poi-4.0.1-SNAPSHOT/build/ooxml-test-results>
[mkdir] Created dir: <https://builds.apache.org/job/POI-DSL-1.10/ws/build/distsourcebuild/poi-4.0.1-SNAPSHOT/build/excelant-classes>
[mkdir] Created dir: <https://builds.apache.org/job/POI-DSL-1.10/ws/build/distsourcebuild/poi-4.0.1-SNAPSHOT/build/excelant-test-classes>
[mkdir] Created dir: <https://builds.apache.org/job/POI-DSL-1.10/ws/build/distsourcebuild/poi-4.0.1-SNAPSHOT/build/excelant-test-results>
[mkdir] Created dir: <https://builds.apache.org/job/POI-DSL-1.10/ws/build/distsourcebuild/poi-4.0.1-SNAPSHOT/build/examples-classes>
[mkdir] Created dir: <https://builds.apache.org/job/POI-DSL-1.10/ws/build/distsourcebuild/poi-4.0.1-SNAPSHOT/build/integration-test-classes>
[mkdir] Created dir: <https://builds.apache.org/job/POI-DSL-1.10/ws/build/distsourcebuild/poi-4.0.1-SNAPSHOT/build/integration-test-results>
[mkdir] Created dir: <https://builds.apache.org/job/POI-DSL-1.10/ws/build/distsourcebuild/poi-4.0.1-SNAPSHOT/build/dist>
[mkdir] Created dir: <https://builds.apache.org/job/POI-DSL-1.10/ws/build/distsourcebuild/poi-4.0.1-SNAPSHOT/build/site>
[echo] Using Ant: Apache Ant(TM) version 1.9.9 compiled on February 2 2017 from /home/jenkins/tools/ant/apache-ant-1.9.9, Ant detected Java 9 (may be different than actual Java sometimes...)
[echo] Using Java: 10.0.1/10.0.1+10/10.0.1+10/Java HotSpot(TM) 64-Bit Server VM from "Oracle Corporation" on Linux: 4.13.0-1012-gcp
compile-main:
[javac] Compiling 1211 source files to <https://builds.apache.org/job/POI-DSL-1.10/ws/build/distsourcebuild/poi-4.0.1-SNAPSHOT/build/classes>
[javac] warning: [options] bootstrap class path not set in conjunction with -source 8
[javac] Note: Some input files use or override a deprecated API.
[javac] Note: Recompile with -Xlint:deprecation for details.
[javac] Note: Some input files use unchecked or unsafe operations.
[javac] Note: Recompile with -Xlint:unchecked for details.
[javac] 1 warning
[javac] Creating empty <https://builds.apache.org/job/POI-DSL-1.10/ws/build/distsourcebuild/poi-4.0.1-SNAPSHOT/build/classes/org/apache/poi/poifs/dev/package-info.class>
[javac] Creating empty <https://builds.apache.org/job/POI-DSL-1.10/ws/build/distsourcebuild/poi-4.0.1-SNAPSHOT/build/classes/org/apache/poi/poifs/common/package-info.class>
[javac] Creating empty <https://builds.apache.org/job/POI-DSL-1.10/ws/build/distsourcebuild/poi-4.0.1-SNAPSHOT/build/classes/org/apache/poi/poifs/filesystem/package-info.class>
[javac] Creating empty <https://builds.apache.org/job/POI-DSL-1.10/ws/build/distsourcebuild/poi-4.0.1-SNAPSHOT/build/classes/org/apache/poi/poifs/storage/package-info.class>
[javac] Creating empty <https://builds.apache.org/job/POI-DSL-1.10/ws/build/distsourcebuild/poi-4.0.1-SNAPSHOT/build/classes/org/apache/poi/poifs/package-info.class>
[javac] Creating empty <https://builds.apache.org/job/POI-DSL-1.10/ws/build/distsourcebuild/poi-4.0.1-SNAPSHOT/build/classes/org/apache/poi/poifs/crypt/package-info.class>
[javac] Creating empty <https://builds.apache.org/job/POI-DSL-1.10/ws/build/distsourcebuild/poi-4.0.1-SNAPSHOT/build/classes/org/apache/poi/poifs/eventfilesystem/package-info.class>
[javac] Creating empty <https://builds.apache.org/job/POI-DSL-1.10/ws/build/distsourcebuild/poi-4.0.1-SNAPSHOT/build/classes/org/apache/poi/poifs/property/package-info.class>
[javac] Compiling 535 source files to <https://builds.apache.org/job/POI-DSL-1.10/ws/build/distsourcebuild/poi-4.0.1-SNAPSHOT/build/test-classes>
[javac] warning: [options] bootstrap class path not set in conjunction with -source 8
[javac] Note: Some input files use or override a deprecated API.
[javac] Note: Recompile with -Xlint:deprecation for details.
[javac] Note: <https://builds.apache.org/job/POI-DSL-1.10/ws/build/distsourcebuild/poi-4.0.1-SNAPSHOT/src/testcases/org/apache/poi/sl/usermodel/BaseTestSlideShow.java> uses unchecked or unsafe operations.
[javac] Note: Recompile with -Xlint:unchecked for details.
[javac] 1 warning
[copy] Copying 4 files to <https://builds.apache.org/job/POI-DSL-1.10/ws/build/distsourcebuild/poi-4.0.1-SNAPSHOT/build/classes>
check-ooxml-xsds:
fetch-ooxml-xsds:
generate-geometry:
compile-scratchpad:
[javac] Compiling 488 source files to <https://builds.apache.org/job/POI-DSL-1.10/ws/build/distsourcebuild/poi-4.0.1-SNAPSHOT/build/scratchpad-classes>
[javac] warning: [options] bootstrap class path not set in conjunction with -source 8
[javac] Note: Some input files use or override a deprecated API.
[javac] Note: Recompile with -Xlint:deprecation for details.
[javac] Note: <https://builds.apache.org/job/POI-DSL-1.10/ws/build/distsourcebuild/poi-4.0.1-SNAPSHOT/src/scratchpad/src/org/apache/poi/extractor/ole2/OLE2ScratchpadExtractorFactory.java> uses unchecked or unsafe operations.
[javac] Note: Recompile with -Xlint:unchecked for details.
[javac] 1 warning
[javac] Compiling 191 source files to <https://builds.apache.org/job/POI-DSL-1.10/ws/build/distsourcebuild/poi-4.0.1-SNAPSHOT/build/scratchpad-test-classes>
[javac] warning: [options] bootstrap class path not set in conjunction with -source 8
[javac] Note: Some input files use or override a deprecated API.
[javac] Note: Recompile with -Xlint:deprecation for details.
[javac] Note: <https://builds.apache.org/job/POI-DSL-1.10/ws/build/distsourcebuild/poi-4.0.1-SNAPSHOT/src/scratchpad/testcases/org/apache/poi/hslf/usermodel/TestBugs.java> uses unchecked or unsafe operations.
[javac] Note: Recompile with -Xlint:unchecked for details.
[javac] 1 warning
[copy] Copying 2 files to <https://builds.apache.org/job/POI-DSL-1.10/ws/build/distsourcebuild/poi-4.0.1-SNAPSHOT/build/scratchpad-classes>
check-compiled-ooxml-xsds:
compile-ooxml-xsds:
compile-ooxml:
[javac] Compiling 589 source files to <https://builds.apache.org/job/POI-DSL-1.10/ws/build/distsourcebuild/poi-4.0.1-SNAPSHOT/build/ooxml-classes>
[javac] warning: [options] bootstrap class path not set in conjunction with -source 8
[javac] Note: Some input files use or override a deprecated API.
[javac] Note: Recompile with -Xlint:deprecation for details.
[javac] Note: <https://builds.apache.org/job/POI-DSL-1.10/ws/build/distsourcebuild/poi-4.0.1-SNAPSHOT/src/ooxml/java/org/apache/poi/poifs/crypt/dsig/SignaturePart.java> uses unchecked or unsafe operations.
[javac] Note: Recompile with -Xlint:unchecked for details.
[javac] 1 warning
[javac] Compiling 268 source files to <https://builds.apache.org/job/POI-DSL-1.10/ws/build/distsourcebuild/poi-4.0.1-SNAPSHOT/build/ooxml-test-classes>
[javac] warning: [options] bootstrap class path not set in conjunction with -source 8
[javac] Note: Some input files use or override a deprecated API.
[javac] Note: Recompile with -Xlint:deprecation for details.
[javac] 1 warning
[copy] Copying 3 files to <https://builds.apache.org/job/POI-DSL-1.10/ws/build/distsourcebuild/poi-4.0.1-SNAPSHOT/build/ooxml-classes>
compile-examples:
[javac] Compiling 153 source files to <https://builds.apache.org/job/POI-DSL-1.10/ws/build/distsourcebuild/poi-4.0.1-SNAPSHOT/build/examples-classes>
[javac] warning: [options] bootstrap class path not set in conjunction with -source 8
[javac] Note: Some input files use or override a deprecated API.
[javac] Note: Recompile with -Xlint:deprecation for details.
[javac] 1 warning
[copy] Copying 1 file to <https://builds.apache.org/job/POI-DSL-1.10/ws/build/distsourcebuild/poi-4.0.1-SNAPSHOT/build/examples-classes>
compile-excelant:
[javac] Compiling 14 source files to <https://builds.apache.org/job/POI-DSL-1.10/ws/build/distsourcebuild/poi-4.0.1-SNAPSHOT/build/excelant-classes>
[javac] warning: [options] bootstrap class path not set in conjunction with -source 8
[javac] Note: Some input files use or override a deprecated API.
[javac] Note: Recompile with -Xlint:deprecation for details.
[javac] 1 warning
[javac] Compiling 13 source files to <https://builds.apache.org/job/POI-DSL-1.10/ws/build/distsourcebuild/poi-4.0.1-SNAPSHOT/build/excelant-test-classes>
[javac] warning: [options] bootstrap class path not set in conjunction with -source 8
[javac] 1 warning
[copy] Copying 1 file to <https://builds.apache.org/job/POI-DSL-1.10/ws/build/distsourcebuild/poi-4.0.1-SNAPSHOT/build/excelant-classes>
compile:
compile-version:
[copy] Copying 1 file to <https://builds.apache.org/job/POI-DSL-1.10/ws/build/distsourcebuild/poi-4.0.1-SNAPSHOT/build/classes/org/apache/poi>
[javac] Compiling 1 source file to <https://builds.apache.org/job/POI-DSL-1.10/ws/build/distsourcebuild/poi-4.0.1-SNAPSHOT/build/classes>
[javac] warning: [options] bootstrap class path not set in conjunction with -source 8
[javac] 1 warning
[delete] Deleting: <https://builds.apache.org/job/POI-DSL-1.10/ws/build/distsourcebuild/poi-4.0.1-SNAPSHOT/build/classes/org/apache/poi/Version.java>
-manifest:
jar:
[jar] Building jar: <https://builds.apache.org/job/POI-DSL-1.10/ws/build/distsourcebuild/poi-4.0.1-SNAPSHOT/build/dist/maven/poi/poi-4.0.1-SNAPSHOT.jar>
[jar] Building jar: <https://builds.apache.org/job/POI-DSL-1.10/ws/build/distsourcebuild/poi-4.0.1-SNAPSHOT/build/dist/maven/poi-scratchpad/poi-scratchpad-4.0.1-SNAPSHOT.jar>
[jar] Building jar: <https://builds.apache.org/job/POI-DSL-1.10/ws/build/distsourcebuild/poi-4.0.1-SNAPSHOT/build/dist/maven/poi-ooxml/poi-ooxml-4.0.1-SNAPSHOT.jar>
[jar] Building jar: <https://builds.apache.org/job/POI-DSL-1.10/ws/build/distsourcebuild/poi-4.0.1-SNAPSHOT/build/dist/maven/poi-examples/poi-examples-4.0.1-SNAPSHOT.jar>
[jar] Building jar: <https://builds.apache.org/job/POI-DSL-1.10/ws/build/distsourcebuild/poi-4.0.1-SNAPSHOT/build/dist/maven/poi-excelant/poi-excelant-4.0.1-SNAPSHOT.jar>
BUILD FAILED
<https://builds.apache.org/job/POI-DSL-1.10/ws/src/integrationtest/build.xml>:80: The following error occurred while executing this line:
<https://builds.apache.org/job/POI-DSL-1.10/ws/build/distsourcebuild/poi-4.0.1-SNAPSHOT/build.xml>:1978: The following error occurred while executing this line:
<https://builds.apache.org/job/POI-DSL-1.10/ws/build/distsourcebuild/poi-4.0.1-SNAPSHOT/build.xml>:1964: The archive ooxml-lite-classes.jar doesn't exist
Total time: 50 seconds
Build step 'Invoke Ant' marked build as failure
Skipping publisher since build result is FAILURE
Archiving artifacts
[Fast Archiver] Compressed 242.69 MB of artifacts by 33.8% relative to #42
Skipping publisher since build result is FAILURE
Recording test results
---------------------------------------------------------------------
To unsubscribe, e-mail: dev-unsubscribe@poi.apache.org
For additional commands, e-mail: dev-help@poi.apache.org
Jenkins build is back to normal : POI-DSL-1.10 #44
Posted by Apache Jenkins Server <je...@builds.apache.org>.
See <https://builds.apache.org/job/POI-DSL-1.10/44/display/redirect?page=changes>
---------------------------------------------------------------------
To unsubscribe, e-mail: dev-unsubscribe@poi.apache.org
For additional commands, e-mail: dev-help@poi.apache.org