You are viewing a plain text version of this content. The canonical link for it is here.
Posted to builds@beam.apache.org by Apache Jenkins Server <je...@builds.apache.org> on 2022/08/30 22:40:46 UTC
Build failed in Jenkins: beam_PostCommit_Java_Hadoop_Versions #2048
See <https://ci-beam.apache.org/job/beam_PostCommit_Java_Hadoop_Versions/2048/display/redirect>
Changes:
------------------------------------------
[...truncated 131.14 KB...]
at org.gradle.internal.concurrent.ExecutorPolicy$CatchAndRecordFailures.onExecute(ExecutorPolicy.java:64)
at org.gradle.internal.concurrent.ManagedExecutorImpl$1.run(ManagedExecutorImpl.java:48)
at java.util.concurrent.ThreadPoolExecutor.runWorker(ThreadPoolExecutor.java:1149)
at java.util.concurrent.ThreadPoolExecutor$Worker.run(ThreadPoolExecutor.java:624)
at java.lang.Thread.run(Thread.java:750)
Remove shutdown hook failed
java.lang.IllegalStateException: Shutdown in progress
at java.lang.ApplicationShutdownHooks.remove(ApplicationShutdownHooks.java:82)
at java.lang.Runtime.removeShutdownHook(Runtime.java:239)
at org.gradle.process.internal.shutdown.ShutdownHooks.removeShutdownHook(ShutdownHooks.java:38)
at org.gradle.process.internal.DefaultExecHandle.setEndStateInfo(DefaultExecHandle.java:208)
at org.gradle.process.internal.DefaultExecHandle.failed(DefaultExecHandle.java:369)
at org.gradle.process.internal.ExecHandleRunner.run(ExecHandleRunner.java:87)
at org.gradle.internal.operations.CurrentBuildOperationPreservingRunnable.run(CurrentBuildOperationPreservingRunnable.java:42)
at org.gradle.internal.concurrent.ExecutorPolicy$CatchAndRecordFailures.onExecute(ExecutorPolicy.java:64)
at org.gradle.internal.concurrent.ManagedExecutorImpl$1.run(ManagedExecutorImpl.java:48)
at java.util.concurrent.ThreadPoolExecutor.runWorker(ThreadPoolExecutor.java:1149)
at java.util.concurrent.ThreadPoolExecutor$Worker.run(ThreadPoolExecutor.java:624)
at java.lang.Thread.run(Thread.java:750)
A problem occurred starting process 'Gradle Test Executor 74'
org.gradle.process.internal.ExecException: A problem occurred starting process 'Gradle Test Executor 74'
at org.gradle.process.internal.DefaultExecHandle.execExceptionFor(DefaultExecHandle.java:241)
at org.gradle.process.internal.DefaultExecHandle.setEndStateInfo(DefaultExecHandle.java:218)
at org.gradle.process.internal.DefaultExecHandle.failed(DefaultExecHandle.java:369)
at org.gradle.process.internal.ExecHandleRunner.run(ExecHandleRunner.java:87)
at org.gradle.internal.operations.CurrentBuildOperationPreservingRunnable.run(CurrentBuildOperationPreservingRunnable.java:42)
at org.gradle.internal.concurrent.ExecutorPolicy$CatchAndRecordFailures.onExecute(ExecutorPolicy.java:64)
at org.gradle.internal.concurrent.ManagedExecutorImpl$1.run(ManagedExecutorImpl.java:48)
at java.util.concurrent.ThreadPoolExecutor.runWorker(ThreadPoolExecutor.java:1149)
at java.util.concurrent.ThreadPoolExecutor$Worker.run(ThreadPoolExecutor.java:624)
at java.lang.Thread.run(Thread.java:750)
Caused by: java.lang.IllegalStateException: Shutdown in progress
at java.lang.ApplicationShutdownHooks.add(ApplicationShutdownHooks.java:66)
at java.lang.Runtime.addShutdownHook(Runtime.java:211)
at org.gradle.process.internal.shutdown.ShutdownHooks.addShutdownHook(ShutdownHooks.java:31)
at org.gradle.process.internal.DefaultExecHandle.started(DefaultExecHandle.java:346)
at org.gradle.process.internal.ExecHandleRunner.run(ExecHandleRunner.java:73)
... 6 more
A problem occurred starting process 'Gradle Test Executor 75'
org.gradle.process.internal.ExecException: A problem occurred starting process 'Gradle Test Executor 75'
at org.gradle.process.internal.DefaultExecHandle.execExceptionFor(DefaultExecHandle.java:241)
at org.gradle.process.internal.DefaultExecHandle.setEndStateInfo(DefaultExecHandle.java:218)
at org.gradle.process.internal.DefaultExecHandle.failed(DefaultExecHandle.java:369)
at org.gradle.process.internal.ExecHandleRunner.run(ExecHandleRunner.java:87)
at org.gradle.internal.operations.CurrentBuildOperationPreservingRunnable.run(CurrentBuildOperationPreservingRunnable.java:42)
at org.gradle.internal.concurrent.ExecutorPolicy$CatchAndRecordFailures.onExecute(ExecutorPolicy.java:64)
at org.gradle.internal.concurrent.ManagedExecutorImpl$1.run(ManagedExecutorImpl.java:48)
at java.util.concurrent.ThreadPoolExecutor.runWorker(ThreadPoolExecutor.java:1149)
at java.util.concurrent.ThreadPoolExecutor$Worker.run(ThreadPoolExecutor.java:624)
at java.lang.Thread.run(Thread.java:750)
Caused by: java.lang.IllegalStateException: Shutdown in progress
at java.lang.ApplicationShutdownHooks.add(ApplicationShutdownHooks.java:66)
at java.lang.Runtime.addShutdownHook(Runtime.java:211)
at org.gradle.process.internal.shutdown.ShutdownHooks.addShutdownHook(ShutdownHooks.java:31)
at org.gradle.process.internal.DefaultExecHandle.started(DefaultExecHandle.java:346)
at org.gradle.process.internal.ExecHandleRunner.run(ExecHandleRunner.java:73)
... 6 more
Remove shutdown hook failed
java.lang.IllegalStateException: Shutdown in progress
at java.lang.ApplicationShutdownHooks.remove(ApplicationShutdownHooks.java:82)
at java.lang.Runtime.removeShutdownHook(Runtime.java:239)
at org.gradle.process.internal.shutdown.ShutdownHooks.removeShutdownHook(ShutdownHooks.java:38)
at org.gradle.process.internal.DefaultExecHandle.setEndStateInfo(DefaultExecHandle.java:208)
at org.gradle.process.internal.DefaultExecHandle.failed(DefaultExecHandle.java:369)
at org.gradle.process.internal.ExecHandleRunner.run(ExecHandleRunner.java:87)
at org.gradle.internal.operations.CurrentBuildOperationPreservingRunnable.run(CurrentBuildOperationPreservingRunnable.java:42)
at org.gradle.internal.concurrent.ExecutorPolicy$CatchAndRecordFailures.onExecute(ExecutorPolicy.java:64)
at org.gradle.internal.concurrent.ManagedExecutorImpl$1.run(ManagedExecutorImpl.java:48)
at java.util.concurrent.ThreadPoolExecutor.runWorker(ThreadPoolExecutor.java:1149)
at java.util.concurrent.ThreadPoolExecutor$Worker.run(ThreadPoolExecutor.java:624)
at java.lang.Thread.run(Thread.java:750)
Remove shutdown hook failed
java.lang.IllegalStateException: Shutdown in progress
at java.lang.ApplicationShutdownHooks.remove(ApplicationShutdownHooks.java:82)
at java.lang.Runtime.removeShutdownHook(Runtime.java:239)
at org.gradle.process.internal.shutdown.ShutdownHooks.removeShutdownHook(ShutdownHooks.java:38)
at org.gradle.process.internal.DefaultExecHandle.setEndStateInfo(DefaultExecHandle.java:208)
at org.gradle.process.internal.DefaultExecHandle.failed(DefaultExecHandle.java:369)
at org.gradle.process.internal.ExecHandleRunner.run(ExecHandleRunner.java:87)
at org.gradle.internal.operations.CurrentBuildOperationPreservingRunnable.run(CurrentBuildOperationPreservingRunnable.java:42)
at org.gradle.internal.concurrent.ExecutorPolicy$CatchAndRecordFailures.onExecute(ExecutorPolicy.java:64)
at org.gradle.internal.concurrent.ManagedExecutorImpl$1.run(ManagedExecutorImpl.java:48)
at java.util.concurrent.ThreadPoolExecutor.runWorker(ThreadPoolExecutor.java:1149)
at java.util.concurrent.ThreadPoolExecutor$Worker.run(ThreadPoolExecutor.java:624)
at java.lang.Thread.run(Thread.java:750)
A problem occurred starting process 'Gradle Test Executor 76'
org.gradle.process.internal.ExecException: A problem occurred starting process 'Gradle Test Executor 76'
at org.gradle.process.internal.DefaultExecHandle.execExceptionFor(DefaultExecHandle.java:241)
at org.gradle.process.internal.DefaultExecHandle.setEndStateInfo(DefaultExecHandle.java:218)
at org.gradle.process.internal.DefaultExecHandle.failed(DefaultExecHandle.java:369)
at org.gradle.process.internal.ExecHandleRunner.run(ExecHandleRunner.java:87)
at org.gradle.internal.operations.CurrentBuildOperationPreservingRunnable.run(CurrentBuildOperationPreservingRunnable.java:42)
at org.gradle.internal.concurrent.ExecutorPolicy$CatchAndRecordFailures.onExecute(ExecutorPolicy.java:64)
at org.gradle.internal.concurrent.ManagedExecutorImpl$1.run(ManagedExecutorImpl.java:48)
at java.util.concurrent.ThreadPoolExecutor.runWorker(ThreadPoolExecutor.java:1149)
at java.util.concurrent.ThreadPoolExecutor$Worker.run(ThreadPoolExecutor.java:624)
at java.lang.Thread.run(Thread.java:750)
Caused by: java.lang.IllegalStateException: Shutdown in progress
at java.lang.ApplicationShutdownHooks.add(ApplicationShutdownHooks.java:66)
at java.lang.Runtime.addShutdownHook(Runtime.java:211)
at org.gradle.process.internal.shutdown.ShutdownHooks.addShutdownHook(ShutdownHooks.java:31)
at org.gradle.process.internal.DefaultExecHandle.started(DefaultExecHandle.java:346)
at org.gradle.process.internal.ExecHandleRunner.run(ExecHandleRunner.java:73)
... 6 more
Remove shutdown hook failed
java.lang.IllegalStateException: Shutdown in progress
at java.lang.ApplicationShutdownHooks.remove(ApplicationShutdownHooks.java:82)
at java.lang.Runtime.removeShutdownHook(Runtime.java:239)
at org.gradle.process.internal.shutdown.ShutdownHooks.removeShutdownHook(ShutdownHooks.java:38)
at org.gradle.process.internal.DefaultExecHandle.setEndStateInfo(DefaultExecHandle.java:208)
at org.gradle.process.internal.DefaultExecHandle.failed(DefaultExecHandle.java:369)
at org.gradle.process.internal.ExecHandleRunner.run(ExecHandleRunner.java:87)
at org.gradle.internal.operations.CurrentBuildOperationPreservingRunnable.run(CurrentBuildOperationPreservingRunnable.java:42)
at org.gradle.internal.concurrent.ExecutorPolicy$CatchAndRecordFailures.onExecute(ExecutorPolicy.java:64)
at org.gradle.internal.concurrent.ManagedExecutorImpl$1.run(ManagedExecutorImpl.java:48)
at java.util.concurrent.ThreadPoolExecutor.runWorker(ThreadPoolExecutor.java:1149)
at java.util.concurrent.ThreadPoolExecutor$Worker.run(ThreadPoolExecutor.java:624)
at java.lang.Thread.run(Thread.java:750)
A problem occurred starting process 'Gradle Test Executor 77'
org.gradle.process.internal.ExecException: A problem occurred starting process 'Gradle Test Executor 77'
at org.gradle.process.internal.DefaultExecHandle.execExceptionFor(DefaultExecHandle.java:241)
at org.gradle.process.internal.DefaultExecHandle.setEndStateInfo(DefaultExecHandle.java:218)
at org.gradle.process.internal.DefaultExecHandle.failed(DefaultExecHandle.java:369)
at org.gradle.process.internal.ExecHandleRunner.run(ExecHandleRunner.java:87)
at org.gradle.internal.operations.CurrentBuildOperationPreservingRunnable.run(CurrentBuildOperationPreservingRunnable.java:42)
at org.gradle.internal.concurrent.ExecutorPolicy$CatchAndRecordFailures.onExecute(ExecutorPolicy.java:64)
at org.gradle.internal.concurrent.ManagedExecutorImpl$1.run(ManagedExecutorImpl.java:48)
at java.util.concurrent.ThreadPoolExecutor.runWorker(ThreadPoolExecutor.java:1149)
at java.util.concurrent.ThreadPoolExecutor$Worker.run(ThreadPoolExecutor.java:624)
at java.lang.Thread.run(Thread.java:750)
Caused by: java.lang.IllegalStateException: Shutdown in progress
at java.lang.ApplicationShutdownHooks.add(ApplicationShutdownHooks.java:66)
at java.lang.Runtime.addShutdownHook(Runtime.java:211)
at org.gradle.process.internal.shutdown.ShutdownHooks.addShutdownHook(ShutdownHooks.java:31)
at org.gradle.process.internal.DefaultExecHandle.started(DefaultExecHandle.java:346)
at org.gradle.process.internal.ExecHandleRunner.run(ExecHandleRunner.java:73)
... 6 more
A problem occurred starting process 'Gradle Test Executor 78'
org.gradle.process.internal.ExecException: A problem occurred starting process 'Gradle Test Executor 78'
at org.gradle.process.internal.DefaultExecHandle.execExceptionFor(DefaultExecHandle.java:241)
at org.gradle.process.internal.DefaultExecHandle.setEndStateInfo(DefaultExecHandle.java:218)
at org.gradle.process.internal.DefaultExecHandle.failed(DefaultExecHandle.java:369)
at org.gradle.process.internal.ExecHandleRunner.run(ExecHandleRunner.java:87)
at org.gradle.internal.operations.CurrentBuildOperationPreservingRunnable.run(CurrentBuildOperationPreservingRunnable.java:42)
at org.gradle.internal.concurrent.ExecutorPolicy$CatchAndRecordFailures.onExecute(ExecutorPolicy.java:64)
at org.gradle.internal.concurrent.ManagedExecutorImpl$1.run(ManagedExecutorImpl.java:48)
at java.util.concurrent.ThreadPoolExecutor.runWorker(ThreadPoolExecutor.java:1149)
at java.util.concurrent.ThreadPoolExecutor$Worker.run(ThreadPoolExecutor.java:624)
at java.lang.Thread.run(Thread.java:750)
Caused by: java.lang.IllegalStateException: Shutdown in progress
at java.lang.ApplicationShutdownHooks.add(ApplicationShutdownHooks.java:66)
at java.lang.Runtime.addShutdownHook(Runtime.java:211)
at org.gradle.process.internal.shutdown.ShutdownHooks.addShutdownHook(ShutdownHooks.java:31)
at org.gradle.process.internal.DefaultExecHandle.started(DefaultExecHandle.java:346)
at org.gradle.process.internal.ExecHandleRunner.run(ExecHandleRunner.java:73)
... 6 more
The message received from the daemon indicates that the daemon has disappeared.
Build request sent: Build{id=318960ff-17af-404b-ab7e-b6b6a5835ead, currentDir=<https://ci-beam.apache.org/job/beam_PostCommit_Java_Hadoop_Versions/ws/src}>
Attempting to read last messages from the daemon log...
Daemon pid: 2813763
log file: /home/jenkins/.gradle/daemon/7.4/daemon-2813763.out.log
----- Last 20 lines from daemon log file - daemon-2813763.out.log -----
at java.lang.Runtime.addShutdownHook(Runtime.java:211)
at org.gradle.process.internal.shutdown.ShutdownHooks.addShutdownHook(ShutdownHooks.java:31)
at org.gradle.process.internal.DefaultExecHandle.started(DefaultExecHandle.java:346)
at org.gradle.process.internal.ExecHandleRunner.run(ExecHandleRunner.java:73)
... 6 more
Remove shutdown hook failed
java.lang.IllegalStateException: Shutdown in progress
at java.lang.ApplicationShutdownHooks.remove(ApplicationShutdownHooks.java:82)
at java.lang.Runtime.removeShutdownHook(Runtime.java:239)
at org.gradle.process.internal.shutdown.ShutdownHooks.removeShutdownHook(ShutdownHooks.java:38)
at org.gradle.process.internal.DefaultExecHandle.setEndStateInfo(DefaultExecHandle.java:208)
at org.gradle.process.internal.DefaultExecHandle.aborted(DefaultExecHandle.java:365)
at org.gradle.process.internal.ExecHandleRunner.completed(ExecHandleRunner.java:108)
at org.gradle.process.internal.ExecHandleRunner.run(ExecHandleRunner.java:84)
at org.gradle.internal.operations.CurrentBuildOperationPreservingRunnable.run(CurrentBuildOperationPreservingRunnable.java:42)
at org.gradle.internal.concurrent.ExecutorPolicy$CatchAndRecordFailures.onExecute(ExecutorPolicy.java:64)
at org.gradle.internal.concurrent.ManagedExecutorImpl$1.run(ManagedExecutorImpl.java:48)
at java.util.concurrent.ThreadPoolExecutor.runWorker(ThreadPoolExecutor.java:1149)
at java.util.concurrent.ThreadPoolExecutor$Worker.run(ThreadPoolExecutor.java:624)
at java.lang.Thread.run(Thread.java:750)
----- End of the daemon log -----
FAILURE: Build failed with an exception.
* What went wrong:
Gradle build daemon disappeared unexpectedly (it may have been killed or may have crashed)
* Try:
> Run with --stacktrace option to get the stack trace.
> Run with --info or --debug option to get more log output.
> Run with --scan to get full insights.
* Get more help at https://help.gradle.org
> Task :runners:spark:3:hadoopVersion292Test
Remove shutdown hook failed
java.lang.IllegalStateException: Shutdown in progress
at java.lang.ApplicationShutdownHooks.remove(ApplicationShutdownHooks.java:82)
at java.lang.Runtime.removeShutdownHook(Runtime.java:239)
at org.gradle.process.internal.shutdown.ShutdownHooks.removeShutdownHook(ShutdownHooks.java:38)
at org.gradle.process.internal.DefaultExecHandle.setEndStateInfo(DefaultExecHandle.java:208)
at org.gradle.process.internal.DefaultExecHandle.aborted(DefaultExecHandle.java:365)
at org.gradle.process.internal.ExecHandleRunner.completed(ExecHandleRunner.java:108)
at org.gradle.process.internal.ExecHandleRunner.run(ExecHandleRunner.java:84)
at org.gradle.internal.operations.CurrentBuildOperationPreservingRunnable.run(CurrentBuildOperationPreservingRunnable.java:42)
at org.gradle.internal.concurrent.ExecutorPolicy$CatchAndRecordFailures.onExecute(ExecutorPolicy.java:64)
at org.gradle.internal.concurrent.ManagedExecutorImpl$1.run(ManagedExecutorImpl.java:48)
at java.util.concurrent.ThreadPoolExecutor.runWorker(ThreadPoolExecutor.java:1149)
at java.util.concurrent.ThreadPoolExecutor$Worker.run(ThreadPoolExecutor.java:624)
at java.lang.Thread.run(Thread.java:750)
Remove shutdown hook failed
java.lang.IllegalStateException: Shutdown in progress
at java.lang.ApplicationShutdownHooks.remove(ApplicationShutdownHooks.java:82)
at java.lang.Runtime.removeShutdownHook(Runtime.java:239)
at org.gradle.process.internal.shutdown.ShutdownHooks.removeShutdownHook(ShutdownHooks.java:38)
at org.gradle.process.internal.DefaultExecHandle.setEndStateInfo(DefaultExecHandle.java:208)
at org.gradle.process.internal.DefaultExecHandle.aborted(DefaultExecHandle.java:365)
at org.gradle.process.internal.ExecHandleRunner.completed(ExecHandleRunner.java:108)
at org.gradle.process.internal.ExecHandleRunner.run(ExecHandleRunner.java:84)
at org.gradle.internal.operations.CurrentBuildOperationPreservingRunnable.run(CurrentBuildOperationPreservingRunnable.java:42)
at org.gradle.internal.concurrent.ExecutorPolicy$CatchAndRecordFailures.onExecute(ExecutorPolicy.java:64)
at org.gradle.internal.concurrent.ManagedExecutorImpl$1.run(ManagedExecutorImpl.java:48)
at java.util.concurrent.ThreadPoolExecutor.runWorker(ThreadPoolExecutor.java:1149)
at java.util.concurrent.ThreadPoolExecutor$Worker.run(ThreadPoolExecutor.java:624)
at java.lang.Thread.run(Thread.java:750)
Remove shutdown hook failed
java.lang.IllegalStateException: Shutdown in progress
at java.lang.ApplicationShutdownHooks.remove(ApplicationShutdownHooks.java:82)
at java.lang.Runtime.removeShutdownHook(Runtime.java:239)
at org.gradle.process.internal.shutdown.ShutdownHooks.removeShutdownHook(ShutdownHooks.java:38)
at org.gradle.process.internal.DefaultExecHandle.setEndStateInfo(DefaultExecHandle.java:208)
at org.gradle.process.internal.DefaultExecHandle.aborted(DefaultExecHandle.java:365)
at org.gradle.process.internal.ExecHandleRunner.completed(ExecHandleRunner.java:108)
at org.gradle.process.internal.ExecHandleRunner.run(ExecHandleRunner.java:84)
at org.gradle.internal.operations.CurrentBuildOperationPreservingRunnable.run(CurrentBuildOperationPreservingRunnable.java:42)
at org.gradle.internal.concurrent.ExecutorPolicy$CatchAndRecordFailures.onExecute(ExecutorPolicy.java:64)
at org.gradle.internal.concurrent.ManagedExecutorImpl$1.run(ManagedExecutorImpl.java:48)
at java.util.concurrent.ThreadPoolExecutor.runWorker(ThreadPoolExecutor.java:1149)
at java.util.concurrent.ThreadPoolExecutor$Worker.run(ThreadPoolExecutor.java:624)
at java.lang.Thread.run(Thread.java:750)
> Task :sdks:java:io:parquet:hadoopVersion324Test
> Task :sdks:java:io:hadoop-format:runHadoopFormatIO285ElasticIT
Build step 'Invoke Gradle script' changed build result to FAILURE
Build step 'Invoke Gradle script' marked build as failure
---------------------------------------------------------------------
To unsubscribe, e-mail: builds-unsubscribe@beam.apache.org
For additional commands, e-mail: builds-help@beam.apache.org
Jenkins build is back to normal : beam_PostCommit_Java_Hadoop_Versions #2049
Posted by Apache Jenkins Server <je...@builds.apache.org>.
See <https://ci-beam.apache.org/job/beam_PostCommit_Java_Hadoop_Versions/2049/display/redirect?page=changes>
---------------------------------------------------------------------
To unsubscribe, e-mail: builds-unsubscribe@beam.apache.org
For additional commands, e-mail: builds-help@beam.apache.org