You are viewing a plain text version of this content. The canonical link for it is here.
Posted to builds@solr.apache.org by Apache Jenkins Server <je...@builds.apache.org> on 2026/08/04 01:31:18 UTC
[JENKINS] Solr » Solr-Test-main - Build # 14433 - Unstable!
Build: https://ci-builds.apache.org/job/Solr/job/Solr-Test-main/14433/
1 tests failed.
FAILED: org.apache.solr.cloud.RecoveryAfterSoftCommitTest.test
Error Message:
org.apache.solr.client.solrj.SolrServerException: java.nio.channels.ClosedChannelException
Stack Trace:
org.apache.solr.client.solrj.SolrServerException: java.nio.channels.ClosedChannelException
at __randomizedtesting.SeedInfo.seed([7F0119059EDD2515:F75526DF302148ED]:0)
at org.apache.solr.client.solrj.impl.LBSolrClient.doRequest(LBSolrClient.java:680)
at org.apache.solr.client.solrj.impl.LBSolrClient.request(LBSolrClient.java:582)
at org.apache.solr.client.solrj.impl.CloudSolrClient.sendRequest(CloudSolrClient.java:1088)
at org.apache.solr.client.solrj.impl.CloudSolrClient.requestWithRetryOnStaleState(CloudSolrClient.java:723)
at org.apache.solr.client.solrj.impl.CloudSolrClient.request(CloudSolrClient.java:645)
at org.apache.solr.client.solrj.SolrRequest.process(SolrRequest.java:314)
at org.apache.solr.client.solrj.SolrClient.add(SolrClient.java:167)
at org.apache.solr.client.solrj.SolrClient.add(SolrClient.java:132)
at org.apache.solr.client.solrj.SolrClient.add(SolrClient.java:148)
at org.apache.solr.cloud.RecoveryAfterSoftCommitTest.test(RecoveryAfterSoftCommitTest.java:106)
at java.base/jdk.internal.reflect.DirectMethodHandleAccessor.invoke(DirectMethodHandleAccessor.java:103)
at java.base/java.lang.reflect.Method.invoke(Method.java:580)
at com.carrotsearch.randomizedtesting.RandomizedRunner.invoke(RandomizedRunner.java:1780)
at com.carrotsearch.randomizedtesting.RandomizedRunner$8.evaluate(RandomizedRunner.java:959)
at com.carrotsearch.randomizedtesting.RandomizedRunner$9.evaluate(RandomizedRunner.java:995)
at com.carrotsearch.randomizedtesting.RandomizedRunner$10.evaluate(RandomizedRunner.java:1009)
at org.apache.solr.BaseDistributedSearchTestCase$ShardsRepeatRule$ShardsFixedStatement.callStatement(BaseDistributedSearchTestCase.java:1071)
at org.apache.solr.BaseDistributedSearchTestCase$ShardsRepeatRule$ShardsStatement.evaluate(BaseDistributedSearchTestCase.java:1042)
at com.carrotsearch.randomizedtesting.rules.SystemPropertiesRestoreRule$1.evaluate(SystemPropertiesRestoreRule.java:80)
at org.junit.rules.RunRules.evaluate(RunRules.java:20)
at org.apache.lucene.tests.util.TestRuleSetupTeardownChained$1.evaluate(TestRuleSetupTeardownChained.java:48)
at org.apache.lucene.tests.util.AbstractBeforeAfterRule$1.evaluate(AbstractBeforeAfterRule.java:43)
at org.apache.lucene.tests.util.TestRuleThreadAndTestName$1.evaluate(TestRuleThreadAndTestName.java:45)
at org.apache.lucene.tests.util.TestRuleIgnoreAfterMaxFailures$1.evaluate(TestRuleIgnoreAfterMaxFailures.java:60)
at org.apache.lucene.tests.util.TestRuleMarkFailure$1.evaluate(TestRuleMarkFailure.java:44)
at org.junit.rules.RunRules.evaluate(RunRules.java:20)
at com.carrotsearch.randomizedtesting.rules.StatementAdapter.evaluate(StatementAdapter.java:36)
at com.carrotsearch.randomizedtesting.ThreadLeakControl$StatementRunner.run(ThreadLeakControl.java:390)
at com.carrotsearch.randomizedtesting.ThreadLeakControl.forkTimeoutingTask(ThreadLeakControl.java:843)
at com.carrotsearch.randomizedtesting.ThreadLeakControl$3.evaluate(ThreadLeakControl.java:490)
at com.carrotsearch.randomizedtesting.RandomizedRunner.runSingleTest(RandomizedRunner.java:968)
at com.carrotsearch.randomizedtesting.RandomizedRunner$5.evaluate(RandomizedRunner.java:853)
at com.carrotsearch.randomizedtesting.RandomizedRunner$6.evaluate(RandomizedRunner.java:904)
at com.carrotsearch.randomizedtesting.RandomizedRunner$7.evaluate(RandomizedRunner.java:915)
at com.carrotsearch.randomizedtesting.rules.StatementAdapter.evaluate(StatementAdapter.java:36)
at com.carrotsearch.randomizedtesting.rules.StatementAdapter.evaluate(StatementAdapter.java:36)
at org.apache.lucene.tests.util.AbstractBeforeAfterRule$1.evaluate(AbstractBeforeAfterRule.java:43)
at com.carrotsearch.randomizedtesting.rules.SystemPropertiesRestoreRule$1.evaluate(SystemPropertiesRestoreRule.java:80)
at org.junit.rules.RunRules.evaluate(RunRules.java:20)
at org.apache.lucene.tests.util.AbstractBeforeAfterRule$1.evaluate(AbstractBeforeAfterRule.java:43)
at com.carrotsearch.randomizedtesting.rules.StatementAdapter.evaluate(StatementAdapter.java:36)
at org.apache.lucene.tests.util.TestRuleStoreClassName$1.evaluate(TestRuleStoreClassName.java:38)
at com.carrotsearch.randomizedtesting.rules.NoShadowingOrOverridesOnMethodsRule$1.evaluate(NoShadowingOrOverridesOnMethodsRule.java:40)
at com.carrotsearch.randomizedtesting.rules.NoShadowingOrOverridesOnMethodsRule$1.evaluate(NoShadowingOrOverridesOnMethodsRule.java:40)
at com.carrotsearch.randomizedtesting.rules.StatementAdapter.evaluate(StatementAdapter.java:36)
at com.carrotsearch.randomizedtesting.rules.StatementAdapter.evaluate(StatementAdapter.java:36)
at org.apache.lucene.tests.util.TestRuleAssertionsRequired$1.evaluate(TestRuleAssertionsRequired.java:53)
at org.apache.lucene.tests.util.AbstractBeforeAfterRule$1.evaluate(AbstractBeforeAfterRule.java:43)
at org.apache.lucene.tests.util.TestRuleMarkFailure$1.evaluate(TestRuleMarkFailure.java:44)
at org.apache.lucene.tests.util.TestRuleIgnoreAfterMaxFailures$1.evaluate(TestRuleIgnoreAfterMaxFailures.java:60)
at org.apache.lucene.tests.util.TestRuleIgnoreTestSuites$1.evaluate(TestRuleIgnoreTestSuites.java:47)
at org.junit.rules.RunRules.evaluate(RunRules.java:20)
at com.carrotsearch.randomizedtesting.rules.StatementAdapter.evaluate(StatementAdapter.java:36)
at com.carrotsearch.randomizedtesting.ThreadLeakControl$StatementRunner.run(ThreadLeakControl.java:390)
at com.carrotsearch.randomizedtesting.ThreadLeakControl.lambda$forkTimeoutingTask$0(ThreadLeakControl.java:850)
at java.base/java.lang.Thread.run(Thread.java:1583)
Caused by: java.nio.channels.ClosedChannelException
at org.eclipse.jetty.http2.HTTP2Session$StreamsState.onShutdown(HTTP2Session.java:2173)
at org.eclipse.jetty.http2.HTTP2Session.onShutdown(HTTP2Session.java:1206)
at org.eclipse.jetty.http2.HTTP2Connection$HTTP2Producer.produce(HTTP2Connection.java:441)
at org.eclipse.jetty.util.thread.strategy.AdaptiveExecutionStrategy.produceTask(AdaptiveExecutionStrategy.java:509)
at org.eclipse.jetty.util.thread.strategy.AdaptiveExecutionStrategy.tryProduce(AdaptiveExecutionStrategy.java:251)
at org.eclipse.jetty.util.thread.strategy.AdaptiveExecutionStrategy.produce(AdaptiveExecutionStrategy.java:196)
at org.eclipse.jetty.http2.HTTP2Connection.produce(HTTP2Connection.java:237)
at org.eclipse.jetty.http2.HTTP2Connection.onFillable(HTTP2Connection.java:165)
at org.eclipse.jetty.http2.HTTP2Connection$FillableCallback.succeeded(HTTP2Connection.java:592)
at org.eclipse.jetty.io.FillInterest.fillable(FillInterest.java:105)
at org.eclipse.jetty.io.SelectableChannelEndPoint$1.run(SelectableChannelEndPoint.java:54)
at org.eclipse.jetty.util.thread.Invocable.invokeNonBlocking(Invocable.java:225)
at org.eclipse.jetty.util.thread.strategy.AdaptiveExecutionStrategy.picRunTask(AdaptiveExecutionStrategy.java:473)
at org.eclipse.jetty.util.thread.strategy.AdaptiveExecutionStrategy.consumeTask(AdaptiveExecutionStrategy.java:399)
at org.eclipse.jetty.util.thread.strategy.AdaptiveExecutionStrategy.tryProduce(AdaptiveExecutionStrategy.java:255)
at org.eclipse.jetty.util.thread.strategy.AdaptiveExecutionStrategy.produce(AdaptiveExecutionStrategy.java:196)
at org.apache.solr.common.util.ExecutorUtil$MDCAwareThreadPoolExecutor.lambda$execute$0(ExecutorUtil.java:390)
at java.base/java.util.concurrent.ThreadPoolExecutor.runWorker(ThreadPoolExecutor.java:1144)
at java.base/java.util.concurrent.ThreadPoolExecutor$Worker.run(ThreadPoolExecutor.java:642)
... 1 more
Build Log:
[...truncated 11 lines...]
ERROR: Workspace has a .git repository, but it appears to be corrupt.
hudson.plugins.git.GitException: Command "git rev-parse --resolve-git-dir /home/jenkins/jenkins-agent/workspace/Solr/Solr-Test-main/.git" returned status code 128:
stdout:
stderr: fatal: not a gitdir '/home/jenkins/jenkins-agent/workspace/Solr/Solr-Test-main/.git'
at PluginClassLoader for git-client//org.jenkinsci.plugins.gitclient.CliGitAPIImpl.launchCommandIn(CliGitAPIImpl.java:2848)
at PluginClassLoader for git-client//org.jenkinsci.plugins.gitclient.CliGitAPIImpl.launchCommandIn(CliGitAPIImpl.java:2768)
at PluginClassLoader for git-client//org.jenkinsci.plugins.gitclient.CliGitAPIImpl.launchCommandIn(CliGitAPIImpl.java:2763)
at PluginClassLoader for git-client//org.jenkinsci.plugins.gitclient.CliGitAPIImpl.launchCommand(CliGitAPIImpl.java:2052)
at PluginClassLoader for git-client//org.jenkinsci.plugins.gitclient.CliGitAPIImpl.launchCommand(CliGitAPIImpl.java:2064)
at PluginClassLoader for git-client//org.jenkinsci.plugins.gitclient.CliGitAPIImpl.hasGitRepo(CliGitAPIImpl.java:404)
at PluginClassLoader for git-client//hudson.plugins.git.GitAPI.hasGitRepo(GitAPI.java:281)
at jdk.internal.reflect.GeneratedMethodAccessor78.invoke(Unknown Source)
at java.base/jdk.internal.reflect.DelegatingMethodAccessorImpl.invoke(DelegatingMethodAccessorImpl.java:43)
at java.base/java.lang.reflect.Method.invoke(Method.java:569)
at hudson.remoting.RemoteInvocationHandler$RPCRequest.perform(RemoteInvocationHandler.java:986)
at hudson.remoting.RemoteInvocationHandler$RPCRequest.call(RemoteInvocationHandler.java:961)
at hudson.remoting.RemoteInvocationHandler$RPCRequest.call(RemoteInvocationHandler.java:907)
at hudson.remoting.UserRequest.perform(UserRequest.java:225)
at hudson.remoting.UserRequest.perform(UserRequest.java:50)
at hudson.remoting.Request$2.run(Request.java:391)
at hudson.remoting.InterceptingExecutorService.lambda$wrap$0(InterceptingExecutorService.java:81)
at java.base/java.util.concurrent.FutureTask.run(FutureTask.java:264)
at java.base/java.util.concurrent.ThreadPoolExecutor.runWorker(ThreadPoolExecutor.java:1136)
at java.base/java.util.concurrent.ThreadPoolExecutor$Worker.run(ThreadPoolExecutor.java:635)
at java.base/java.lang.Thread.run(Thread.java:840)
Cloning the remote Git repository
Cloning repository https://gitbox.apache.org/repos/asf/solr.git
> git init /home/jenkins/jenkins-agent/workspace/Solr/Solr-Test-main # timeout=10
Fetching upstream changes from https://gitbox.apache.org/repos/asf/solr.git
> git --version # timeout=10
> git --version # 'git version 2.43.0'
> git fetch --tags --force --progress -- https://gitbox.apache.org/repos/asf/solr.git +refs/heads/*:refs/remotes/origin/* # timeout=10
> git config remote.origin.url https://gitbox.apache.org/repos/asf/solr.git # timeout=10
> git config --add remote.origin.fetch +refs/heads/*:refs/remotes/origin/* # timeout=10
Avoid second fetch
> git rev-parse refs/remotes/origin/main^{commit} # timeout=10
Checking out Revision 09fd8d206d758d183d598aab4fa5032c126ee22c (refs/remotes/origin/main)
> git config core.sparsecheckout # timeout=10
> git checkout -f 09fd8d206d758d183d598aab4fa5032c126ee22c # timeout=10
> git branch -a -v --no-abbrev # timeout=10
> git checkout -b main 09fd8d206d758d183d598aab4fa5032c126ee22c # timeout=10
Commit message: "Changelog attribution for #4607"
> git rev-list --no-walk f67f471340129e9ae4920e03998ecb383ff13b79 # timeout=10
No emails were triggered.
provisioning config files...
copy managed file [gradle.properties] to file:/home/jenkins/jenkins-agent/workspace/Solr/Solr-Test-main/gradle.properties
[Gradle] - Launching build.
[Solr-Test-main] $ /home/jenkins/jenkins-agent/workspace/Solr/Solr-Test-main/gradlew -Dtests.haltonfailure=false -Dtests.badapples=false --continue test
Downloading gradle-wrapper.jar from https://raw.githubusercontent.com/gradle/gradle/v8.10.2/gradle/wrapper/gradle-wrapper.jar
To honour the JVM settings for this build a single-use Daemon process will be forked. For more on this, please refer to https://docs.gradle.org/9.6.0/userguide/gradle_daemon.html#sec:disabling_the_daemon in the Gradle documentation.
Daemon will be stopped at the end of the build
> Task :build-infra:compileJava
Note: /home/jenkins/jenkins-agent/workspace/Solr/Solr-Test-main/build-tools/build-infra/src/main/java/org/apache/lucene/gradle/Checksum.java uses or overrides a deprecated API.
Note: Recompile with -Xlint:deprecation for details.
> Task :build-infra:pluginDescriptors
> Task :build-infra:processResources
> Task :build-infra:classes
> Task :build-infra:jar
> Task :gitStatus
> Task :checkJdkInternalsExportedToGradle
> Task :solr:api:compileJava
Note: Some input files use or override a deprecated API.
Note: Recompile with -Xlint:deprecation for details.
> Task :solr:api:processResources NO-SOURCE
> Task :solr:api:classes
> Task :solr:api:jar
> Task :randomizationInfo
Running tests with randomization seed: tests.seed=7F0119059EDD2515
> Task :solr:api:resolve
SLF4J(W): No SLF4J providers were found.
SLF4J(W): Defaulting to no-operation (NOP) logger implementation
SLF4J(W): See https://www.slf4j.org/codes.html#noProviders for further details.
> Task :solr:api:processTestResources
> Task :solr:core:processResources
> Task :solr:solrj:processResources
> Task :solr:solrj-jetty:processResources NO-SOURCE
> Task :solr:solrj-streaming:processResources
> Task :solr:solrj-zookeeper:processResources NO-SOURCE
> Task :solr:test-framework:processResources
> Task :solr:benchmark:processResources
> Task :solr:benchmark:processTestResources
> Task :solr:core:processTestResources
> Task :solr:modules:analysis-extras:processResources NO-SOURCE
> Task :solr:cross-dc-manager:processResources NO-SOURCE
> Task :solr:cross-dc-manager:processTestResources
> Task :solr:modules:cross-dc:processResources NO-SOURCE
> Task :solr:modules:opentelemetry:processResources NO-SOURCE
> Task :solr:server:compileJava SKIPPED
> Task :solr:server:processResources NO-SOURCE
> Task :solr:server:classes UP-TO-DATE
> Task :solr:server:compileTestJava NO-SOURCE
> Task :solr:server:processTestResources NO-SOURCE
> Task :solr:server:testClasses UP-TO-DATE
> Task :solr:server:test NO-SOURCE
> Task :solr:server:wipeTaskTemp
> Task :solr:solr-ref-guide:compileJava NO-SOURCE
> Task :solr:solr-ref-guide:processResources NO-SOURCE
> Task :solr:solr-ref-guide:classes UP-TO-DATE
> Task :solr:solr-ref-guide:copySolrjTestResources
> Task :solr:solr-ref-guide:processTestResources NO-SOURCE
> Task :solr:modules:sql:processResources
> Task :solr:solrj:processTestResources
> Task :solr:solrj-jetty:processTestResources
> Task :solr:solrj-streaming:processTestResources
> Task :solr:solrj-zookeeper:processTestResources
> Task :solr:test-framework:processTestResources
> Task :solr:webapp:processResources NO-SOURCE
> Task :solr:webapp:processTestResources NO-SOURCE
> Task :solr:modules:analysis-extras:processTestResources
> Task :solr:modules:clustering:processResources NO-SOURCE
> Task :solr:modules:clustering:processTestResources
> Task :solr:modules:cross-dc:processTestResources
> Task :solr:modules:cuvs:processResources NO-SOURCE
> Task :solr:modules:cuvs:processTestResources
> Task :solr:modules:extraction:processResources
> Task :solr:modules:extraction:processTestResources
> Task :solr:modules:gcs-repository:processResources NO-SOURCE
> Task :solr:modules:gcs-repository:processTestResources
> Task :solr:modules:jwt-auth:processResources NO-SOURCE
> Task :solr:modules:jwt-auth:processTestResources
> Task :solr:modules:langid:processResources NO-SOURCE
> Task :solr:modules:langid:processTestResources
> Task :solr:modules:language-models:processResources NO-SOURCE
> Task :solr:modules:language-models:processTestResources
> Task :solr:modules:ltr:processResources NO-SOURCE
> Task :solr:modules:ltr:processTestResources
> Task :solr:modules:opentelemetry:processTestResources
> Task :solr:modules:s3-repository:processResources NO-SOURCE
> Task :solr:modules:s3-repository:processTestResources
> Task :solr:modules:scripting:processResources NO-SOURCE
> Task :solr:modules:scripting:processTestResources
> Task :solr:modules:sql:copySolrCoreTestResources
> Task :solr:modules:sql:processTestResources
> Task :solr:solrj:openApiGenerate
Cleaned up output directory /home/jenkins/jenkins-agent/workspace/Solr/Solr-Test-main/solr/solrj/build/generated before code generation.
[openApiGenerate] Worker isolation: classloader (fast startup, but generator classes accumulate in Gradle daemon Metaspace - consider workerIsolation = "process" if you hit metaspace pressure)
No application/json content media type found in response. Response examples can currently only be generated for application/json media type.
############################################################################################
# Thanks for using OpenAPI Generator. #
# We appreciate your support! Please consider donation to help us maintain this project. #
# https://opencollective.com/openapi_generator/donate #
############################################################################################
Successfully generated code to /home/jenkins/jenkins-agent/workspace/Solr/Solr-Test-main/solr/solrj/build/generated
> Task :solr:solrj:generatedSpotlessHelper
> Task :solr:solrj:generatedSpotless
> Task :solr:solrj:compileJava
Note: Some input files use or override a deprecated API.
Note: Recompile with -Xlint:deprecation for details.
> Task :solr:solrj-jetty:compileJava
Note: /home/jenkins/jenkins-agent/workspace/Solr/Solr-Test-main/solr/solrj-jetty/src/java/org/apache/solr/client/solrj/jetty/HttpJettySolrClient.java uses or overrides a deprecated API.
Note: Recompile with -Xlint:deprecation for details.
> Task :solr:solrj-streaming:compileJava
Note: Some input files use or override a deprecated API.
Note: Recompile with -Xlint:deprecation for details.
> Task :solr:solrj-zookeeper:compileJava
Note: Some input files use or override a deprecated API.
Note: Recompile with -Xlint:deprecation for details.
> Task :solr:core:compileJava
Note: Some input files use or override a deprecated API.
Note: Recompile with -Xlint:deprecation for details.
> Task :solr:test-framework:compileJava
Note: Some input files use or override a deprecated API.
Note: Recompile with -Xlint:deprecation for details.
> Task :solr:api:compileTestJava
> Task :solr:api:testClasses
> Task :solr:core:classes
> Task :solr:core:jar
> Task :solr:solrj:classes
> Task :solr:solrj:jar
> Task :solr:solrj-jetty:classes
> Task :solr:solrj-jetty:jar
> Task :solr:solrj-streaming:classes
> Task :solr:solrj-streaming:jar
> Task :solr:solrj-zookeeper:classes
> Task :solr:solrj-zookeeper:jar
> Task :solr:test-framework:classes
> Task :solr:test-framework:jar
> Task :solr:api:test
WARNING: Using incubator modules: jdk.incubator.vector
WARNING: Using incubator modules: jdk.incubator.vector
WARNING: A command line option has enabled the Security Manager
WARNING: The Security Manager is deprecated and will be removed in a future release
WARNING: A command line option has enabled the Security Manager
WARNING: The Security Manager is deprecated and will be removed in a future release
java.security.policy: error adding Permission, java.net.URLPermission:
java.util.ServiceConfigurationError: Locale provider adapter "CLDR"cannot be instantiated.
java.security.policy: error adding Permission, java.net.URLPermission:
java.util.ServiceConfigurationError: Locale provider adapter "CLDR"cannot be instantiated.
java.security.policy: error adding Permission, java.net.URLPermission:
java.util.ServiceConfigurationError: Locale provider adapter "CLDR"cannot be instantiated.
java.security.policy: error adding Permission, java.net.URLPermission:
java.util.ServiceConfigurationError: Locale provider adapter "CLDR"cannot be instantiated.
java.security.policy: error adding Permission, java.net.URLPermission:
java.util.ServiceConfigurationError: Locale provider adapter "CLDR"cannot be instantiated.
java.security.policy: error adding Permission, java.net.URLPermission:
java.util.ServiceConfigurationError: Locale provider adapter "CLDR"cannot be instantiated.
java.security.policy: error adding Permission, java.net.URLPermission:
java.util.ServiceConfigurationError: Locale provider adapter "CLDR"cannot be instantiated.
java.security.policy: error adding Permission, java.net.URLPermission:
java.util.ServiceConfigurationError: Locale provider adapter "CLDR"cannot be instantiated.
java.security.policy: error adding Permission, java.net.URLPermission:
java.util.ServiceConfigurationError: Locale provider adapter "CLDR"cannot be instantiated.
java.security.policy: error adding Permission, java.net.URLPermission:
java.util.ServiceConfigurationError: Locale provider adapter "CLDR"cannot be instantiated.
:solr:api:test (SUCCESS): 19 test(s)
> Task :solr:api:wipeTaskTemp
> Task :solr:benchmark:compileJava
Note: /home/jenkins/jenkins-agent/workspace/Solr/Solr-Test-main/solr/benchmark/src/java/org/apache/solr/bench/lifecycle/SolrStartup.java uses or overrides a deprecated API.
Note: Recompile with -Xlint:deprecation for details.
> Task :solr:benchmark:classes
> Task :solr:benchmark:compileTestJava
> Task :solr:benchmark:testClasses
> Task :solr:benchmark:test
WARNING: Using incubator modules: jdk.incubator.vector
WARNING: Using incubator modules: jdk.incubator.vector
WARNING: Using incubator modules: jdk.incubator.vector
WARNING: A command line option has enabled the Security Manager
WARNING: The Security Manager is deprecated and will be removed in a future release
WARNING: A command line option has enabled the Security Manager
WARNING: The Security Manager is deprecated and will be removed in a future release
WARNING: A command line option has enabled the Security Manager
WARNING: The Security Manager is deprecated and will be removed in a future release
java.security.policy: error adding Permission, java.net.URLPermission:
java.util.ServiceConfigurationError: Locale provider adapter "CLDR"cannot be instantiated.
java.security.policy: error adding Permission, java.net.URLPermission:
java.util.ServiceConfigurationError: Locale provider adapter "CLDR"cannot be instantiated.
java.security.policy: error adding Permission, java.net.URLPermission:
java.util.ServiceConfigurationError: Locale provider adapter "CLDR"cannot be instantiated.
java.security.policy: error adding Permission, java.net.URLPermission:
java.util.ServiceConfigurationError: Locale provider adapter "CLDR"cannot be instantiated.
java.security.policy: error adding Permission, java.net.URLPermission:
java.util.ServiceConfigurationError: Locale provider adapter "CLDR"cannot be instantiated.
java.security.policy: error adding Permission, java.net.URLPermission:
java.util.ServiceConfigurationError: Locale provider adapter "CLDR"cannot be instantiated.
java.security.policy: error adding Permission, java.net.URLPermission:
java.util.ServiceConfigurationError: Locale provider adapter "CLDR"cannot be instantiated.
java.security.policy: error adding Permission, java.net.URLPermission:
java.util.ServiceConfigurationError: Locale provider adapter "CLDR"cannot be instantiated.
java.security.policy: error adding Permission, java.net.URLPermission:
java.util.ServiceConfigurationError: Locale provider adapter "CLDR"cannot be instantiated.
java.security.policy: error adding Permission, java.net.URLPermission:
java.util.ServiceConfigurationError: Locale provider adapter "CLDR"cannot be instantiated.
java.security.policy: error adding Permission, java.net.URLPermission:
java.util.ServiceConfigurationError: Locale provider adapter "CLDR"cannot be instantiated.
java.security.policy: error adding Permission, java.net.URLPermission:
java.util.ServiceConfigurationError: Locale provider adapter "CLDR"cannot be instantiated.
java.security.policy: error adding Permission, java.net.URLPermission:
java.util.ServiceConfigurationError: Locale provider adapter "CLDR"cannot be instantiated.
java.security.policy: error adding Permission, java.net.URLPermission:
java.util.ServiceConfigurationError: Locale provider adapter "CLDR"cannot be instantiated.
java.security.policy: error adding Permission, java.net.URLPermission:
java.util.ServiceConfigurationError: Locale provider adapter "CLDR"cannot be instantiated.
:solr:benchmark:test (SUCCESS): 10 test(s)
> Task :solr:benchmark:wipeTaskTemp
> Task :solr:core:compileTestJava
Note: Some input files use or override a deprecated API.
Note: Recompile with -Xlint:deprecation for details.
> Task :solr:core:testClasses
> Task :solr:modules:analysis-extras:compileJava
Note: /home/jenkins/jenkins-agent/workspace/Solr/Solr-Test-main/solr/modules/analysis-extras/src/java/org/apache/solr/schema/ICUCollationField.java uses or overrides a deprecated API.
Note: Recompile with -Xlint:deprecation for details.
> Task :solr:modules:analysis-extras:classes
> Task :solr:modules:analysis-extras:jar
> Task :solr:core:test
WARNING: Using incubator modules: jdk.incubator.vector
WARNING: Using incubator modules: jdk.incubator.vector
WARNING: Using incubator modules: jdk.incubator.vector
WARNING: Using incubator modules: jdk.incubator.vector
WARNING: A command line option has enabled the Security Manager
WARNING: The Security Manager is deprecated and will be removed in a future release
WARNING: A command line option has enabled the Security Manager
WARNING: The Security Manager is deprecated and will be removed in a future release
WARNING: A command line option has enabled the Security Manager
WARNING: The Security Manager is deprecated and will be removed in a future release
WARNING: A command line option has enabled the Security Manager
WARNING: The Security Manager is deprecated and will be removed in a future release
java.security.policy: error adding Permission, java.net.URLPermission:
java.util.ServiceConfigurationError: Locale provider adapter "CLDR"cannot be instantiated.
java.security.policy: error adding Permission, java.net.URLPermission:
java.util.ServiceConfigurationError: Locale provider adapter "CLDR"cannot be instantiated.
java.security.policy: error adding Permission, java.net.URLPermission:
java.util.ServiceConfigurationError: Locale provider adapter "CLDR"cannot be instantiated.
java.security.policy: error adding Permission, java.net.URLPermission:
java.util.ServiceConfigurationError: Locale provider adapter "CLDR"cannot be instantiated.
java.security.policy: error adding Permission, java.net.URLPermission:
java.util.ServiceConfigurationError: Locale provider adapter "CLDR"cannot be instantiated.
java.security.policy: error adding Permission, java.net.URLPermission:
java.util.ServiceConfigurationError: Locale provider adapter "CLDR"cannot be instantiated.
java.security.policy: error adding Permission, java.net.URLPermission:
java.util.ServiceConfigurationError: Locale provider adapter "CLDR"cannot be instantiated.
java.security.policy: error adding Permission, java.net.URLPermission:
java.util.ServiceConfigurationError: Locale provider adapter "CLDR"cannot be instantiated.
java.security.policy: error adding Permission, java.net.URLPermission:
java.util.ServiceConfigurationError: Locale provider adapter "CLDR"cannot be instantiated.
java.security.policy: error adding Permission, java.net.URLPermission:
java.util.ServiceConfigurationError: Locale provider adapter "CLDR"cannot be instantiated.
java.security.policy: error adding Permission, java.net.URLPermission:
java.util.ServiceConfigurationError: Locale provider adapter "CLDR"cannot be instantiated.
java.security.policy: error adding Permission, java.net.URLPermission:
java.security.policy: error adding Permission, java.net.URLPermission:
java.util.ServiceConfigurationError: Locale provider adapter "CLDR"cannot be instantiated.
java.util.ServiceConfigurationError: Locale provider adapter "CLDR"cannot be instantiated.
java.security.policy: error adding Permission, java.net.URLPermission:
java.util.ServiceConfigurationError: Locale provider adapter "CLDR"cannot be instantiated.
java.security.policy: error adding Permission, java.net.URLPermission:
java.util.ServiceConfigurationError: Locale provider adapter "CLDR"cannot be instantiated.
java.security.policy: error adding Permission, java.net.URLPermission:
java.util.ServiceConfigurationError: Locale provider adapter "CLDR"cannot be instantiated.
java.security.policy: error adding Permission, java.net.URLPermission:
java.util.ServiceConfigurationError: Locale provider adapter "CLDR"cannot be instantiated.
java.security.policy: error adding Permission, java.net.URLPermission:
java.util.ServiceConfigurationError: Locale provider adapter "CLDR"cannot be instantiated.
java.security.policy: error adding Permission, java.net.URLPermission:
java.util.ServiceConfigurationError: Locale provider adapter "CLDR"cannot be instantiated.
java.security.policy: error adding Permission, java.net.URLPermission:
java.util.ServiceConfigurationError: Locale provider adapter "CLDR"cannot be instantiated.
WARNING: Test org.apache.solr.TestRandomFaceting wrote 22,348,528 bytes of output.
RecoveryAfterSoftCommitTest > test FAILED
org.apache.solr.client.solrj.SolrServerException: java.nio.channels.ClosedChannelException
at __randomizedtesting.SeedInfo.seed([7F0119059EDD2515:F75526DF302148ED]:0)
at app//org.apache.solr.client.solrj.impl.LBSolrClient.doRequest(LBSolrClient.java:680)
at app//org.apache.solr.client.solrj.impl.LBSolrClient.request(LBSolrClient.java:582)
at app//org.apache.solr.client.solrj.impl.CloudSolrClient.sendRequest(CloudSolrClient.java:1088)
at app//org.apache.solr.client.solrj.impl.CloudSolrClient.requestWithRetryOnStaleState(CloudSolrClient.java:723)
at app//org.apache.solr.client.solrj.impl.CloudSolrClient.request(CloudSolrClient.java:645)
at app//org.apache.solr.client.solrj.SolrRequest.process(SolrRequest.java:314)
at app//org.apache.solr.client.solrj.SolrClient.add(SolrClient.java:167)
at app//org.apache.solr.client.solrj.SolrClient.add(SolrClient.java:132)
at app//org.apache.solr.client.solrj.SolrClient.add(SolrClient.java:148)
at app//org.apache.solr.cloud.RecoveryAfterSoftCommitTest.test(RecoveryAfterSoftCommitTest.java:106)
at java.base@21.0.4/jdk.internal.reflect.DirectMethodHandleAccessor.invoke(DirectMethodHandleAccessor.java:103)
at java.base@21.0.4/java.lang.reflect.Method.invoke(Method.java:580)
at app//com.carrotsearch.randomizedtesting.RandomizedRunner.invoke(RandomizedRunner.java:1780)
at app//com.carrotsearch.randomizedtesting.RandomizedRunner$8.evaluate(RandomizedRunner.java:959)
at app//com.carrotsearch.randomizedtesting.RandomizedRunner$9.evaluate(RandomizedRunner.java:995)
at app//com.carrotsearch.randomizedtesting.RandomizedRunner$10.evaluate(RandomizedRunner.java:1009)
at app//org.apache.solr.BaseDistributedSearchTestCase$ShardsRepeatRule$ShardsFixedStatement.callStatement(BaseDistributedSearchTestCase.java:1071)
at app//org.apache.solr.BaseDistributedSearchTestCase$ShardsRepeatRule$ShardsStatement.evaluate(BaseDistributedSearchTestCase.java:1042)
at app//com.carrotsearch.randomizedtesting.rules.SystemPropertiesRestoreRule$1.evaluate(SystemPropertiesRestoreRule.java:80)
at app//org.junit.rules.RunRules.evaluate(RunRules.java:20)
at app//org.apache.lucene.tests.util.TestRuleSetupTeardownChained$1.evaluate(TestRuleSetupTeardownChained.java:48)
at app//org.apache.lucene.tests.util.AbstractBeforeAfterRule$1.evaluate(AbstractBeforeAfterRule.java:43)
at app//org.apache.lucene.tests.util.TestRuleThreadAndTestName$1.evaluate(TestRuleThreadAndTestName.java:45)
at app//org.apache.lucene.tests.util.TestRuleIgnoreAfterMaxFailures$1.evaluate(TestRuleIgnoreAfterMaxFailures.java:60)
at app//org.apache.lucene.tests.util.TestRuleMarkFailure$1.evaluate(TestRuleMarkFailure.java:44)
at app//org.junit.rules.RunRules.evaluate(RunRules.java:20)
at app//com.carrotsearch.randomizedtesting.rules.StatementAdapter.evaluate(StatementAdapter.java:36)
at app//com.carrotsearch.randomizedtesting.ThreadLeakControl$StatementRunner.run(ThreadLeakControl.java:390)
at app//com.carrotsearch.randomizedtesting.ThreadLeakControl.forkTimeoutingTask(ThreadLeakControl.java:843)
at app//com.carrotsearch.randomizedtesting.ThreadLeakControl$3.evaluate(ThreadLeakControl.java:490)
at app//com.carrotsearch.randomizedtesting.RandomizedRunner.runSingleTest(RandomizedRunner.java:968)
at app//com.carrotsearch.randomizedtesting.RandomizedRunner$5.evaluate(RandomizedRunner.java:853)
at app//com.carrotsearch.randomizedtesting.RandomizedRunner$6.evaluate(RandomizedRunner.java:904)
at app//com.carrotsearch.randomizedtesting.RandomizedRunner$7.evaluate(RandomizedRunner.java:915)
at app//com.carrotsearch.randomizedtesting.rules.StatementAdapter.evaluate(StatementAdapter.java:36)
at app//com.carrotsearch.randomizedtesting.rules.StatementAdapter.evaluate(StatementAdapter.java:36)
at app//org.apache.lucene.tests.util.AbstractBeforeAfterRule$1.evaluate(AbstractBeforeAfterRule.java:43)
at app//com.carrotsearch.randomizedtesting.rules.SystemPropertiesRestoreRule$1.evaluate(SystemPropertiesRestoreRule.java:80)
at app//org.junit.rules.RunRules.evaluate(RunRules.java:20)
at app//org.apache.lucene.tests.util.AbstractBeforeAfterRule$1.evaluate(AbstractBeforeAfterRule.java:43)
at app//com.carrotsearch.randomizedtesting.rules.StatementAdapter.evaluate(StatementAdapter.java:36)
at app//org.apache.lucene.tests.util.TestRuleStoreClassName$1.evaluate(TestRuleStoreClassName.java:38)
at app//com.carrotsearch.randomizedtesting.rules.NoShadowingOrOverridesOnMethodsRule$1.evaluate(NoShadowingOrOverridesOnMethodsRule.java:40)
at app//com.carrotsearch.randomizedtesting.rules.NoShadowingOrOverridesOnMethodsRule$1.evaluate(NoShadowingOrOverridesOnMethodsRule.java:40)
at app//com.carrotsearch.randomizedtesting.rules.StatementAdapter.evaluate(StatementAdapter.java:36)
at app//com.carrotsearch.randomizedtesting.rules.StatementAdapter.evaluate(StatementAdapter.java:36)
at app//org.apache.lucene.tests.util.TestRuleAssertionsRequired$1.evaluate(TestRuleAssertionsRequired.java:53)
at app//org.apache.lucene.tests.util.AbstractBeforeAfterRule$1.evaluate(AbstractBeforeAfterRule.java:43)
at app//org.apache.lucene.tests.util.TestRuleMarkFailure$1.evaluate(TestRuleMarkFailure.java:44)
at app//org.apache.lucene.tests.util.TestRuleIgnoreAfterMaxFailures$1.evaluate(TestRuleIgnoreAfterMaxFailures.java:60)
at app//org.apache.lucene.tests.util.TestRuleIgnoreTestSuites$1.evaluate(TestRuleIgnoreTestSuites.java:47)
at app//org.junit.rules.RunRules.evaluate(RunRules.java:20)
at app//com.carrotsearch.randomizedtesting.rules.StatementAdapter.evaluate(StatementAdapter.java:36)
at app//com.carrotsearch.randomizedtesting.ThreadLeakControl$StatementRunner.run(ThreadLeakControl.java:390)
at app//com.carrotsearch.randomizedtesting.ThreadLeakControl.lambda$forkTimeoutingTask$0(ThreadLeakControl.java:850)
at java.base@21.0.4/java.lang.Thread.run(Thread.java:1583)
Caused by:
java.nio.channels.ClosedChannelException
at org.eclipse.jetty.http2.HTTP2Session$StreamsState.onShutdown(HTTP2Session.java:2173)
at org.eclipse.jetty.http2.HTTP2Session.onShutdown(HTTP2Session.java:1206)
at org.eclipse.jetty.http2.HTTP2Connection$HTTP2Producer.produce(HTTP2Connection.java:441)
at org.eclipse.jetty.util.thread.strategy.AdaptiveExecutionStrategy.produceTask(AdaptiveExecutionStrategy.java:509)
at org.eclipse.jetty.util.thread.strategy.AdaptiveExecutionStrategy.tryProduce(AdaptiveExecutionStrategy.java:251)
at org.eclipse.jetty.util.thread.strategy.AdaptiveExecutionStrategy.produce(AdaptiveExecutionStrategy.java:196)
at org.eclipse.jetty.http2.HTTP2Connection.produce(HTTP2Connection.java:237)
at org.eclipse.jetty.http2.HTTP2Connection.onFillable(HTTP2Connection.java:165)
at org.eclipse.jetty.http2.HTTP2Connection$FillableCallback.succeeded(HTTP2Connection.java:592)
at org.eclipse.jetty.io.FillInterest.fillable(FillInterest.java:105)
at org.eclipse.jetty.io.SelectableChannelEndPoint$1.run(SelectableChannelEndPoint.java:54)
at org.eclipse.jetty.util.thread.Invocable.invokeNonBlocking(Invocable.java:225)
at org.eclipse.jetty.util.thread.strategy.AdaptiveExecutionStrategy.picRunTask(AdaptiveExecutionStrategy.java:473)
at org.eclipse.jetty.util.thread.strategy.AdaptiveExecutionStrategy.consumeTask(AdaptiveExecutionStrategy.java:399)
at org.eclipse.jetty.util.thread.strategy.AdaptiveExecutionStrategy.tryProduce(AdaptiveExecutionStrategy.java:255)
at org.eclipse.jetty.util.thread.strategy.AdaptiveExecutionStrategy.produce(AdaptiveExecutionStrategy.java:196)
at org.apache.solr.common.util.ExecutorUtil$MDCAwareThreadPoolExecutor.lambda$execute$0(ExecutorUtil.java:390)
at java.base/java.util.concurrent.ThreadPoolExecutor.runWorker(ThreadPoolExecutor.java:1144)
at java.base/java.util.concurrent.ThreadPoolExecutor$Worker.run(ThreadPoolExecutor.java:642)
... 1 more
org.apache.solr.cloud.RecoveryAfterSoftCommitTest > test suite's output saved to /home/jenkins/jenkins-agent/workspace/Solr/Solr-Test-main/solr/core/build/test-results/test/outputs/OUTPUT-org.apache.solr.cloud.RecoveryAfterSoftCommitTest.txt, copied below:
2> 205262 INFO (SUITE-RecoveryAfterSoftCommitTest-seed#[7F0119059EDD2515]-worker) [] o.a.s.SolrTestCase Setting 'solr.configset.default.confdir' system property to test-framework derived value of '/home/jenkins/jenkins-agent/workspace/Solr/Solr-Test-main/solr/server/solr/configsets/_default/conf'
2> 205263 INFO (SUITE-RecoveryAfterSoftCommitTest-seed#[7F0119059EDD2515]-worker) [] o.a.s.u.ErrorLogMuter Closing ErrorLogMuter-regex-71 after muting 0 log messages
2> 205263 INFO (SUITE-RecoveryAfterSoftCommitTest-seed#[7F0119059EDD2515]-worker) [] o.a.s.u.ErrorLogMuter Creating ErrorLogMuter-regex-72 for ERROR logs matching regex: ignore_exception
2> 205264 INFO (SUITE-RecoveryAfterSoftCommitTest-seed#[7F0119059EDD2515]-worker) [] o.a.s.SolrTestCaseJ4 Created dataDir: /home/jenkins/jenkins-agent/workspace/Solr/Solr-Test-main/solr/core/build/tmp/tests-tmp/org.apache.solr.cloud.RecoveryAfterSoftCommitTest_7F0119059EDD2515-001/data-dir-30-001
2> 205264 INFO (SUITE-RecoveryAfterSoftCommitTest-seed#[7F0119059EDD2515]-worker) [] o.a.s.SolrTestCaseJ4 Using PointFields (NUMERIC_POINTS_SYSPROP=true) w/NUMERIC_DOCVALUES_SYSPROP=true
2> 205265 WARN (SUITE-RecoveryAfterSoftCommitTest-seed#[7F0119059EDD2515]-worker) [] o.e.j.u.r.ResourceFactory Leaked /home/jenkins/jenkins-agent/workspace/Solr/Solr-Test-main/solr/test-framework/build/libs/solr-test-framework-11.0.0-SNAPSHOT.jar for jar:file:///home/jenkins/jenkins-agent/workspace/Solr/Solr-Test-main/solr/test-framework/build/libs/solr-test-framework-11.0.0-SNAPSHOT.jar!/SSLTestConfig.hostname-and-ip-missmatch.keystore
2> 205265 INFO (SUITE-RecoveryAfterSoftCommitTest-seed#[7F0119059EDD2515]-worker) [] o.a.s.SolrTestCaseJ4 Randomized ssl (false) and clientAuth (false) via: @org.apache.solr.SolrTestCaseJ4.SuppressSSL(bugUrl="None")
2> 205265 INFO (SUITE-RecoveryAfterSoftCommitTest-seed#[7F0119059EDD2515]-worker) [] o.a.s.SolrTestCaseJ4 SecureRandom sanity checks: test.solr.allowed.securerandom=null & java.security.egd=file:/dev/./urandom
2> 205271 INFO (TEST-RecoveryAfterSoftCommitTest.test-seed#[7F0119059EDD2515]) [] o.a.s.u.ErrorLogMuter Closing ErrorLogMuter-regex-72 after muting 0 log messages
2> 205271 INFO (TEST-RecoveryAfterSoftCommitTest.test-seed#[7F0119059EDD2515]) [] o.a.s.u.ErrorLogMuter Creating ErrorLogMuter-regex-73 for ERROR logs matching regex: ignore_exception
2> 205272 INFO (TEST-RecoveryAfterSoftCommitTest.test-seed#[7F0119059EDD2515]) [] o.a.s.c.ZkTestServer STARTING ZK TEST SERVER
2> 205272 INFO (ZkTestServer Run Thread) [] o.a.s.c.ZkTestServer client port: /127.0.0.1:0
2> 205272 INFO (ZkTestServer Run Thread) [] o.a.s.c.ZkTestServer Starting server
2> 205273 WARN (ZkTestServer Run Thread) [] o.a.z.s.ServerCnxnFactory maxCnxns is not configured, using default value 0.
2> 205372 INFO (TEST-RecoveryAfterSoftCommitTest.test-seed#[7F0119059EDD2515]) [] o.a.s.c.ZkTestServer start zk server on port: 44719
2> 205374 WARN (TEST-RecoveryAfterSoftCommitTest.test-seed#[7F0119059EDD2515]) [] o.a.s.c.c.SolrZkClient Using default ZkCredentialsInjector. ZkCredentialsInjector is not secure, it creates an empty list of credentials which leads to 'OPEN_ACL_UNSAFE' ACLs to Zookeeper nodes
2> 205374 WARN (TEST-RecoveryAfterSoftCommitTest.test-seed#[7F0119059EDD2515]) [] o.a.s.c.c.SolrZkClient Using default ZkACLProvider. DefaultZkACLProvider is not secure, it creates 'OPEN_ACL_UNSAFE' ACLs to Zookeeper nodes
2> 205374 INFO (TEST-RecoveryAfterSoftCommitTest.test-seed#[7F0119059EDD2515]) [] o.a.c.f.i.CuratorFrameworkImpl Starting
2> 205376 INFO (TEST-RecoveryAfterSoftCommitTest.test-seed#[7F0119059EDD2515]) [] o.a.c.f.i.CuratorFrameworkImpl Default schema
2> 205377 INFO (TEST-RecoveryAfterSoftCommitTest.test-seed#[7F0119059EDD2515]-EventThread) [] o.a.c.f.s.ConnectionStateManager State change: CONNECTED
2> 205378 INFO (TEST-RecoveryAfterSoftCommitTest.test-seed#[7F0119059EDD2515]-EventThread) [] o.a.c.f.i.EnsembleTracker New config event received: {}
2> 205378 INFO (TEST-RecoveryAfterSoftCommitTest.test-seed#[7F0119059EDD2515]-EventThread) [] o.a.c.f.i.EnsembleTracker New config event received: {}
2> 205379 WARN (TEST-RecoveryAfterSoftCommitTest.test-seed#[7F0119059EDD2515]) [] o.a.s.c.c.SolrZkClient Using default ZkCredentialsInjector. ZkCredentialsInjector is not secure, it creates an empty list of credentials which leads to 'OPEN_ACL_UNSAFE' ACLs to Zookeeper nodes
2> 205379 WARN (TEST-RecoveryAfterSoftCommitTest.test-seed#[7F0119059EDD2515]) [] o.a.s.c.c.SolrZkClient Using default ZkACLProvider. DefaultZkACLProvider is not secure, it creates 'OPEN_ACL_UNSAFE' ACLs to Zookeeper nodes
2> 205380 INFO (TEST-RecoveryAfterSoftCommitTest.test-seed#[7F0119059EDD2515]) [] o.a.c.f.i.CuratorFrameworkImpl Starting
2> 205381 INFO (TEST-RecoveryAfterSoftCommitTest.test-seed#[7F0119059EDD2515]) [] o.a.c.f.i.CuratorFrameworkImpl Default schema
2> 205382 INFO (TEST-RecoveryAfterSoftCommitTest.test-seed#[7F0119059EDD2515]-EventThread) [] o.a.c.f.s.ConnectionStateManager State change: CONNECTED
2> 205382 INFO (TEST-RecoveryAfterSoftCommitTest.test-seed#[7F0119059EDD2515]-EventThread) [] o.a.c.f.i.EnsembleTracker New config event received: {}
2> 205382 INFO (TEST-RecoveryAfterSoftCommitTest.test-seed#[7F0119059EDD2515]-EventThread) [] o.a.c.f.i.EnsembleTracker New config event received: {}
2> 205384 INFO (TEST-RecoveryAfterSoftCommitTest.test-seed#[7F0119059EDD2515]) [] o.a.s.c.ZkTestServer put /home/jenkins/jenkins-agent/workspace/Solr/Solr-Test-main/solr/core/build/resources/test/solr/collection1/conf/solrconfig-tlog.xml to /configs/conf1/solrconfig.xml
2> 205385 INFO (TEST-RecoveryAfterSoftCommitTest.test-seed#[7F0119059EDD2515]) [] o.a.s.c.ZkTestServer put /home/jenkins/jenkins-agent/workspace/Solr/Solr-Test-main/solr/core/build/resources/test/solr/collection1/conf/schema.xml to /configs/conf1/schema.xml
2> 205386 INFO (TEST-RecoveryAfterSoftCommitTest.test-seed#[7F0119059EDD2515]) [] o.a.s.c.ZkTestServer put /home/jenkins/jenkins-agent/workspace/Solr/Solr-Test-main/solr/core/build/resources/test/solr/collection1/conf/solrconfig.snippet.randomindexconfig.xml to /configs/conf1/solrconfig.snippet.randomindexconfig.xml
2> 205388 INFO (TEST-RecoveryAfterSoftCommitTest.test-seed#[7F0119059EDD2515]) [] o.a.s.c.ZkTestServer put /home/jenkins/jenkins-agent/workspace/Solr/Solr-Test-main/solr/core/build/resources/test/solr/collection1/conf/stopwords.txt to /configs/conf1/stopwords.txt
2> 205389 INFO (TEST-RecoveryAfterSoftCommitTest.test-seed#[7F0119059EDD2515]) [] o.a.s.c.ZkTestServer put /home/jenkins/jenkins-agent/workspace/Solr/Solr-Test-main/solr/core/build/resources/test/solr/collection1/conf/protwords.txt to /configs/conf1/protwords.txt
2> 205390 INFO (TEST-RecoveryAfterSoftCommitTest.test-seed#[7F0119059EDD2515]) [] o.a.s.c.ZkTestServer put /home/jenkins/jenkins-agent/workspace/Solr/Solr-Test-main/solr/core/build/resources/test/solr/collection1/conf/currency.xml to /configs/conf1/currency.xml
2> 205391 INFO (TEST-RecoveryAfterSoftCommitTest.test-seed#[7F0119059EDD2515]) [] o.a.s.c.ZkTestServer put /home/jenkins/jenkins-agent/workspace/Solr/Solr-Test-main/solr/core/build/resources/test/solr/collection1/conf/enumsConfig.xml to /configs/conf1/enumsConfig.xml
2> 205392 INFO (TEST-RecoveryAfterSoftCommitTest.test-seed#[7F0119059EDD2515]) [] o.a.s.c.ZkTestServer put /home/jenkins/jenkins-agent/workspace/Solr/Solr-Test-main/solr/core/build/resources/test/solr/collection1/conf/open-exchange-rates.json to /configs/conf1/open-exchange-rates.json
2> 205393 INFO (TEST-RecoveryAfterSoftCommitTest.test-seed#[7F0119059EDD2515]) [] o.a.s.c.ZkTestServer put /home/jenkins/jenkins-agent/workspace/Solr/Solr-Test-main/solr/core/build/resources/test/solr/collection1/conf/mapping-ISOLatin1Accent.txt to /configs/conf1/mapping-ISOLatin1Accent.txt
2> 205394 INFO (TEST-RecoveryAfterSoftCommitTest.test-seed#[7F0119059EDD2515]) [] o.a.s.c.ZkTestServer put /home/jenkins/jenkins-agent/workspace/Solr/Solr-Test-main/solr/core/build/resources/test/solr/collection1/conf/old_synonyms.txt to /configs/conf1/old_synonyms.txt
2> 205395 INFO (TEST-RecoveryAfterSoftCommitTest.test-seed#[7F0119059EDD2515]) [] o.a.s.c.ZkTestServer put /home/jenkins/jenkins-agent/workspace/Solr/Solr-Test-main/solr/core/build/resources/test/solr/collection1/conf/synonyms.txt to /configs/conf1/synonyms.txt
2> 205396 INFO (TEST-RecoveryAfterSoftCommitTest.test-seed#[7F0119059EDD2515]) [] o.a.s.c.AbstractFullDistribZkTestBase Will use NRT replicas unless explicitly asked otherwise
2> 205626 INFO (TEST-RecoveryAfterSoftCommitTest.test-seed#[7F0119059EDD2515]) [] o.a.s.e.JettySolrRunner Start Jetty (configured port=0, binding port=0)
2> 205626 INFO (TEST-RecoveryAfterSoftCommitTest.test-seed#[7F0119059EDD2515]) [] o.a.s.e.JettySolrRunner Trying to start Jetty on port 0 try number 2 ...
2> 205627 INFO (TEST-RecoveryAfterSoftCommitTest.test-seed#[7F0119059EDD2515]) [] o.e.j.s.Server jetty-12.1.10; built: 2026-05-31T04:45:52.925Z; git: 986024525891c2c20ff08c58ba300dc3b9847586; jvm 21.0.4+7-LTS
2> 205628 INFO (TEST-RecoveryAfterSoftCommitTest.test-seed#[7F0119059EDD2515]) [] o.e.j.s.DefaultSessionIdManager Session workerName=node0
2> 205628 WARN (TEST-RecoveryAfterSoftCommitTest.test-seed#[7F0119059EDD2515]) [] o.e.j.e.s.ServletContextHandler BaseResource file:///home/jenkins/jenkins-agent/workspace/Solr/Solr-Test-main/solr/core/build/tmp/tests-cwd/./ is aliased to file:///home/jenkins/jenkins-agent/workspace/Solr/Solr-Test-main/solr/core/build/tmp/tests-cwd/ in oeje10s.ServletContextHandler@22766d1e{/solr,/solr,b=file:///home/jenkins/jenkins-agent/workspace/Solr/Solr-Test-main/solr/core/build/tmp/tests-cwd/./,a=STOPPED,h=oeje10s.ServletHandler@4d706db5{STOPPED}}. May not be supported in future releases.
2> 205629 INFO (TEST-RecoveryAfterSoftCommitTest.test-seed#[7F0119059EDD2515]) [] o.e.j.s.h.ContextHandler /solr Base Resource is an alias: file:///home/jenkins/jenkins-agent/workspace/Solr/Solr-Test-main/solr/core/build/tmp/tests-cwd/./ -> file:///home/jenkins/jenkins-agent/workspace/Solr/Solr-Test-main/solr/core/build/tmp/tests-cwd/
2> 205629 INFO (TEST-RecoveryAfterSoftCommitTest.test-seed#[7F0119059EDD2515]) [] o.e.j.s.h.ContextHandler Started oeje10s.ServletContextHandler@22766d1e{/solr,/solr,b=file:///home/jenkins/jenkins-agent/workspace/Solr/Solr-Test-main/solr/core/build/tmp/tests-cwd/,a=AVAILABLE,h=oeje10s.ServletHandler@4d706db5{STARTED}}
2> 205629 INFO (TEST-RecoveryAfterSoftCommitTest.test-seed#[7F0119059EDD2515]) [] o.a.s.e.JettySolrRunner Jetty properties: {solr.data.dir=/home/jenkins/jenkins-agent/workspace/Solr/Solr-Test-main/solr/core/build/tmp/tests-tmp/org.apache.solr.cloud.RecoveryAfterSoftCommitTest_7F0119059EDD2515-001/tempDir-001/control/data, hostPort=39225, coreRootDirectory=/home/jenkins/jenkins-agent/workspace/Solr/Solr-Test-main/solr/core/build/tmp/tests-tmp/org.apache.solr.cloud.RecoveryAfterSoftCommitTest_7F0119059EDD2515-001/control-001/cores, replicaType=NRT}
2> 205629 ERROR (TEST-RecoveryAfterSoftCommitTest.test-seed#[7F0119059EDD2515]) [] o.a.s.u.StartupLoggingUtils Missing Java Option solr.logs.dir. Logging may be missing or incomplete.
2> 205630 INFO (TEST-RecoveryAfterSoftCommitTest.test-seed#[7F0119059EDD2515]) [] o.a.s.s.CoreContainerProvider Using logger factory org.apache.logging.slf4j.Log4jLoggerFactory
2> 205630 INFO (TEST-RecoveryAfterSoftCommitTest.test-seed#[7F0119059EDD2515]) [] o.a.s.s.CoreContainerProvider ___ _ Welcome to Apache Solr™ version 11.0.0
2> 205630 INFO (TEST-RecoveryAfterSoftCommitTest.test-seed#[7F0119059EDD2515]) [] o.a.s.s.CoreContainerProvider / __| ___| |_ _ Starting in cloud mode on port null
2> 205630 INFO (TEST-RecoveryAfterSoftCommitTest.test-seed#[7F0119059EDD2515]) [] o.a.s.s.CoreContainerProvider \__ \/ _ \ | '_| Install dir: /home/jenkins/jenkins-agent/workspace/Solr/Solr-Test-main/solr
2> 205630 INFO (TEST-RecoveryAfterSoftCommitTest.test-seed#[7F0119059EDD2515]) [] o.a.s.s.CoreContainerProvider |___/\___/_|_| Start time: 2026-08-04T00:55:35.366156136Z
2> 205630 INFO (TEST-RecoveryAfterSoftCommitTest.test-seed#[7F0119059EDD2515]) [] o.a.s.s.CoreContainerProvider Solr Home: /home/jenkins/jenkins-agent/workspace/Solr/Solr-Test-main/solr/core/build/tmp/tests-tmp/org.apache.solr.cloud.RecoveryAfterSoftCommitTest_7F0119059EDD2515-001/control-001 (source: servlet config: solr.solr.home)
2> 205630 WARN (TEST-RecoveryAfterSoftCommitTest.test-seed#[7F0119059EDD2515]) [] o.a.s.c.c.SolrZkClient Using default ZkCredentialsInjector. ZkCredentialsInjector is not secure, it creates an empty list of credentials which leads to 'OPEN_ACL_UNSAFE' ACLs to Zookeeper nodes
2> 205630 WARN (TEST-RecoveryAfterSoftCommitTest.test-seed#[7F0119059EDD2515]) [] o.a.s.c.c.SolrZkClient Using default ZkACLProvider. DefaultZkACLProvider is not secure, it creates 'OPEN_ACL_UNSAFE' ACLs to Zookeeper nodes
2> 205630 INFO (TEST-RecoveryAfterSoftCommitTest.test-seed#[7F0119059EDD2515]) [] o.a.c.f.i.CuratorFrameworkImpl Starting
2> 205632 INFO (TEST-RecoveryAfterSoftCommitTest.test-seed#[7F0119059EDD2515]) [] o.a.c.f.i.CuratorFrameworkImpl Default schema
2> 205633 INFO (TEST-RecoveryAfterSoftCommitTest.test-seed#[7F0119059EDD2515]-EventThread) [] o.a.c.f.s.ConnectionStateManager State change: CONNECTED
2> 205634 INFO (TEST-RecoveryAfterSoftCommitTest.test-seed#[7F0119059EDD2515]-EventThread) [] o.a.c.f.i.EnsembleTracker New config event received: {}
2> 205634 INFO (TEST-RecoveryAfterSoftCommitTest.test-seed#[7F0119059EDD2515]-EventThread) [] o.a.c.f.i.EnsembleTracker New config event received: {}
2> 205635 INFO (Curator-Framework-0) [] o.a.c.f.i.CuratorFrameworkImpl backgroundOperationsLoop exiting
2> 205736 INFO (TEST-RecoveryAfterSoftCommitTest.test-seed#[7F0119059EDD2515]) [] o.a.s.c.SolrXmlConfig Loading solr.xml from /home/jenkins/jenkins-agent/workspace/Solr/Solr-Test-main/solr/core/build/tmp/tests-tmp/org.apache.solr.cloud.RecoveryAfterSoftCommitTest_7F0119059EDD2515-001/control-001/solr.xml
2> 206165 INFO (TEST-RecoveryAfterSoftCommitTest.test-seed#[7F0119059EDD2515]) [] o.a.s.c.OpenTelemetryConfigurator OpenTelemetry tracer enabled with simple propagation only.
2> 206166 INFO (TEST-RecoveryAfterSoftCommitTest.test-seed#[7F0119059EDD2515]) [] o.a.s.m.OtelRuntimeJvmMetrics JVM metrics are disabled
2> 206178 INFO (TEST-RecoveryAfterSoftCommitTest.test-seed#[7F0119059EDD2515]) [] o.a.s.c.ZkContainer Zookeeper client=127.0.0.1:44719/solr
2> 206178 WARN (TEST-RecoveryAfterSoftCommitTest.test-seed#[7F0119059EDD2515]) [] o.a.s.c.c.SolrZkClient Using default ZkCredentialsInjector. ZkCredentialsInjector is not secure, it creates an empty list of credentials which leads to 'OPEN_ACL_UNSAFE' ACLs to Zookeeper nodes
2> 206178 WARN (TEST-RecoveryAfterSoftCommitTest.test-seed#[7F0119059EDD2515]) [] o.a.s.c.c.SolrZkClient Using default ZkACLProvider. DefaultZkACLProvider is not secure, it creates 'OPEN_ACL_UNSAFE' ACLs to Zookeeper nodes
2> 206179 INFO (TEST-RecoveryAfterSoftCommitTest.test-seed#[7F0119059EDD2515]) [] o.a.c.f.i.CuratorFrameworkImpl Starting
2> 206180 INFO (TEST-RecoveryAfterSoftCommitTest.test-seed#[7F0119059EDD2515]) [] o.a.c.f.i.CuratorFrameworkImpl Default schema
2> 206182 INFO (TEST-RecoveryAfterSoftCommitTest.test-seed#[7F0119059EDD2515]-EventThread) [] o.a.c.f.s.ConnectionStateManager State change: CONNECTED
2> 206183 INFO (Curator-Framework-0) [] o.a.c.f.i.CuratorFrameworkImpl backgroundOperationsLoop exiting
2> 206183 INFO (TEST-RecoveryAfterSoftCommitTest.test-seed#[7F0119059EDD2515]-EventThread) [] o.a.c.f.i.EnsembleTracker New config event received: {}
2> 206183 INFO (TEST-RecoveryAfterSoftCommitTest.test-seed#[7F0119059EDD2515]-EventThread) [] o.a.c.f.i.EnsembleTracker New config event received: {}
2> 206285 INFO (TEST-RecoveryAfterSoftCommitTest.test-seed#[7F0119059EDD2515]) [n:127.0.0.1:39225_solr] o.a.c.f.i.CuratorFrameworkImpl Starting
2> 206287 INFO (TEST-RecoveryAfterSoftCommitTest.test-seed#[7F0119059EDD2515]) [n:127.0.0.1:39225_solr] o.a.c.f.i.CuratorFrameworkImpl Default schema
2> 206289 INFO (TEST-RecoveryAfterSoftCommitTest.test-seed#[7F0119059EDD2515]-EventThread) [] o.a.c.f.s.ConnectionStateManager State change: CONNECTED
2> 206289 INFO (TEST-RecoveryAfterSoftCommitTest.test-seed#[7F0119059EDD2515]-EventThread) [] o.a.c.f.i.EnsembleTracker New config event received: {}
2> 206290 INFO (TEST-RecoveryAfterSoftCommitTest.test-seed#[7F0119059EDD2515]-EventThread) [] o.a.c.f.i.EnsembleTracker New config event received: {}
2> 206314 WARN (TEST-RecoveryAfterSoftCommitTest.test-seed#[7F0119059EDD2515]) [n:127.0.0.1:39225_solr] o.a.s.c.ZkController Contents of zookeeper /security.json are world-readable; consider setting up ACLs as described in https://solr.apache.org/guide/solr/latest/deployment-guide/zookeeper-access-control.html
2> 206318 INFO (TEST-RecoveryAfterSoftCommitTest.test-seed#[7F0119059EDD2515]) [n:127.0.0.1:39225_solr] o.a.s.c.ZkController The Overseer is enabled. It will process all cluster commands & state updates.
2> 206322 INFO (TEST-RecoveryAfterSoftCommitTest.test-seed#[7F0119059EDD2515]) [n:127.0.0.1:39225_solr] o.a.s.c.OverseerElectionContext I am going to be the leader 127.0.0.1:39225_solr
2> 206323 INFO (TEST-RecoveryAfterSoftCommitTest.test-seed#[7F0119059EDD2515]) [n:127.0.0.1:39225_solr] o.a.s.c.Overseer Overseer (id=72095969436631044-127.0.0.1:39225_solr-n_0000000000) starting
2> 206328 INFO (TEST-RecoveryAfterSoftCommitTest.test-seed#[7F0119059EDD2515]) [n:127.0.0.1:39225_solr] o.a.s.c.ZkController Register node as live in ZooKeeper: /live_nodes/127.0.0.1:39225_solr
2> 206328 INFO (OverseerStateUpdate-72095969436631044-127.0.0.1:39225_solr-n_0000000000) [n:127.0.0.1:39225_solr] o.a.s.c.Overseer Starting to work on the main queue : 127.0.0.1:39225_solr
2> 206329 INFO (OverseerStateUpdate-72095969436631044-127.0.0.1:39225_solr-n_0000000000) [n:127.0.0.1:39225_solr] o.a.s.c.c.ZkStateReader Updated live nodes from ZooKeeper... (0) -> (1)
2> 206332 WARN (TEST-RecoveryAfterSoftCommitTest.test-seed#[7F0119059EDD2515]) [n:127.0.0.1:39225_solr] o.a.s.c.CoreContainer Not all security plugins configured! authentication=disabled authorization=disabled. Solr is only as secure as you make it. Consider configuring authentication/authorization before exposing Solr to users internal or external. See https://s.apache.org/solrsecurity for more info
2> 206420 INFO (TEST-RecoveryAfterSoftCommitTest.test-seed#[7F0119059EDD2515]) [n:127.0.0.1:39225_solr] o.a.s.c.CorePropertiesLocator Found 0 core definitions underneath /home/jenkins/jenkins-agent/workspace/Solr/Solr-Test-main/solr/core/build/tmp/tests-tmp/org.apache.solr.cloud.RecoveryAfterSoftCommitTest_7F0119059EDD2515-001/control-001/cores
2> 206491 INFO (TEST-RecoveryAfterSoftCommitTest.test-seed#[7F0119059EDD2515]) [n:127.0.0.1:39225_solr] o.e.j.e.s.ServletContextHandler Started oeje10s.ServletContextHandler@22766d1e{/solr,/solr,b=file:///home/jenkins/jenkins-agent/workspace/Solr/Solr-Test-main/solr/core/build/tmp/tests-cwd/,a=AVAILABLE,h=oeje10s.ServletHandler@4d706db5{STARTED}}
2> 206491 INFO (TEST-RecoveryAfterSoftCommitTest.test-seed#[7F0119059EDD2515]) [n:127.0.0.1:39225_solr] o.e.j.s.AbstractConnector Started oejs.ServerConnector@2c3eb965{HTTP/1.1, (http/1.1, h2c)}{127.0.0.1:38273}
2> 206491 INFO (TEST-RecoveryAfterSoftCommitTest.test-seed#[7F0119059EDD2515]) [n:127.0.0.1:39225_solr] o.e.j.s.Server Started oejs.Server@8670b72{STARTING}[12.1.10,sto=0] @864ms
2> 206495 WARN (TEST-RecoveryAfterSoftCommitTest.test-seed#[7F0119059EDD2515]) [] o.a.s.c.c.SolrZkClient Using default ZkCredentialsInjector. ZkCredentialsInjector is not secure, it creates an empty list of credentials which leads to 'OPEN_ACL_UNSAFE' ACLs to Zookeeper nodes
2> 206495 WARN (TEST-RecoveryAfterSoftCommitTest.test-seed#[7F0119059EDD2515]) [] o.a.s.c.c.SolrZkClient Using default ZkACLProvider. DefaultZkACLProvider is not secure, it creates 'OPEN_ACL_UNSAFE' ACLs to Zookeeper nodes
2> 206495 INFO (TEST-RecoveryAfterSoftCommitTest.test-seed#[7F0119059EDD2515]) [] o.a.c.f.i.CuratorFrameworkImpl Starting
2> 206497 INFO (TEST-RecoveryAfterSoftCommitTest.test-seed#[7F0119059EDD2515]) [] o.a.c.f.i.CuratorFrameworkImpl Default schema
2> 206498 INFO (TEST-RecoveryAfterSoftCommitTest.test-seed#[7F0119059EDD2515]-EventThread) [] o.a.c.f.s.ConnectionStateManager State change: CONNECTED
2> 206498 INFO (TEST-RecoveryAfterSoftCommitTest.test-seed#[7F0119059EDD2515]-EventThread) [] o.a.c.f.i.EnsembleTracker New config event received: {}
2> 206498 INFO (TEST-RecoveryAfterSoftCommitTest.test-seed#[7F0119059EDD2515]-EventThread) [] o.a.c.f.i.EnsembleTracker New config event received: {}
2> 206499 INFO (TEST-RecoveryAfterSoftCommitTest.test-seed#[7F0119059EDD2515]) [] o.a.s.c.c.ZkStateReader Updated live nodes from ZooKeeper... (0) -> (1)
2> 206501 INFO (TEST-RecoveryAfterSoftCommitTest.test-seed#[7F0119059EDD2515]) [] o.a.s.c.s.i.ZkClientClusterStateProvider Cluster at 127.0.0.1:44719/solr ready
2> 206502 INFO (SocketProxy-Acceptor-39225) [] o.a.s.u.SocketProxy accepted Socket[addr=/127.0.0.1,port=44652,localport=39225], receiveBufferSize: 65536
2> 206504 INFO (SocketProxy-Acceptor-39225) [] o.a.s.u.SocketProxy proxy connection Socket[addr=/127.0.0.1,port=38273,localport=57954], receiveBufferSize=65536
2> 206511 INFO (OverseerThreadFactory-3018-thread-1) [ c:control_collection t:null-14362] o.a.s.c.a.c.CreateCollectionCmd Create collection control_collection
2> 206511 INFO (OverseerThreadFactory-3018-thread-1) [ c:control_collection t:null-14362] o.a.s.c.a.c.CreateCollectionCmd solr.cloud.prs.enabled : false and collection prs : null, isPRS : false
2> 206515 INFO (OverseerThreadFactory-3018-thread-1) [ c:control_collection t:null-14362] o.a.s.c.c.ZkStateReader /collections/control_collection/state.json is deleted, stop watching children
2> 206516 INFO (zkCallback-3012-thread-1) [] o.a.s.c.c.ZkStateReader A cluster state change: [WatchedEvent state:SyncConnected type:NodeCreated path:/collections/control_collection/state.json zxid: -1] for collection [control_collection] has occurred - updating... (live nodes size: [1])
2> 206522 INFO (OverseerStateUpdate-72095969436631044-127.0.0.1:39225_solr-n_0000000000) [n:127.0.0.1:39225_solr] o.a.s.c.o.SliceMutator createReplica() {
2> "core":"control_collection_shard1_replica_n1",
2> "node_name":"127.0.0.1:39225_solr",
2> "base_url":"http://127.0.0.1:39225/solr",
2> "collection":"control_collection",
2> "shard":"shard1",
2> "state":"down",
2> "type":"NRT",
2> "operation":"ADDREPLICA",
2> "waitForFinalState":"false"}
2> 206626 INFO (zkCallback-3012-thread-1) [] o.a.s.c.c.ZkStateReader A cluster state change: [WatchedEvent state:SyncConnected type:NodeDataChanged path:/collections/control_collection/state.json zxid: -1] for collection [control_collection] has occurred - updating... (live nodes size: [1])
2> 206628 INFO (SocketProxy-Acceptor-39225) [] o.a.s.u.SocketProxy accepted Socket[addr=/127.0.0.1,port=44660,localport=39225], receiveBufferSize: 65536
2> 206629 INFO (SocketProxy-Acceptor-39225) [] o.a.s.u.SocketProxy proxy connection Socket[addr=/127.0.0.1,port=38273,localport=57966], receiveBufferSize=65536
2> 206631 INFO (qtp886468847-5902-null-14362) [n:127.0.0.1:39225_solr x:control_collection_shard1_replica_n1 t:null-14362] o.a.s.h.a.a.CreateCore core create command "org.apache.solr.client.api.model.CreateCoreParams@5cf9f25f"
2> 206684 INFO (qtp886468847-5902-null-14362) [n:127.0.0.1:39225_solr c:control_collection s:shard1 r:core_node2 x:control_collection_shard1_replica_n1 t:null-14362] o.a.s.s.IndexSchema Loaded schema test/1.0 with uniqueid field id
2> 206706 INFO (qtp886468847-5902-null-14362) [n:127.0.0.1:39225_solr c:control_collection s:shard1 r:core_node2 x:control_collection_shard1_replica_n1 t:null-14362] o.a.s.c.CoreContainer Creating SolrCore 'control_collection_shard1_replica_n1' using configuration from configset conf1
2> 206707 INFO (qtp886468847-5902-null-14362) [n:127.0.0.1:39225_solr c:control_collection s:shard1 r:core_node2 x:control_collection_shard1_replica_n1 t:null-14362] o.a.s.c.SolrCore Opening new SolrCore at [/home/jenkins/jenkins-agent/workspace/Solr/Solr-Test-main/solr/core/build/tmp/tests-tmp/org.apache.solr.cloud.RecoveryAfterSoftCommitTest_7F0119059EDD2515-001/control-001/cores/control_collection_shard1_replica_n1], dataDir=[/home/jenkins/jenkins-agent/workspace/Solr/Solr-Test-main/solr/core/build/tmp/tests-tmp/org.apache.solr.cloud.RecoveryAfterSoftCommitTest_7F0119059EDD2515-001/control-001/cores/control_collection_shard1_replica_n1/data/]
2> 206708 INFO (qtp886468847-5902-null-14362) [n:127.0.0.1:39225_solr c:control_collection s:shard1 r:core_node2 x:control_collection_shard1_replica_n1 t:null-14362] o.a.s.u.RandomMergePolicy RandomMergePolicy wrapping class org.apache.lucene.index.LogDocMergePolicy: [LogDocMergePolicy: minMergeSize=1000, mergeFactor=33, maxMergeSize=9223372036854775807, maxMergeSizeForForcedMerge=9223372036854775807, calibrateSizeByDeletes=false, maxMergeDocs=2147483647, maxCFSSegmentSizeMB=8.796093022208E12, noCFSRatio=0.3627549035578185]
2> 206713 WARN (qtp886468847-5902-null-14362) [n:127.0.0.1:39225_solr c:control_collection s:shard1 r:core_node2 x:control_collection_shard1_replica_n1 t:null-14362] o.a.s.c.RequestHandlers INVALID paramSet a in requestHandler {type = requestHandler,name = /dump,class = DumpRequestHandler,attributes = {initParams=a, name=/dump, class=DumpRequestHandler},args = {defaults={a=A, b=B}}}
2> 206744 INFO (qtp886468847-5902-null-14362) [n:127.0.0.1:39225_solr c:control_collection s:shard1 r:core_node2 x:control_collection_shard1_replica_n1 t:null-14362] o.a.s.u.UpdateLog Initializing UpdateLog: dataDir= defaultSyncLevel=FLUSH numRecordsToKeep=2 maxNumLogsToKeep=10
2> 206744 INFO (qtp886468847-5902-null-14362) [n:127.0.0.1:39225_solr c:control_collection s:shard1 r:core_node2 x:control_collection_shard1_replica_n1 t:null-14362] o.a.s.u.CommitTracker Hard AutoCommit: disabled
2> 206744 INFO (qtp886468847-5902-null-14362) [n:127.0.0.1:39225_solr c:control_collection s:shard1 r:core_node2 x:control_collection_shard1_replica_n1 t:null-14362] o.a.s.u.CommitTracker Soft AutoCommit: disabled
2> 206746 INFO (qtp886468847-5902-null-14362) [n:127.0.0.1:39225_solr c:control_collection s:shard1 r:core_node2 x:control_collection_shard1_replica_n1 t:null-14362] o.a.s.u.RandomMergePolicy RandomMergePolicy wrapping class org.apache.lucene.index.TieredMergePolicy: [TieredMergePolicy: maxMergeAtOnce=18, maxMergedSegmentMB=56.65719032287598, floorSegmentMB=0.23803234100341797, forceMergeDeletesPctAllowed=23.00537128724749, segmentsPerTier=33.0, maxCFSSegmentSizeMB=8.796093022208E12, noCFSRatio=0.4065875927728062, deletesPctAllowed=47.33927183876867, targetSearchConcurrency=13
2> 206748 INFO (qtp886468847-5902-null-14362) [n:127.0.0.1:39225_solr c:control_collection s:shard1 r:core_node2 x:control_collection_shard1_replica_n1 t:null-14362] o.a.s.r.ManagedResourceStorage Configured ZooKeeperStorageIO with znodeBase: /configs/conf1
2> 206749 INFO (qtp886468847-5902-null-14362) [n:127.0.0.1:39225_solr c:control_collection s:shard1 r:core_node2 x:control_collection_shard1_replica_n1 t:null-14362] o.a.s.r.ManagedResourceStorage Loaded null at path _rest_managed.json using ZooKeeperStorageIO:path=/configs/conf1
2> 206749 INFO (qtp886468847-5902-null-14362) [n:127.0.0.1:39225_solr c:control_collection s:shard1 r:core_node2 x:control_collection_shard1_replica_n1 t:null-14362] o.a.s.h.ReplicationHandler Commits will be reserved for 10000 ms
2> 206751 INFO (searcherExecutor-3029-thread-1-processing-127.0.0.1:39225_solr control_collection_shard1_replica_n1 null-14362 control_collection shard1 core_node2) [n:127.0.0.1:39225_solr c:control_collection s:shard1 r:core_node2 x:control_collection_shard1_replica_n1 t:null-14362] o.a.s.c.SolrCore Registered new searcher autowarm time: 0 ms
2> 206755 INFO (qtp886468847-5902-null-14362) [n:127.0.0.1:39225_solr c:control_collection s:shard1 r:core_node2 x:control_collection_shard1_replica_n1 t:null-14362] o.a.s.c.ZkShardTerms Successful update of terms at /collections/control_collection/terms/shard1 to Terms{values={core_node2=0}, version=0} for registerTerm
2> 206755 INFO (qtp886468847-5902-null-14362) [n:127.0.0.1:39225_solr c:control_collection s:shard1 r:core_node2 x:control_collection_shard1_replica_n1 t:null-14362] o.a.s.c.ShardLeaderElectionContextBase make sure parent is created /collections/control_collection/leaders/shard1
2> 206766 INFO (qtp886468847-5902-null-14362) [n:127.0.0.1:39225_solr c:control_collection s:shard1 r:core_node2 x:control_collection_shard1_replica_n1 t:null-14362] o.a.s.c.ShardLeaderElectionContext Enough replicas found to continue.
2> 206766 INFO (qtp886468847-5902-null-14362) [n:127.0.0.1:39225_solr c:control_collection s:shard1 r:core_node2 x:control_collection_shard1_replica_n1 t:null-14362] o.a.s.c.ShardLeaderElectionContext I may be the new leader - try and sync
2> 206766 INFO (qtp886468847-5902-null-14362) [n:127.0.0.1:39225_solr c:control_collection s:shard1 r:core_node2 x:control_collection_shard1_replica_n1 t:null-14362] o.a.s.c.SyncStrategy Sync replicas to http://127.0.0.1:39225/solr/control_collection_shard1_replica_n1/
2> 206767 INFO (qtp886468847-5902-null-14362) [n:127.0.0.1:39225_solr c:control_collection s:shard1 r:core_node2 x:control_collection_shard1_replica_n1 t:null-14362] o.a.s.c.SyncStrategy Sync Success - now sync replicas to me
2> 206767 INFO (qtp886468847-5902-null-14362) [n:127.0.0.1:39225_solr c:control_collection s:shard1 r:core_node2 x:control_collection_shard1_replica_n1 t:null-14362] o.a.s.c.SyncStrategy http://127.0.0.1:39225/solr/control_collection_shard1_replica_n1/ has no replicas
2> 206767 INFO (qtp886468847-5902-null-14362) [n:127.0.0.1:39225_solr c:control_collection s:shard1 r:core_node2 x:control_collection_shard1_replica_n1 t:null-14362] o.a.s.c.ShardLeaderElectionContextBase Creating leader registration node /collections/control_collection/leaders/shard1/leader after winning as /collections/control_collection/leader_elect/shard1/election/72095969436631044-core_node2-n_0000000000
2> 206874 INFO (zkCallback-3012-thread-1) [] o.a.s.c.c.ZkStateReader A cluster state change: [WatchedEvent state:SyncConnected type:NodeDataChanged path:/collections/control_collection/state.json zxid: -1] for collection [control_collection] has occurred - updating... (live nodes size: [1])
2> 206875 INFO (qtp886468847-5902-null-14362) [n:127.0.0.1:39225_solr c:control_collection s:shard1 r:core_node2 x:control_collection_shard1_replica_n1 t:null-14362] o.a.s.c.ShardLeaderElectionContext I am the new leader: http://127.0.0.1:39225/solr/control_collection_shard1_replica_n1/ shard1
2> 206877 INFO (qtp886468847-5902-null-14362) [n:127.0.0.1:39225_solr c:control_collection s:shard1 r:core_node2 x:control_collection_shard1_replica_n1 t:null-14362] o.a.s.c.ZkController I am the leader, no recovery necessary
2> 206882 INFO (qtp886468847-5902-null-14362) [n:127.0.0.1:39225_solr t:null-14362] o.a.s.s.HttpSolrCall [admin] path=/admin/cores params={coreNodeName=core_node2&collection.configName=conf1&newCollection=true&name=control_collection_shard1_replica_n1&action=CREATE&numShards=1&collection=control_collection&shard=shard1&wt=javabin&replicaType=NRT} status=0 QTime=251
2> 206885 INFO (qtp886468847-5899-null-14361) [n:127.0.0.1:39225_solr c:control_collection t:null-14361] o.a.s.h.a.CollectionsHandler Wait for new collection to be active for at most 45 seconds. Check all shard replicas
2> 206982 INFO (zkCallback-3012-thread-2) [] o.a.s.c.c.ZkStateReader A cluster state change: [WatchedEvent state:SyncConnected type:NodeDataChanged path:/collections/control_collection/state.json zxid: -1] for collection [control_collection] has occurred - updating... (live nodes size: [1])
2> 206983 INFO (qtp886468847-5899-null-14361) [n:127.0.0.1:39225_solr c:control_collection t:null-14361] o.a.s.s.HttpSolrCall [admin] path=/admin/collections params={collection.configName=conf1&name=control_collection&nrtReplicas=1&action=CREATE&numShards=1&createNodeSet=127.0.0.1:39225_solr&wt=javabin} status=0 QTime=477
2> 206985 INFO (TEST-RecoveryAfterSoftCommitTest.test-seed#[7F0119059EDD2515]) [] o.a.s.c.AbstractFullDistribZkTestBase Waiting to see 1 active replicas in collection: control_collection
2> 206986 INFO (Curator-Framework-0) [] o.a.c.f.i.CuratorFrameworkImpl backgroundOperationsLoop exiting
2> 207094 WARN (TEST-RecoveryAfterSoftCommitTest.test-seed#[7F0119059EDD2515]) [] o.a.s.c.c.SolrZkClient Using default ZkCredentialsInjector. ZkCredentialsInjector is not secure, it creates an empty list of credentials which leads to 'OPEN_ACL_UNSAFE' ACLs to Zookeeper nodes
2> 207094 WARN (TEST-RecoveryAfterSoftCommitTest.test-seed#[7F0119059EDD2515]) [] o.a.s.c.c.SolrZkClient Using default ZkACLProvider. DefaultZkACLProvider is not secure, it creates 'OPEN_ACL_UNSAFE' ACLs to Zookeeper nodes
2> 207094 INFO (TEST-RecoveryAfterSoftCommitTest.test-seed#[7F0119059EDD2515]) [] o.a.c.f.i.CuratorFrameworkImpl Starting
2> 207095 INFO (TEST-RecoveryAfterSoftCommitTest.test-seed#[7F0119059EDD2515]) [] o.a.c.f.i.CuratorFrameworkImpl Default schema
2> 207096 INFO (TEST-RecoveryAfterSoftCommitTest.test-seed#[7F0119059EDD2515]-EventThread) [] o.a.c.f.s.ConnectionStateManager State change: CONNECTED
2> 207097 INFO (TEST-RecoveryAfterSoftCommitTest.test-seed#[7F0119059EDD2515]-EventThread) [] o.a.c.f.i.EnsembleTracker New config event received: {}
2> 207097 INFO (TEST-RecoveryAfterSoftCommitTest.test-seed#[7F0119059EDD2515]-EventThread) [] o.a.c.f.i.EnsembleTracker New config event received: {}
2> 207099 INFO (TEST-RecoveryAfterSoftCommitTest.test-seed#[7F0119059EDD2515]) [] o.a.s.c.c.ZkStateReader Updated live nodes from ZooKeeper... (0) -> (1)
2> 207100 INFO (TEST-RecoveryAfterSoftCommitTest.test-seed#[7F0119059EDD2515]) [] o.a.s.c.s.i.ZkClientClusterStateProvider Cluster at 127.0.0.1:44719/solr ready
2> 207100 INFO (TEST-RecoveryAfterSoftCommitTest.test-seed#[7F0119059EDD2515]) [] o.a.s.c.ChaosMonkey monkey: init - expire sessions:false cause connection loss:false
2> 207102 INFO (SocketProxy-Acceptor-39225) [] o.a.s.u.SocketProxy accepted Socket[addr=/127.0.0.1,port=44668,localport=39225], receiveBufferSize: 65536
2> 207102 INFO (SocketProxy-Acceptor-39225) [] o.a.s.u.SocketProxy proxy connection Socket[addr=/127.0.0.1,port=38273,localport=57980], receiveBufferSize=65536
2> 207108 INFO (OverseerThreadFactory-3018-thread-2) [ c:collection1 t:null-14364] o.a.s.c.a.c.CreateCollectionCmd Create collection collection1
2> 207109 INFO (OverseerThreadFactory-3018-thread-2) [ c:collection1 t:null-14364] o.a.s.c.a.c.CreateCollectionCmd solr.cloud.prs.enabled : false and collection prs : null, isPRS : false
2> 207113 INFO (OverseerThreadFactory-3018-thread-2) [ c:collection1 t:null-14364] o.a.s.c.c.ZkStateReader /collections/collection1/state.json is deleted, stop watching children
2> 207216 INFO (zkCallback-3012-thread-2) [] o.a.s.c.c.ZkStateReader A cluster state change: [WatchedEvent state:SyncConnected type:NodeCreated path:/collections/collection1/state.json zxid: -1] for collection [collection1] has occurred - updating... (live nodes size: [1])
2> 207217 WARN (OverseerThreadFactory-3018-thread-2) [ c:collection1 t:null-14364] o.a.s.c.a.c.CreateCollectionCmd It is unusual to create a collection (collection1) without cores.
2> 207219 INFO (qtp886468847-5901-null-14363) [n:127.0.0.1:39225_solr c:collection1 t:null-14363] o.a.s.h.a.CollectionsHandler Wait for new collection to be active for at most 45 seconds. Check all shard replicas
2> 207220 INFO (qtp886468847-5901-null-14363) [n:127.0.0.1:39225_solr c:collection1 t:null-14363] o.a.s.s.HttpSolrCall [admin] path=/admin/collections params={collection.configName=conf1&name=collection1&nrtReplicas=1&action=CREATE&numShards=1&createNodeSet=&wt=javabin} status=0 QTime=116
2> 207222 INFO (TEST-RecoveryAfterSoftCommitTest.test-seed#[7F0119059EDD2515]) [] o.a.s.c.SolrCloudTestCase active slice count: 1 expected: 1
2> 207222 INFO (TEST-RecoveryAfterSoftCommitTest.test-seed#[7F0119059EDD2515]) [] o.a.s.c.SolrCloudTestCase active replica count: 0 expected replica count: 0
2> 207222 INFO (TEST-RecoveryAfterSoftCommitTest.test-seed#[7F0119059EDD2515]) [] o.a.s.c.AbstractFullDistribZkTestBase Creating jetty instances pullReplicaCount=0 numOtherReplicas=2
2> 207460 INFO (TEST-RecoveryAfterSoftCommitTest.test-seed#[7F0119059EDD2515]) [] o.a.s.c.AbstractFullDistribZkTestBase create jetty 1 in directory /home/jenkins/jenkins-agent/workspace/Solr/Solr-Test-main/solr/core/build/tmp/tests-tmp/org.apache.solr.cloud.RecoveryAfterSoftCommitTest_7F0119059EDD2515-001/shard-1-001 of type NRT for shard1
2> 207462 INFO (closeThreadPool-3041-thread-1) [] o.a.s.e.JettySolrRunner Start Jetty (configured port=0, binding port=0)
2> 207462 INFO (closeThreadPool-3041-thread-1) [] o.a.s.e.JettySolrRunner Trying to start Jetty on port 0 try number 2 ...
2> 207462 INFO (closeThreadPool-3041-thread-1) [] o.e.j.s.Server jetty-12.1.10; built: 2026-05-31T04:45:52.925Z; git: 986024525891c2c20ff08c58ba300dc3b9847586; jvm 21.0.4+7-LTS
2> 207464 INFO (closeThreadPool-3041-thread-1) [] o.e.j.s.DefaultSessionIdManager Session workerName=node0
2> 207464 WARN (closeThreadPool-3041-thread-1) [] o.e.j.e.s.ServletContextHandler BaseResource file:///home/jenkins/jenkins-agent/workspace/Solr/Solr-Test-main/solr/core/build/tmp/tests-cwd/./ is aliased to file:///home/jenkins/jenkins-agent/workspace/Solr/Solr-Test-main/solr/core/build/tmp/tests-cwd/ in oeje10s.ServletContextHandler@256c9a87{/solr,/solr,b=file:///home/jenkins/jenkins-agent/workspace/Solr/Solr-Test-main/solr/core/build/tmp/tests-cwd/./,a=STOPPED,h=oeje10s.ServletHandler@4f228321{STOPPED}}. May not be supported in future releases.
2> 207465 INFO (closeThreadPool-3041-thread-1) [] o.e.j.s.h.ContextHandler /solr Base Resource is an alias: file:///home/jenkins/jenkins-agent/workspace/Solr/Solr-Test-main/solr/core/build/tmp/tests-cwd/./ -> file:///home/jenkins/jenkins-agent/workspace/Solr/Solr-Test-main/solr/core/build/tmp/tests-cwd/
2> 207465 INFO (closeThreadPool-3041-thread-1) [] o.e.j.s.h.ContextHandler Started oeje10s.ServletContextHandler@256c9a87{/solr,/solr,b=file:///home/jenkins/jenkins-agent/workspace/Solr/Solr-Test-main/solr/core/build/tmp/tests-cwd/,a=AVAILABLE,h=oeje10s.ServletHandler@4f228321{STARTED}}
2> 207466 INFO (closeThreadPool-3041-thread-1) [] o.a.s.e.JettySolrRunner Jetty properties: {solrconfig=solrconfig.xml, solr.data.dir=/home/jenkins/jenkins-agent/workspace/Solr/Solr-Test-main/solr/core/build/tmp/tests-tmp/org.apache.solr.cloud.RecoveryAfterSoftCommitTest_7F0119059EDD2515-001/tempDir-001/jetty1, hostPort=35561, coreRootDirectory=/home/jenkins/jenkins-agent/workspace/Solr/Solr-Test-main/solr/core/build/tmp/tests-tmp/org.apache.solr.cloud.RecoveryAfterSoftCommitTest_7F0119059EDD2515-001/shard-1-001/cores}
2> 207466 ERROR (closeThreadPool-3041-thread-1) [] o.a.s.u.StartupLoggingUtils Missing Java Option solr.logs.dir. Logging may be missing or incomplete.
2> 207466 INFO (closeThreadPool-3041-thread-1) [] o.a.s.s.CoreContainerProvider Using logger factory org.apache.logging.slf4j.Log4jLoggerFactory
2> 207466 INFO (closeThreadPool-3041-thread-1) [] o.a.s.s.CoreContainerProvider ___ _ Welcome to Apache Solr™ version 11.0.0
2> 207466 INFO (closeThreadPool-3041-thread-1) [] o.a.s.s.CoreContainerProvider / __| ___| |_ _ Starting in cloud mode on port null
2> 207466 INFO (closeThreadPool-3041-thread-1) [] o.a.s.s.CoreContainerProvider \__ \/ _ \ | '_| Install dir: /home/jenkins/jenkins-agent/workspace/Solr/Solr-Test-main/solr
2> 207466 INFO (closeThreadPool-3041-thread-1) [] o.a.s.s.CoreContainerProvider |___/\___/_|_| Start time: 2026-08-04T00:55:37.202453842Z
2> 207466 INFO (closeThreadPool-3041-thread-1) [] o.a.s.s.CoreContainerProvider Solr Home: /home/jenkins/jenkins-agent/workspace/Solr/Solr-Test-main/solr/core/build/tmp/tests-tmp/org.apache.solr.cloud.RecoveryAfterSoftCommitTest_7F0119059EDD2515-001/shard-1-001 (source: servlet config: solr.solr.home)
2> 207466 WARN (closeThreadPool-3041-thread-1) [] o.a.s.c.c.SolrZkClient Using default ZkCredentialsInjector. ZkCredentialsInjector is not secure, it creates an empty list of credentials which leads to 'OPEN_ACL_UNSAFE' ACLs to Zookeeper nodes
2> 207466 WARN (closeThreadPool-3041-thread-1) [] o.a.s.c.c.SolrZkClient Using default ZkACLProvider. DefaultZkACLProvider is not secure, it creates 'OPEN_ACL_UNSAFE' ACLs to Zookeeper nodes
2> 207467 INFO (closeThreadPool-3041-thread-1) [] o.a.c.f.i.CuratorFrameworkImpl Starting
2> 207468 INFO (closeThreadPool-3041-thread-1) [] o.a.c.f.i.CuratorFrameworkImpl Default schema
2> 207469 INFO (closeThreadPool-3041-thread-1-EventThread) [] o.a.c.f.s.ConnectionStateManager State change: CONNECTED
2> 207470 INFO (closeThreadPool-3041-thread-1-EventThread) [] o.a.c.f.i.EnsembleTracker New config event received: {}
2> 207470 INFO (closeThreadPool-3041-thread-1-EventThread) [] o.a.c.f.i.EnsembleTracker New config event received: {}
2> 207471 INFO (Curator-Framework-0) [] o.a.c.f.i.CuratorFrameworkImpl backgroundOperationsLoop exiting
2> 207572 INFO (closeThreadPool-3041-thread-1) [] o.a.s.c.SolrXmlConfig Loading solr.xml from /home/jenkins/jenkins-agent/workspace/Solr/Solr-Test-main/solr/core/build/tmp/tests-tmp/org.apache.solr.cloud.RecoveryAfterSoftCommitTest_7F0119059EDD2515-001/shard-1-001/solr.xml
2> 207741 INFO (TEST-RecoveryAfterSoftCommitTest.test-seed#[7F0119059EDD2515]) [] o.a.s.c.AbstractFullDistribZkTestBase create jetty 2 in directory /home/jenkins/jenkins-agent/workspace/Solr/Solr-Test-main/solr/core/build/tmp/tests-tmp/org.apache.solr.cloud.RecoveryAfterSoftCommitTest_7F0119059EDD2515-001/shard-2-001 of type NRT for shard1
2> 207743 INFO (closeThreadPool-3041-thread-2) [] o.a.s.e.JettySolrRunner Start Jetty (configured port=0, binding port=0)
2> 207743 INFO (closeThreadPool-3041-thread-2) [] o.a.s.e.JettySolrRunner Trying to start Jetty on port 0 try number 2 ...
2> 207743 INFO (closeThreadPool-3041-thread-2) [] o.e.j.s.Server jetty-12.1.10; built: 2026-05-31T04:45:52.925Z; git: 986024525891c2c20ff08c58ba300dc3b9847586; jvm 21.0.4+7-LTS
2> 207744 INFO (closeThreadPool-3041-thread-2) [] o.e.j.s.DefaultSessionIdManager Session workerName=node0
2> 207745 WARN (closeThreadPool-3041-thread-2) [] o.e.j.e.s.ServletContextHandler BaseResource file:///home/jenkins/jenkins-agent/workspace/Solr/Solr-Test-main/solr/core/build/tmp/tests-cwd/./ is aliased to file:///home/jenkins/jenkins-agent/workspace/Solr/Solr-Test-main/solr/core/build/tmp/tests-cwd/ in oeje10s.ServletContextHandler@55dd1d8e{/solr,/solr,b=file:///home/jenkins/jenkins-agent/workspace/Solr/Solr-Test-main/solr/core/build/tmp/tests-cwd/./,a=STOPPED,h=oeje10s.ServletHandler@407923fa{STOPPED}}. May not be supported in future releases.
2> 207746 INFO (closeThreadPool-3041-thread-2) [] o.e.j.s.h.ContextHandler /solr Base Resource is an alias: file:///home/jenkins/jenkins-agent/workspace/Solr/Solr-Test-main/solr/core/build/tmp/tests-cwd/./ -> file:///home/jenkins/jenkins-agent/workspace/Solr/Solr-Test-main/solr/core/build/tmp/tests-cwd/
2> 207746 INFO (closeThreadPool-3041-thread-2) [] o.e.j.s.h.ContextHandler Started oeje10s.ServletContextHandler@55dd1d8e{/solr,/solr,b=file:///home/jenkins/jenkins-agent/workspace/Solr/Solr-Test-main/solr/core/build/tmp/tests-cwd/,a=AVAILABLE,h=oeje10s.ServletHandler@407923fa{STARTED}}
2> 207746 INFO (closeThreadPool-3041-thread-2) [] o.a.s.e.JettySolrRunner Jetty properties: {solrconfig=solrconfig.xml, solr.data.dir=/home/jenkins/jenkins-agent/workspace/Solr/Solr-Test-main/solr/core/build/tmp/tests-tmp/org.apache.solr.cloud.RecoveryAfterSoftCommitTest_7F0119059EDD2515-001/tempDir-001/jetty2, hostPort=36651, coreRootDirectory=/home/jenkins/jenkins-agent/workspace/Solr/Solr-Test-main/solr/core/build/tmp/tests-tmp/org.apache.solr.cloud.RecoveryAfterSoftCommitTest_7F0119059EDD2515-001/shard-2-001/cores}
2> 207746 ERROR (closeThreadPool-3041-thread-2) [] o.a.s.u.StartupLoggingUtils Missing Java Option solr.logs.dir. Logging may be missing or incomplete.
2> 207746 INFO (closeThreadPool-3041-thread-2) [] o.a.s.s.CoreContainerProvider Using logger factory org.apache.logging.slf4j.Log4jLoggerFactory
2> 207746 INFO (closeThreadPool-3041-thread-2) [] o.a.s.s.CoreContainerProvider ___ _ Welcome to Apache Solr™ version 11.0.0
2> 207747 INFO (closeThreadPool-3041-thread-2) [] o.a.s.s.CoreContainerProvider / __| ___| |_ _ Starting in cloud mode on port null
2> 207747 INFO (closeThreadPool-3041-thread-2) [] o.a.s.s.CoreContainerProvider \__ \/ _ \ | '_| Install dir: /home/jenkins/jenkins-agent/workspace/Solr/Solr-Test-main/solr
2> 207747 INFO (closeThreadPool-3041-thread-2) [] o.a.s.s.CoreContainerProvider |___/\___/_|_| Start time: 2026-08-04T00:55:37.483063539Z
2> 207747 INFO (closeThreadPool-3041-thread-2) [] o.a.s.s.CoreContainerProvider Solr Home: /home/jenkins/jenkins-agent/workspace/Solr/Solr-Test-main/solr/core/build/tmp/tests-tmp/org.apache.solr.cloud.RecoveryAfterSoftCommitTest_7F0119059EDD2515-001/shard-2-001 (source: servlet config: solr.solr.home)
2> 207747 WARN (closeThreadPool-3041-thread-2) [] o.a.s.c.c.SolrZkClient Using default ZkCredentialsInjector. ZkCredentialsInjector is not secure, it creates an empty list of credentials which leads to 'OPEN_ACL_UNSAFE' ACLs to Zookeeper nodes
2> 207747 WARN (closeThreadPool-3041-thread-2) [] o.a.s.c.c.SolrZkClient Using default ZkACLProvider. DefaultZkACLProvider is not secure, it creates 'OPEN_ACL_UNSAFE' ACLs to Zookeeper nodes
2> 207747 INFO (closeThreadPool-3041-thread-2) [] o.a.c.f.i.CuratorFrameworkImpl Starting
2> 207749 INFO (closeThreadPool-3041-thread-2) [] o.a.c.f.i.CuratorFrameworkImpl Default schema
2> 207750 INFO (closeThreadPool-3041-thread-2-EventThread) [] o.a.c.f.s.ConnectionStateManager State change: CONNECTED
2> 207751 INFO (closeThreadPool-3041-thread-2-EventThread) [] o.a.c.f.i.EnsembleTracker New config event received: {}
2> 207751 INFO (closeThreadPool-3041-thread-2-EventThread) [] o.a.c.f.i.EnsembleTracker New config event received: {}
2> 207751 INFO (Curator-Framework-0) [] o.a.c.f.i.CuratorFrameworkImpl backgroundOperationsLoop exiting
2> 207853 INFO (closeThreadPool-3041-thread-2) [] o.a.s.c.SolrXmlConfig Loading solr.xml from /home/jenkins/jenkins-agent/workspace/Solr/Solr-Test-main/solr/core/build/tmp/tests-tmp/org.apache.solr.cloud.RecoveryAfterSoftCommitTest_7F0119059EDD2515-001/shard-2-001/solr.xml
2> 208277 INFO (closeThreadPool-3041-thread-2) [] o.a.s.m.OtelRuntimeJvmMetrics JVM metrics are disabled
2> 208290 INFO (closeThreadPool-3041-thread-2) [] o.a.s.c.ZkContainer Zookeeper client=127.0.0.1:44719/solr
2> 208290 WARN (closeThreadPool-3041-thread-2) [] o.a.s.c.c.SolrZkClient Using default ZkCredentialsInjector. ZkCredentialsInjector is not secure, it creates an empty list of credentials which leads to 'OPEN_ACL_UNSAFE' ACLs to Zookeeper nodes
2> 208290 WARN (closeThreadPool-3041-thread-2) [] o.a.s.c.c.SolrZkClient Using default ZkACLProvider. DefaultZkACLProvider is not secure, it creates 'OPEN_ACL_UNSAFE' ACLs to Zookeeper nodes
2> 208291 INFO (closeThreadPool-3041-thread-2) [] o.a.c.f.i.CuratorFrameworkImpl Starting
2> 208292 INFO (closeThreadPool-3041-thread-2) [] o.a.c.f.i.CuratorFrameworkImpl Default schema
2> 208293 INFO (closeThreadPool-3041-thread-2-EventThread) [] o.a.c.f.s.ConnectionStateManager State change: CONNECTED
2> 208294 INFO (closeThreadPool-3041-thread-2-EventThread) [] o.a.c.f.i.EnsembleTracker New config event received: {}
2> 208294 INFO (closeThreadPool-3041-thread-2-EventThread) [] o.a.c.f.i.EnsembleTracker New config event received: {}
2> 208294 INFO (Curator-Framework-0) [] o.a.c.f.i.CuratorFrameworkImpl backgroundOperationsLoop exiting
2> 208396 INFO (closeThreadPool-3041-thread-2) [n:127.0.0.1:36651_solr] o.a.c.f.i.CuratorFrameworkImpl Starting
2> 208398 INFO (closeThreadPool-3041-thread-2) [n:127.0.0.1:36651_solr] o.a.c.f.i.CuratorFrameworkImpl Default schema
2> 208399 INFO (closeThreadPool-3041-thread-2-EventThread) [] o.a.c.f.s.ConnectionStateManager State change: CONNECTED
2> 208400 INFO (closeThreadPool-3041-thread-2-EventThread) [] o.a.c.f.i.EnsembleTracker New config event received: {}
2> 208400 INFO (closeThreadPool-3041-thread-2-EventThread) [] o.a.c.f.i.EnsembleTracker New config event received: {}
2> 208408 WARN (closeThreadPool-3041-thread-2) [n:127.0.0.1:36651_solr] o.a.s.c.ZkController Contents of zookeeper /security.json are world-readable; consider setting up ACLs as described in https://solr.apache.org/guide/solr/latest/deployment-guide/zookeeper-access-control.html
2> 208409 INFO (closeThreadPool-3041-thread-2) [n:127.0.0.1:36651_solr] o.a.s.c.c.ZkStateReader Updated live nodes from ZooKeeper... (0) -> (1)
2> 208411 INFO (closeThreadPool-3041-thread-2) [n:127.0.0.1:36651_solr] o.a.s.c.ZkController The Overseer is enabled. It will process all cluster commands & state updates.
2> 208415 INFO (closeThreadPool-3041-thread-2) [n:127.0.0.1:36651_solr] o.a.s.c.ZkController Publish node=127.0.0.1:36651_solr as DOWN
2> 208417 INFO (closeThreadPool-3041-thread-2) [n:127.0.0.1:36651_solr] o.a.s.c.ZkController Register node as live in ZooKeeper: /live_nodes/127.0.0.1:36651_solr
2> 208418 INFO (zkCallback-3012-thread-2) [] o.a.s.c.c.ZkStateReader Updated live nodes from ZooKeeper... (1) -> (2)
2> 208418 INFO (zkCallback-3062-thread-1) [] o.a.s.c.c.ZkStateReader Updated live nodes from ZooKeeper... (1) -> (2)
2> 208419 INFO (zkCallback-3038-thread-1) [] o.a.s.c.c.ZkStateReader Updated live nodes from ZooKeeper... (1) -> (2)
2> 208420 WARN (closeThreadPool-3041-thread-2) [n:127.0.0.1:36651_solr] o.a.s.c.CoreContainer Not all security plugins configured! authentication=disabled authorization=disabled. Solr is only as secure as you make it. Consider configuring authentication/authorization before exposing Solr to users internal or external. See https://s.apache.org/solrsecurity for more info
2> 208441 INFO (closeThreadPool-3041-thread-2) [n:127.0.0.1:36651_solr] o.a.s.c.CorePropertiesLocator Found 0 core definitions underneath /home/jenkins/jenkins-agent/workspace/Solr/Solr-Test-main/solr/core/build/tmp/tests-tmp/org.apache.solr.cloud.RecoveryAfterSoftCommitTest_7F0119059EDD2515-001/shard-2-001/cores
2> 208501 INFO (closeThreadPool-3041-thread-2) [n:127.0.0.1:36651_solr] o.e.j.e.s.ServletContextHandler Started oeje10s.ServletContextHandler@55dd1d8e{/solr,/solr,b=file:///home/jenkins/jenkins-agent/workspace/Solr/Solr-Test-main/solr/core/build/tmp/tests-cwd/,a=AVAILABLE,h=oeje10s.ServletHandler@407923fa{STARTED}}
2> 208501 INFO (closeThreadPool-3041-thread-2) [n:127.0.0.1:36651_solr] o.e.j.s.AbstractConnector Started oejs.ServerConnector@1da78a{HTTP/1.1, (http/1.1, h2c)}{127.0.0.1:42623}
2> 208501 INFO (closeThreadPool-3041-thread-2) [n:127.0.0.1:36651_solr] o.e.j.s.Server Started oejs.Server@1d113cb0{STARTING}[12.1.10,sto=0] @758ms
2> 208501 INFO (closeThreadPool-3041-thread-2) [] o.a.s.c.AbstractFullDistribZkTestBase waitForLiveNode: 127.0.0.1:36651_solr
2> 208591 INFO (closeThreadPool-3041-thread-1) [] o.a.s.m.OtelRuntimeJvmMetrics JVM metrics are disabled
2> 208603 INFO (closeThreadPool-3041-thread-1) [] o.a.s.c.ZkContainer Zookeeper client=127.0.0.1:44719/solr
2> 208603 WARN (closeThreadPool-3041-thread-1) [] o.a.s.c.c.SolrZkClient Using default ZkCredentialsInjector. ZkCredentialsInjector i
[...truncated too long message...]
LPermission:
java.util.ServiceConfigurationError: Locale provider adapter "CLDR"cannot be instantiated.
java.security.policy: error adding Permission, java.net.URLPermission:
java.util.ServiceConfigurationError: Locale provider adapter "CLDR"cannot be instantiated.
java.security.policy: error adding Permission, java.net.URLPermission:
java.util.ServiceConfigurationError: Locale provider adapter "CLDR"cannot be instantiated.
java.security.policy: error adding Permission, java.net.URLPermission:
java.util.ServiceConfigurationError: Locale provider adapter "CLDR"cannot be instantiated.
java.security.policy: error adding Permission, java.net.URLPermission:
java.util.ServiceConfigurationError: Locale provider adapter "CLDR"cannot be instantiated.
java.security.policy: error adding Permission, java.net.URLPermission:
java.util.ServiceConfigurationError: Locale provider adapter "CLDR"cannot be instantiated.
java.security.policy: error adding Permission, java.net.URLPermission:
java.util.ServiceConfigurationError: Locale provider adapter "CLDR"cannot be instantiated.
java.security.policy: error adding Permission, java.net.URLPermission:
java.util.ServiceConfigurationError: Locale provider adapter "CLDR"cannot be instantiated.
java.security.policy: error adding Permission, java.net.URLPermission:
java.util.ServiceConfigurationError: Locale provider adapter "CLDR"cannot be instantiated.
java.security.policy: error adding Permission, java.net.URLPermission:
java.util.ServiceConfigurationError: Locale provider adapter "CLDR"cannot be instantiated.
java.security.policy: error adding Permission, java.net.URLPermission:
java.util.ServiceConfigurationError: Locale provider adapter "CLDR"cannot be instantiated.
java.security.policy: error adding Permission, java.net.URLPermission:
java.util.ServiceConfigurationError: Locale provider adapter "CLDR"cannot be instantiated.
java.security.policy: error adding Permission, java.net.URLPermission:
java.util.ServiceConfigurationError: Locale provider adapter "CLDR"cannot be instantiated.
java.security.policy: error adding Permission, java.net.URLPermission:
java.util.ServiceConfigurationError: Locale provider adapter "CLDR"cannot be instantiated.
java.security.policy: error adding Permission, java.net.URLPermission:
java.util.ServiceConfigurationError: Locale provider adapter "CLDR"cannot be instantiated.
java.security.policy: error adding Permission, java.net.URLPermission:
java.util.ServiceConfigurationError: Locale provider adapter "CLDR"cannot be instantiated.
java.security.policy: error adding Permission, java.net.URLPermission:
java.util.ServiceConfigurationError: Locale provider adapter "CLDR"cannot be instantiated.
java.security.policy: error adding Permission, java.net.URLPermission:
java.util.ServiceConfigurationError: Locale provider adapter "CLDR"cannot be instantiated.
java.security.policy: error adding Permission, java.net.URLPermission:
java.util.ServiceConfigurationError: Locale provider adapter "CLDR"cannot be instantiated.
java.security.policy: error adding Permission, java.net.URLPermission:
java.util.ServiceConfigurationError: Locale provider adapter "CLDR"cannot be instantiated.
:solr:modules:scripting:test (SUCCESS): 24 test(s), 19 skipped
> Task :solr:modules:scripting:wipeTaskTemp
> Task :solr:modules:sql:compileTestJava
> Task :solr:modules:sql:testClasses
> Task :solr:modules:sql:test
WARNING: Using incubator modules: jdk.incubator.vector
WARNING: Using incubator modules: jdk.incubator.vector
WARNING: Using incubator modules: jdk.incubator.vector
WARNING: A command line option has enabled the Security Manager
WARNING: The Security Manager is deprecated and will be removed in a future release
WARNING: A command line option has enabled the Security Manager
WARNING: The Security Manager is deprecated and will be removed in a future release
WARNING: A command line option has enabled the Security Manager
WARNING: The Security Manager is deprecated and will be removed in a future release
java.security.policy: error adding Permission, java.net.URLPermission:
java.util.ServiceConfigurationError: Locale provider adapter "CLDR"cannot be instantiated.
java.security.policy: error adding Permission, java.net.URLPermission:
java.util.ServiceConfigurationError: Locale provider adapter "CLDR"cannot be instantiated.
java.security.policy: error adding Permission, java.net.URLPermission:
java.util.ServiceConfigurationError: Locale provider adapter "CLDR"cannot be instantiated.
java.security.policy: error adding Permission, java.net.URLPermission:
java.util.ServiceConfigurationError: Locale provider adapter "CLDR"cannot be instantiated.
java.security.policy: error adding Permission, java.net.URLPermission:
java.util.ServiceConfigurationError: Locale provider adapter "CLDR"cannot be instantiated.
java.security.policy: error adding Permission, java.net.URLPermission:
java.util.ServiceConfigurationError: Locale provider adapter "CLDR"cannot be instantiated.
java.security.policy: error adding Permission, java.net.URLPermission:
java.util.ServiceConfigurationError: Locale provider adapter "CLDR"cannot be instantiated.
java.security.policy: error adding Permission, java.net.URLPermission:
java.util.ServiceConfigurationError: Locale provider adapter "CLDR"cannot be instantiated.
java.security.policy: error adding Permission, java.net.URLPermission:
java.util.ServiceConfigurationError: Locale provider adapter "CLDR"cannot be instantiated.
java.security.policy: error adding Permission, java.net.URLPermission:
java.util.ServiceConfigurationError: Locale provider adapter "CLDR"cannot be instantiated.
java.security.policy: error adding Permission, java.net.URLPermission:
java.util.ServiceConfigurationError: Locale provider adapter "CLDR"cannot be instantiated.
java.security.policy: error adding Permission, java.net.URLPermission:
java.util.ServiceConfigurationError: Locale provider adapter "CLDR"cannot be instantiated.
java.security.policy: error adding Permission, java.net.URLPermission:
java.util.ServiceConfigurationError: Locale provider adapter "CLDR"cannot be instantiated.
java.security.policy: error adding Permission, java.net.URLPermission:
java.util.ServiceConfigurationError: Locale provider adapter "CLDR"cannot be instantiated.
java.security.policy: error adding Permission, java.net.URLPermission:
java.util.ServiceConfigurationError: Locale provider adapter "CLDR"cannot be instantiated.
:solr:modules:sql:test (SUCCESS): 34 test(s)
> Task :checkWorkingCopyClean
> Task :solr:modules:sql:wipeTaskTemp
The slowest tests (exceeding 500 ms) during this run:
70.97s TestCpuAllowedLimit.testDistribLimit (:solr:core)
63.23s TestCpuAllowedLimit.testDistribLimit2 (:solr:core)
46.15s TestRandomCollapseQParserPlugin.testRandomCollapseWithSort (:solr:core)
44.44s UnloadDistributedZkTest.test (:solr:core)
42.82s TestRandomFlRTGCloud.testRandomizedUpdatesAndRTGs (:solr:core)
40.87s BasicDistributedZkTest.test (:solr:core)
40.15s HttpJettySolrClientTest.testIdleTimeoutWithHttpClient (:solr:solrj-jetty)
38.78s TestRandomFaceting.testRandomFaceting (:solr:core)
38.64s PeerSyncReplicationTest.test (:solr:core)
37.68s TestCloudSearcherWarming.testPeersyncFailureReplicationSuccess (:solr:core)
The slowest suites (exceeding 1s) during this run:
140.73s TestCpuAllowedLimit (:solr:core)
77.85s KnnQParserTest (:solr:core)
71.11s TestCoordinatorRole (:solr:core)
68.77s TestRecovery (:solr:core)
66.98s TestPullReplica (:solr:core)
65.48s MultiThreadedOCPTest (:solr:core)
65.42s TestInPlaceUpdatesStandalone (:solr:core)
63.55s TestTlogReplica (:solr:core)
59.91s ReindexCollectionTest (:solr:core)
54.52s S3IncrementalBackupTest (:solr:modules:s3-repository)
ERROR: The following test(s) have failed:
- org.apache.solr.cloud.RecoveryAfterSoftCommitTest.test (:solr:core)
Test history: https://develocity.apache.org/scans/tests?search.rootProjectNames=solr-root&tests.container=org.apache.solr.cloud.RecoveryAfterSoftCommitTest&tests.test=test http://fucit.org/solr-jenkins-reports/history-trend-of-recent-failures.html#series/org.apache.solr.cloud.RecoveryAfterSoftCommitTest.test
Test output: /home/jenkins/jenkins-agent/workspace/Solr/Solr-Test-main/solr/core/build/test-results/test/outputs/OUTPUT-org.apache.solr.cloud.RecoveryAfterSoftCommitTest.txt
Reproduce with: ./gradlew :solr:core:test --tests "org.apache.solr.cloud.RecoveryAfterSoftCommitTest.test" -Ptests.haltonfailure=false "-Ptests.jvmargs=-XX:TieredStopAtLevel=1 -XX:+UseParallelGC -XX:ActiveProcessorCount=1 -XX:ReservedCodeCacheSize=120m" -Ptests.seed=7F0119059EDD2515 -Ptests.multiplier=2 -Ptests.useSecurityManager=true -Ptests.badapples=false -Ptests.file.encoding=ISO-8859-1
[Incubating] Problems report is available at: file:///home/jenkins/jenkins-agent/workspace/Solr/Solr-Test-main/build/reports/problems/problems-report.html
Deprecated Gradle features were used in this build, making it incompatible with Gradle 10.
You can use '--warning-mode all' to show the individual deprecation warnings and determine if they come from your own scripts or plugins.
For more on this, please refer to https://docs.gradle.org/9.6.0/userguide/command_line_interface.html#sec:command_line_warnings in the Gradle documentation.
BUILD SUCCESSFUL in 42m 48s
153 actionable tasks: 153 executed
Publishing Build Scan to Develocity...
https://develocity.apache.org/s/fnrjrkjzgisga
Build step 'Invoke Gradle script' changed build result to SUCCESS
Archiving artifacts
‘**/*.events’ doesn’t match anything: ‘**’ exists but not ‘**/*.events’
No artifacts found that match the file pattern "**/*.events,heapdumps/**,**/hs_err_pid*". Configuration error?
Recording test results
[Checks API] No suitable checks publisher found.
Build step 'Publish JUnit test result report' changed build result to UNSTABLE
Email was triggered for: Unstable (Test Failures)
Sending email for trigger: Unstable (Test Failures)