You are viewing a plain text version of this content. The canonical link for it is here.
Posted to notifications@maven.apache.org by Apache Jenkins Server <je...@builds.apache.org> on 2022/02/11 08:16:11 UTC

Build failed in Jenkins: Maven » The Apache Software Foundation » maven-compiler-plugin » master #25

See https://ci-maven.apache.org/job/Maven/job/maven-github/job/maven-compiler-plugin/job/master/25/

Changes:

* [maven-release-plugin] prepare release maven-compiler-plugin-3.10.0

All tests passed

Build log:
[...truncated 13236 lines...]
[INFO]           jpms_patch-module/pom.xml ........................ SUCCESS (4.9 s)
[INFO] Building: jpms_compile-main-empty-test-bar/pom.xml
[INFO]           MCOMPILER-336_incremental-modulepath\pom.xml ..... SUCCESS (9.7 s)
[INFO] Building: MCOMPILER-349_dependencyChanged\pom.xml
[INFO] run post-build script verify.groovy
[INFO]           jpms_compile-main-empty-test-bar/pom.xml ......... SUCCESS (5.7 s)
[INFO] Building: MCOMPILER-379/pom.xml
[INFO] run post-build script verify.groovy
[INFO]           MCOMPILER-474_recompile-dependent-when-package\pom.xml SUCCESS (10.2 s)
[INFO] Building: MCOMPILER-481-requires-static-included\pom.xml
[INFO]           MCOMPILER-379/pom.xml ............................ SUCCESS (5.3 s)
[INFO] Building: MCOMPILER-336_incremental-modulepath/pom.xml
[INFO] run post-build script verify.groovy
[INFO]           MCOMPILER-349_dependencyChanged\pom.xml .......... SUCCESS (13.0 s)
[INFO] Building: MCOMPILER-360\pom.xml
[INFO]           MCOMPILER-481-requires-static-included\pom.xml ... SUCCESS (7.5 s)
[INFO] Building: multirelease-patterns\multimodule\pom.xml
[INFO]           MCOMPILER-360\pom.xml ............................ SUCCESS (3.8 s)
[INFO] Building: MCOMPILER-366\pom.xml
[INFO] run post-build script verify.groovy
[INFO]           MCOMPILER-366\pom.xml ............................ SUCCESS (4.7 s)
[INFO] Building: MCOMPILER-373_mrjar\pom.xml
[INFO]           MCOMPILER-336_incremental-modulepath/pom.xml ..... SUCCESS (12.7 s)
[INFO] Building: MCOMPILER-360/pom.xml
[INFO] run post-build script verify.groovy
[INFO]           multirelease-patterns\multimodule\pom.xml ........ SUCCESS (10.5 s)
[INFO] Building: multirelease-patterns\multiproject\pom.xml
[INFO]           MCOMPILER-373_mrjar\pom.xml ...................... SUCCESS (4.5 s)
[INFO] Building: MCOMPILER-379\pom.xml
[INFO]           MCOMPILER-360/pom.xml ............................ SUCCESS (5.1 s)
[INFO] Building: MCOMPILER-321_pathexceptions/pom.xml
[INFO]           MCOMPILER-379\pom.xml ............................ SUCCESS (3.8 s)
[INFO] Building: MCOMPILER-474_recompile-dependent-when-package\pom.xml
[INFO] run post-build script verify.groovy
[INFO]           MCOMPILER-321_pathexceptions/pom.xml ............. SUCCESS (5.8 s)
[INFO] Building: MCOMPILER-294/pom.xml
[INFO]           MCOMPILER-294/pom.xml ............................ SUCCESS (5.7 s)
[INFO] Building: MCOMPILER-268_modulepath/pom.xml
[INFO] run post-build script verify.groovy
[INFO]           MCOMPILER-474_recompile-dependent-when-package\pom.xml SUCCESS (13.5 s)
[INFO] Building: MCOMPILER-481-requires-static-included\pom.xml
[INFO] run post-build script verify.groovy
[INFO]           MCOMPILER-268_modulepath/pom.xml ................. SUCCESS (6.2 s)
[INFO] Building: jdk9-exportsto/pom.xml
[INFO]           jdk9-exportsto/pom.xml ........................... SUCCESS (5.0 s)
[INFO] Building: MCOMPILER-129/pom.xml
[INFO]           MCOMPILER-481-requires-static-included\pom.xml ... SUCCESS (8.8 s)
[INFO] Building: multirelease-patterns\multimodule\pom.xml
[INFO] run post-build script verify.groovy
[INFO]           multirelease-patterns\multiproject\pom.xml ....... SUCCESS (23.2 s)
[INFO] Building: multirelease-patterns\packaging-plugin\pom.xml
[INFO]           MCOMPILER-129/pom.xml ............................ SUCCESS (5.6 s)
[INFO] Building: MCOMPILER-260_customArguments/pom.xml
[INFO]           MCOMPILER-260_customArguments/pom.xml ............ SUCCESS (3.3 s)
[INFO] Building: automodules-transitive-module/pom.xml
[INFO] run post-build script verify.groovy
[INFO]           multirelease-patterns\packaging-plugin\pom.xml ... SUCCESS (13.0 s)
[INFO] Building: multirelease-patterns\singleproject-runtime\pom.xml
[INFO] run post-build script verify.groovy
[INFO]           automodules-transitive-module/pom.xml ............ SUCCESS (5.6 s)
[INFO] Building: MCOMPILER-298/pom.xml
[INFO] run post-build script verify.groovy
[INFO]           multirelease-patterns\multimodule\pom.xml ........ SUCCESS (13.3 s)
[INFO] Building: multirelease-patterns\multiproject\pom.xml
[INFO] run post-build script verify.groovy
[INFO]           multirelease-patterns\singleproject-runtime\pom.xml SUCCESS (6.1 s)
[INFO] Building: multirelease-patterns\singleproject-toolchains\pom.xml
[INFO]           MCOMPILER-298/pom.xml ............................ SUCCESS (7.7 s)
[INFO] Building: MCOMPILER-192/pom.xml
[INFO] run post-build script verify.groovy
[INFO]           multirelease-patterns\singleproject-toolchains\pom.xml SUCCESS (8.4 s)
[INFO] Building: non-english-warnings\pom.xml
[INFO] run post-build script verify.groovy
[INFO]           MCOMPILER-192/pom.xml ............................ SUCCESS (5.4 s)
[INFO] Building: default-incremental-disable/pom.xml
[INFO] run post-build script verify.bsh
[INFO]           non-english-warnings\pom.xml ..................... SUCCESS (3.2 s)
[INFO] Building: test1\pom.xml
[INFO]           test1\pom.xml .................................... SUCCESS (3.1 s)
[INFO] 
[INFO] --- maven-checkstyle-plugin:3.0.0:check (checkstyle-check) @ maven-compiler-plugin ---
[INFO] There are 2 errors reported by Checkstyle 6.18 with config/maven_checks.xml ruleset.
[INFO] Ignored 2 errors, 0 violation remaining.
[INFO] 
[INFO] --- maven-invoker-plugin:3.2.2:verify (integration-test) @ maven-compiler-plugin ---
[INFO] -------------------------------------------------
[INFO] Build Summary:
[INFO]   Passed: 59, Failed: 0, Errors: 0, Skipped: 3
[INFO] -------------------------------------------------
[ERROR] The following builds was skipped:
[ERROR] *  default-fork\pom.xml
[ERROR] *  groovy-project-with-new-plexus-compiler\pom.xml
[ERROR] *  MCOMPILER-197\pom.xml
[INFO] -------------------------------------------------
[INFO] ------------------------------------------------------------------------
[INFO] BUILD SUCCESS
[INFO] ------------------------------------------------------------------------
[INFO] Total time:  05:32 min
[INFO] Finished at: 2022-02-11T08:15:11Z
[INFO] ------------------------------------------------------------------------
[INFO] [jenkins-event-spy] Generated F:\jenkins\jenkins-home\82467a7c\workspace\hub_maven-compiler-plugin_master@2@tmp\withMavence39c2d4\maven-spy-20220211-080938-6205678493785185035433.log
[Pipeline] }
[Pipeline] // dir
[Pipeline] }
[withMaven] artifactsPublisher - Archive artifact windows-jdk17-m3.6.x_build\pom.xml under org\apache\maven\plugins\maven-compiler-plugin\3.10.0\maven-compiler-plugin-3.10.0.pom
[withMaven] artifactsPublisher - Archive artifact windows-jdk17-m3.6.x_build\target\maven-compiler-plugin-3.10.0.jar under org\apache\maven\plugins\maven-compiler-plugin\3.10.0\maven-compiler-plugin-3.10.0.jar
[withMaven] junitPublisher - Archive test results for Maven artifact org.apache.maven.plugins:maven-compiler-plugin:maven-plugin:3.10.0 generated by maven-surefire-plugin:test (default-test): windows-jdk17-m3.6.x_build\target\surefire-reports\*.xml
Recording test results
[withMaven] Jenkins Task Scanner Plugin not found, don't display results of source code scanning for 'TODO' and 'FIXME' in pipeline screen.
[withMaven] invokerPublisher - Archive invoker results for Maven artifact MavenArtifact{org.apache.maven.plugins:maven-compiler-plugin:maven-plugin:3.10.0(version: 3.10.0, snapshot:false) } generated by PluginInvocation{org.apache.maven.plugins:maven-invoker-plugin:3.2.2@integration-test  integration-test}: windows-jdk17-m3.6.x_build\target\invoker-reports\*.xml
ERROR: [withMaven] invokerPublisher - Silently ignore exception archiving Invoker runs for Maven artifact MavenArtifact{org.apache.maven.plugins:maven-compiler-plugin:maven-plugin:3.10.0(version: 3.10.0, snapshot:false) } generated by PluginInvocation{org.apache.maven.plugins:maven-invoker-plugin:3.2.2@integration-test  integration-test}: java.io.IOException: Unknown attribute 'buildlog' for tag 'build-job' (position: START_TAG seen ...2\windows-jdk17-m3.6.x_build\target\it\MCOMPILER-129\build.log" />... @2:263) 
[withMaven] Publishers: Generated Artifacts Publisher: 88 ms, Junit Publisher: 49 ms, Open Task Scanner Publisher: 1 ms, Invoker Publisher: 336 ms
[Pipeline] // withMaven
[Pipeline] cleanWs
[WS-CLEANUP] Deleting project workspace...
[WS-CLEANUP] Deferred wipeout is used...
[WS-CLEANUP] done
[Pipeline] }
[Pipeline] // stage
[Pipeline] }
[Pipeline] // ws
[Pipeline] }
[Pipeline] // node
[Pipeline] }
[INFO] run post-build script verify.groovy
[INFO]           default-incremental-disable/pom.xml .............. SUCCESS (9.4 s)
[INFO] Building: automodules-manifest/pom.xml
[INFO] run post-build script verify.groovy
[INFO]           automodules-manifest/pom.xml ..................... SUCCESS (5.5 s)
[INFO] Building: mcompiler-179/pom.xml
[INFO] run post-build script verify.groovy
[INFO]           mcompiler-179/pom.xml ............................ SUCCESS (4.4 s)
[INFO] 
[INFO] --- maven-checkstyle-plugin:3.0.0:check (checkstyle-check) @ maven-compiler-plugin ---
[INFO] run post-build script verify.groovy
[INFO]           multirelease-patterns\multiproject\pom.xml ....... SUCCESS (29.1 s)
[INFO] Building: multirelease-patterns\packaging-plugin\pom.xml
[INFO] There are 2 errors reported by Checkstyle 6.18 with config/maven_checks.xml ruleset.
[INFO] Ignored 2 errors, 0 violation remaining.
[INFO] 
[INFO] --- maven-invoker-plugin:3.2.2:verify (integration-test) @ maven-compiler-plugin ---
[INFO] -------------------------------------------------
[INFO] Build Summary:
[INFO]   Passed: 59, Failed: 0, Errors: 0, Skipped: 3
[INFO] -------------------------------------------------
[ERROR] The following builds was skipped:
[ERROR] *  MCOMPILER-197/pom.xml
[ERROR] *  groovy-project-with-new-plexus-compiler/pom.xml
[ERROR] *  default-fork-windows/pom.xml
[INFO] -------------------------------------------------
[INFO] ------------------------------------------------------------------------
[INFO] BUILD SUCCESS
[INFO] ------------------------------------------------------------------------
[INFO] Total time:  08:40 min
[INFO] Finished at: 2022-02-11T08:15:25Z
[INFO] ------------------------------------------------------------------------
[INFO] [jenkins-event-spy] Generated /home/jenkins/jenkins-home/workspace/hub_maven-compiler-plugin_master@3@tmp/withMaven08600ec1/maven-spy-20220211-080645-519395691169015410672.log
[Pipeline] }
[Pipeline] // dir
[Pipeline] }
[withMaven] artifactsPublisher - Archive artifact linux-jdk11-m3.6.x_build/pom.xml under org/apache/maven/plugins/maven-compiler-plugin/3.10.0/maven-compiler-plugin-3.10.0.pom
[withMaven] artifactsPublisher - Archive artifact linux-jdk11-m3.6.x_build/target/maven-compiler-plugin-3.10.0.jar under org/apache/maven/plugins/maven-compiler-plugin/3.10.0/maven-compiler-plugin-3.10.0.jar
[withMaven] junitPublisher - Archive test results for Maven artifact org.apache.maven.plugins:maven-compiler-plugin:maven-plugin:3.10.0 generated by maven-surefire-plugin:test (default-test): linux-jdk11-m3.6.x_build/target/surefire-reports/*.xml
Recording test results
[withMaven] Jenkins Task Scanner Plugin not found, don't display results of source code scanning for 'TODO' and 'FIXME' in pipeline screen.
[withMaven] invokerPublisher - Archive invoker results for Maven artifact MavenArtifact{org.apache.maven.plugins:maven-compiler-plugin:maven-plugin:3.10.0(version: 3.10.0, snapshot:false) } generated by PluginInvocation{org.apache.maven.plugins:maven-invoker-plugin:3.2.2@integration-test  integration-test}: linux-jdk11-m3.6.x_build/target/invoker-reports/*.xml
ERROR: [withMaven] invokerPublisher - Silently ignore exception archiving Invoker runs for Maven artifact MavenArtifact{org.apache.maven.plugins:maven-compiler-plugin:maven-plugin:3.10.0(version: 3.10.0, snapshot:false) } generated by PluginInvocation{org.apache.maven.plugins:maven-invoker-plugin:3.2.2@integration-test  integration-test}: java.io.IOException: Unknown attribute 'buildlog' for tag 'build-job' (position: START_TAG seen ...r@3/linux-jdk11-m3.6.x_build/target/it/MCOMPILER-129/build.log" />... @2:255) 
[withMaven] Publishers: Generated Artifacts Publisher: 75 ms, Junit Publisher: 36 ms, Open Task Scanner Publisher: 1 ms, Invoker Publisher: 192 ms
[Pipeline] // withMaven
[Pipeline] cleanWs
[WS-CLEANUP] Deleting project workspace...
[WS-CLEANUP] Deferred wipeout is used...
[WS-CLEANUP] done
[Pipeline] }
[Pipeline] // stage
[Pipeline] }
[Pipeline] // ws
[Pipeline] }
[Pipeline] // node
[Pipeline] }
[INFO] run post-build script verify.groovy
[INFO]           multirelease-patterns\packaging-plugin\pom.xml ... SUCCESS (15.5 s)
[INFO] Building: multirelease-patterns\singleproject-runtime\pom.xml
[INFO] run post-build script verify.groovy
[INFO]           multirelease-patterns\singleproject-runtime\pom.xml SUCCESS (8.2 s)
[INFO] Building: multirelease-patterns\singleproject-toolchains\pom.xml
[INFO] run post-build script verify.groovy
[INFO]           multirelease-patterns\singleproject-toolchains\pom.xml SUCCESS (11.4 s)
[INFO] Building: non-english-warnings\pom.xml
[INFO] run post-build script verify.bsh
[INFO]           non-english-warnings\pom.xml ..................... SUCCESS (4.3 s)
[INFO] Building: test1\pom.xml
[INFO]           test1\pom.xml .................................... SUCCESS (4.5 s)
[INFO] 
[INFO] --- maven-checkstyle-plugin:3.0.0:check (checkstyle-check) @ maven-compiler-plugin ---
[INFO] There are 2 errors reported by Checkstyle 6.18 with config/maven_checks.xml ruleset.
[INFO] Ignored 2 errors, 0 violation remaining.
[INFO] 
[INFO] --- maven-invoker-plugin:3.2.2:verify (integration-test) @ maven-compiler-plugin ---
[INFO] -------------------------------------------------
[INFO] Build Summary:
[INFO]   Passed: 59, Failed: 0, Errors: 0, Skipped: 3
[INFO] -------------------------------------------------
[ERROR] The following builds was skipped:
[ERROR] *  default-fork\pom.xml
[ERROR] *  groovy-project-with-new-plexus-compiler\pom.xml
[ERROR] *  MCOMPILER-197\pom.xml
[INFO] -------------------------------------------------
[INFO] ------------------------------------------------------------------------
[INFO] BUILD SUCCESS
[INFO] ------------------------------------------------------------------------
[INFO] Total time:  07:20 min
[INFO] Finished at: 2022-02-11T00:16:07-08:00
[INFO] ------------------------------------------------------------------------
[INFO] [jenkins-event-spy] Generated F:\jenkins\jenkins-slave\82467a7c\workspace\hub_maven-compiler-plugin_master@2@tmp\withMaven95ddd074\maven-spy-20220211-000846-6356368806085284667288.log
[Pipeline] }
[Pipeline] // dir
[Pipeline] }
[withMaven] artifactsPublisher - Archive artifact windows-jdk11-m3.6.x_build\pom.xml under org\apache\maven\plugins\maven-compiler-plugin\3.10.0\maven-compiler-plugin-3.10.0.pom
[withMaven] artifactsPublisher - Archive artifact windows-jdk11-m3.6.x_build\target\maven-compiler-plugin-3.10.0.jar under org\apache\maven\plugins\maven-compiler-plugin\3.10.0\maven-compiler-plugin-3.10.0.jar
[withMaven] junitPublisher - Archive test results for Maven artifact org.apache.maven.plugins:maven-compiler-plugin:maven-plugin:3.10.0 generated by maven-surefire-plugin:test (default-test): windows-jdk11-m3.6.x_build\target\surefire-reports\*.xml
Recording test results
[withMaven] Jenkins Task Scanner Plugin not found, don't display results of source code scanning for 'TODO' and 'FIXME' in pipeline screen.
[withMaven] invokerPublisher - Archive invoker results for Maven artifact MavenArtifact{org.apache.maven.plugins:maven-compiler-plugin:maven-plugin:3.10.0(version: 3.10.0, snapshot:false) } generated by PluginInvocation{org.apache.maven.plugins:maven-invoker-plugin:3.2.2@integration-test  integration-test}: windows-jdk11-m3.6.x_build\target\invoker-reports\*.xml
ERROR: [withMaven] invokerPublisher - Silently ignore exception archiving Invoker runs for Maven artifact MavenArtifact{org.apache.maven.plugins:maven-compiler-plugin:maven-plugin:3.10.0(version: 3.10.0, snapshot:false) } generated by PluginInvocation{org.apache.maven.plugins:maven-invoker-plugin:3.2.2@integration-test  integration-test}: java.io.IOException: Unknown attribute 'buildlog' for tag 'build-job' (position: START_TAG seen ...2\windows-jdk11-m3.6.x_build\target\it\MCOMPILER-129\build.log" />... @2:263) 
[withMaven] Publishers: Generated Artifacts Publisher: 757 ms, Junit Publisher: 427 ms, Open Task Scanner Publisher: 1 ms, Invoker Publisher: 677 ms
[Pipeline] // withMaven
[Pipeline] cleanWs
[WS-CLEANUP] Deleting project workspace...
[WS-CLEANUP] Deferred wipeout is used...
[WS-CLEANUP] done
[Pipeline] }
[Pipeline] // stage
[Pipeline] }
[Pipeline] // ws
[Pipeline] }
[Pipeline] // node
[Pipeline] }
[Pipeline] // parallel
[Pipeline] stage
[Pipeline] { (Notifications)
[Pipeline] echo
Build result: FAILURE
[Pipeline] jiraIssueSelector
[Pipeline] echo
The authors of changes [olamy].
[Pipeline] echo
Sending email ...
[Pipeline] emailext

Build failed in Jenkins: Maven » The Apache Software Foundation » maven-compiler-plugin » master #27

Posted by Apache Jenkins Server <je...@builds.apache.org>.
See https://ci-maven.apache.org/job/Maven/job/maven-github/job/maven-compiler-plugin/job/master/27/

Changes:

* use github

All tests passed

Build log:
[...truncated 13214 lines...]
[INFO] 
[INFO] --- maven-checkstyle-plugin:3.0.0:check (checkstyle-check) @ maven-compiler-plugin ---
[INFO] run post-build script verify.groovy
[INFO]           MCOMPILER-366\pom.xml ............................ SUCCESS (4.2 s)
[INFO] Building: MCOMPILER-373_mrjar\pom.xml
[INFO] There are 2 errors reported by Checkstyle 6.18 with config/maven_checks.xml ruleset.
[INFO] Ignored 2 errors, 0 violation remaining.
[INFO] 
[INFO] --- maven-invoker-plugin:3.2.2:verify (integration-test) @ maven-compiler-plugin ---
[INFO] -------------------------------------------------
[INFO] Build Summary:
[INFO]   Passed: 59, Failed: 0, Errors: 0, Skipped: 3
[INFO] -------------------------------------------------
[ERROR] The following builds was skipped:
[ERROR] *  MCOMPILER-197/pom.xml
[ERROR] *  groovy-project-with-new-plexus-compiler/pom.xml
[ERROR] *  default-fork-windows/pom.xml
[INFO] -------------------------------------------------
[INFO] ------------------------------------------------------------------------
[INFO] BUILD SUCCESS
[INFO] ------------------------------------------------------------------------
[INFO] Total time:  08:16 min
[INFO] Finished at: 2022-02-11T08:20:55Z
[INFO] ------------------------------------------------------------------------
[INFO] [jenkins-event-spy] Generated /home/jenkins/jenkins-home/workspace/hub_maven-compiler-plugin_master@2@tmp/withMaven931f164a/maven-spy-20220211-081238-2331211389711651623912.log
[Pipeline] }
[Pipeline] // dir
[Pipeline] }
[withMaven] artifactsPublisher - Archive artifact linux-jdk11-m3.6.x_build/pom.xml under org/apache/maven/plugins/maven-compiler-plugin/3.10.0-SNAPSHPOT/maven-compiler-plugin-3.10.0-SNAPSHPOT.pom
[withMaven] artifactsPublisher - Archive artifact linux-jdk11-m3.6.x_build/target/maven-compiler-plugin-3.10.0-SNAPSHPOT.jar under org/apache/maven/plugins/maven-compiler-plugin/3.10.0-SNAPSHPOT/maven-compiler-plugin-3.10.0-SNAPSHPOT.jar
[withMaven] junitPublisher - Archive test results for Maven artifact org.apache.maven.plugins:maven-compiler-plugin:maven-plugin:3.10.0-SNAPSHPOT generated by maven-surefire-plugin:test (default-test): linux-jdk11-m3.6.x_build/target/surefire-reports/*.xml
Recording test results
[withMaven] Jenkins Task Scanner Plugin not found, don't display results of source code scanning for 'TODO' and 'FIXME' in pipeline screen.
[withMaven] invokerPublisher - Archive invoker results for Maven artifact MavenArtifact{org.apache.maven.plugins:maven-compiler-plugin:maven-plugin:3.10.0-SNAPSHPOT(version: 3.10.0-SNAPSHPOT, snapshot:false) } generated by PluginInvocation{org.apache.maven.plugins:maven-invoker-plugin:3.2.2@integration-test  integration-test}: linux-jdk11-m3.6.x_build/target/invoker-reports/*.xml
ERROR: [withMaven] invokerPublisher - Silently ignore exception archiving Invoker runs for Maven artifact MavenArtifact{org.apache.maven.plugins:maven-compiler-plugin:maven-plugin:3.10.0-SNAPSHPOT(version: 3.10.0-SNAPSHPOT, snapshot:false) } generated by PluginInvocation{org.apache.maven.plugins:maven-invoker-plugin:3.2.2@integration-test  integration-test}: java.io.IOException: Unknown attribute 'buildlog' for tag 'build-job' (position: START_TAG seen ...r@2/linux-jdk11-m3.6.x_build/target/it/MCOMPILER-129/build.log" />... @2:255) 
[withMaven] Publishers: Generated Artifacts Publisher: 51 ms, Junit Publisher: 27 ms, Open Task Scanner Publisher: 2 ms, Invoker Publisher: 139 ms
[Pipeline] // withMaven
[Pipeline] cleanWs
[WS-CLEANUP] Deleting project workspace...
[WS-CLEANUP] Deferred wipeout is used...
[WS-CLEANUP] done
[Pipeline] }
[Pipeline] // stage
[Pipeline] }
[Pipeline] // ws
[Pipeline] }
[Pipeline] // node
[Pipeline] }
[INFO]           MCOMPILER-373_mrjar\pom.xml ...................... SUCCESS (4.4 s)
[INFO] Building: MCOMPILER-379\pom.xml
[INFO] run post-build script verify.groovy
[INFO]           mcompiler-21_methodname-change\pom.xml ........... SUCCESS (8.2 s)
[INFO] Building: MCOMPILER-224\pom.xml
[INFO] run post-build script verify.groovy
[INFO]           MCOMPILER-224\pom.xml ............................ SUCCESS (3.4 s)
[INFO] Building: MCOMPILER-228\pom.xml
[INFO]           MCOMPILER-379\pom.xml ............................ SUCCESS (3.6 s)
[INFO] Building: MCOMPILER-474_recompile-dependent-when-package\pom.xml
[INFO]           MCOMPILER-228\pom.xml ............................ SUCCESS (2.8 s)
[INFO] Building: MCOMPILER-260_customArguments\pom.xml
[INFO]           MCOMPILER-260_customArguments\pom.xml ............ SUCCESS (2.8 s)
[INFO] Building: MCOMPILER-268_modulepath\pom.xml
[INFO] run post-build script verify.groovy
[INFO]           MCOMPILER-474_recompile-dependent-when-package\pom.xml SUCCESS (12.6 s)
[INFO] Building: MCOMPILER-481-requires-static-included\pom.xml
[INFO] run post-build script verify.groovy
[INFO]           MCOMPILER-268_modulepath\pom.xml ................. SUCCESS (11.5 s)
[INFO] Building: MCOMPILER-270_release\pom.xml
[INFO]           MCOMPILER-481-requires-static-included\pom.xml ... SUCCESS (7.3 s)
[INFO] Building: multirelease-patterns\multimodule\pom.xml
[INFO] run post-build script verify.groovy
[INFO]           MCOMPILER-270_release\pom.xml .................... SUCCESS (3.2 s)
[INFO] Building: MCOMPILER-272\pom.xml
[INFO]           MCOMPILER-272\pom.xml ............................ SUCCESS (3.3 s)
[INFO] Building: MCOMPILER-275_separate-moduleinfo\pom.xml
[INFO] run post-build script verify.groovy
[INFO]           multirelease-patterns\multimodule\pom.xml ........ SUCCESS (10.2 s)
[INFO] Building: multirelease-patterns\multiproject\pom.xml
[INFO] run post-build script verify.groovy
[INFO]           MCOMPILER-275_separate-moduleinfo\pom.xml ........ SUCCESS (12.1 s)
[INFO] Building: MCOMPILER-284\pom.xml
[INFO] run post-build script verify.bsh
[INFO]           MCOMPILER-284\pom.xml ............................ SUCCESS (2.4 s)
[INFO] Building: MCOMPILER-294\pom.xml
[INFO]           MCOMPILER-294\pom.xml ............................ SUCCESS (3.0 s)
[INFO] Building: MCOMPILER-298\pom.xml
[INFO]           MCOMPILER-298\pom.xml ............................ SUCCESS (12.5 s)
[INFO] Building: MCOMPILER-321_pathexceptions\pom.xml
[INFO] run post-build script verify.groovy
[INFO]           multirelease-patterns\multiproject\pom.xml ....... SUCCESS (25.1 s)
[INFO] Building: multirelease-patterns\packaging-plugin\pom.xml
[INFO] run post-build script verify.groovy
[INFO]           multirelease-patterns\packaging-plugin\pom.xml ... SUCCESS (10.1 s)
[INFO] Building: multirelease-patterns\singleproject-runtime\pom.xml
[INFO] run post-build script verify.groovy
[INFO]           MCOMPILER-321_pathexceptions\pom.xml ............. SUCCESS (11.3 s)
[INFO] Building: MCOMPILER-328_multiReleaseOutput\pom.xml
[INFO] run post-build script verify.groovy
[INFO]           MCOMPILER-328_multiReleaseOutput\pom.xml ......... SUCCESS (2.9 s)
[INFO] Building: MCOMPILER-336_incremental-modulepath\pom.xml
[INFO] run post-build script verify.groovy
[INFO]           multirelease-patterns\singleproject-runtime\pom.xml SUCCESS (7.5 s)
[INFO] Building: multirelease-patterns\singleproject-toolchains\pom.xml
[INFO]           MCOMPILER-336_incremental-modulepath\pom.xml ..... SUCCESS (7.2 s)
[INFO] Building: MCOMPILER-349_dependencyChanged\pom.xml
[INFO] run post-build script verify.groovy
[INFO]           multirelease-patterns\singleproject-toolchains\pom.xml SUCCESS (9.7 s)
[INFO] Building: non-english-warnings\pom.xml
[INFO] run post-build script verify.bsh
[INFO]           non-english-warnings\pom.xml ..................... SUCCESS (3.9 s)
[INFO] Building: test1\pom.xml
[INFO]           test1\pom.xml .................................... SUCCESS (3.8 s)
[INFO] 
[INFO] --- maven-checkstyle-plugin:3.0.0:check (checkstyle-check) @ maven-compiler-plugin ---
[INFO] There are 2 errors reported by Checkstyle 6.18 with config/maven_checks.xml ruleset.
[INFO] Ignored 2 errors, 0 violation remaining.
[INFO] 
[INFO] --- maven-invoker-plugin:3.2.2:verify (integration-test) @ maven-compiler-plugin ---
[INFO] -------------------------------------------------
[INFO] Build Summary:
[INFO]   Passed: 59, Failed: 0, Errors: 0, Skipped: 3
[INFO] -------------------------------------------------
[ERROR] The following builds was skipped:
[ERROR] *  default-fork\pom.xml
[ERROR] *  groovy-project-with-new-plexus-compiler\pom.xml
[ERROR] *  MCOMPILER-197\pom.xml
[INFO] -------------------------------------------------
[INFO] ------------------------------------------------------------------------
[INFO] BUILD SUCCESS
[INFO] ------------------------------------------------------------------------
[INFO] Total time:  06:20 min
[INFO] Finished at: 2022-02-11T00:22:33-08:00
[INFO] ------------------------------------------------------------------------
[INFO] [jenkins-event-spy] Generated F:\jenkins\jenkins-slave\82467a7c\workspace\hub_maven-compiler-plugin_master@2@tmp\withMavenf79b610b\maven-spy-20220211-001613-1325041502770376088261.log
[Pipeline] }
[Pipeline] // dir
[Pipeline] }
[withMaven] artifactsPublisher - Archive artifact windows-jdk17-m3.6.x_build\pom.xml under org\apache\maven\plugins\maven-compiler-plugin\3.10.0-SNAPSHPOT\maven-compiler-plugin-3.10.0-SNAPSHPOT.pom
[withMaven] artifactsPublisher - Archive artifact windows-jdk17-m3.6.x_build\target\maven-compiler-plugin-3.10.0-SNAPSHPOT.jar under org\apache\maven\plugins\maven-compiler-plugin\3.10.0-SNAPSHPOT\maven-compiler-plugin-3.10.0-SNAPSHPOT.jar
[withMaven] junitPublisher - Archive test results for Maven artifact org.apache.maven.plugins:maven-compiler-plugin:maven-plugin:3.10.0-SNAPSHPOT generated by maven-surefire-plugin:test (default-test): windows-jdk17-m3.6.x_build\target\surefire-reports\*.xml
Recording test results
[withMaven] Jenkins Task Scanner Plugin not found, don't display results of source code scanning for 'TODO' and 'FIXME' in pipeline screen.
[withMaven] invokerPublisher - Archive invoker results for Maven artifact MavenArtifact{org.apache.maven.plugins:maven-compiler-plugin:maven-plugin:3.10.0-SNAPSHPOT(version: 3.10.0-SNAPSHPOT, snapshot:false) } generated by PluginInvocation{org.apache.maven.plugins:maven-invoker-plugin:3.2.2@integration-test  integration-test}: windows-jdk17-m3.6.x_build\target\invoker-reports\*.xml
[INFO] run post-build script verify.groovy
[INFO]           MCOMPILER-349_dependencyChanged\pom.xml .......... SUCCESS (17.3 s)
[INFO] Building: MCOMPILER-360\pom.xml
ERROR: [withMaven] invokerPublisher - Silently ignore exception archiving Invoker runs for Maven artifact MavenArtifact{org.apache.maven.plugins:maven-compiler-plugin:maven-plugin:3.10.0-SNAPSHPOT(version: 3.10.0-SNAPSHPOT, snapshot:false) } generated by PluginInvocation{org.apache.maven.plugins:maven-invoker-plugin:3.2.2@integration-test  integration-test}: java.io.IOException: Unknown attribute 'buildlog' for tag 'build-job' (position: START_TAG seen ...2\windows-jdk17-m3.6.x_build\target\it\MCOMPILER-129\build.log" />... @2:263) 
[withMaven] Publishers: Generated Artifacts Publisher: 733 ms, Junit Publisher: 426 ms, Open Task Scanner Publisher: 1 ms, Invoker Publisher: 715 ms
[INFO]           MCOMPILER-360\pom.xml ............................ SUCCESS (2.7 s)
[INFO] Building: MCOMPILER-366\pom.xml
[Pipeline] // withMaven
[Pipeline] cleanWs
[WS-CLEANUP] Deleting project workspace...
[WS-CLEANUP] Deferred wipeout is used...
[WS-CLEANUP] done
[Pipeline] }
[Pipeline] // stage
[Pipeline] }
[Pipeline] // ws
[Pipeline] }
[Pipeline] // node
[Pipeline] }
[INFO] run post-build script verify.groovy
[INFO]           MCOMPILER-366\pom.xml ............................ SUCCESS (11.4 s)
[INFO] Building: MCOMPILER-373_mrjar\pom.xml
[INFO]           MCOMPILER-373_mrjar\pom.xml ...................... SUCCESS (3.1 s)
[INFO] Building: MCOMPILER-379\pom.xml
[INFO]           MCOMPILER-379\pom.xml ............................ SUCCESS (2.9 s)
[INFO] Building: MCOMPILER-474_recompile-dependent-when-package\pom.xml
[INFO] run post-build script verify.groovy
[INFO]           MCOMPILER-474_recompile-dependent-when-package\pom.xml SUCCESS (10.0 s)
[INFO] Building: MCOMPILER-481-requires-static-included\pom.xml
[INFO]           MCOMPILER-481-requires-static-included\pom.xml ... SUCCESS (14.7 s)
[INFO] Building: multirelease-patterns\multimodule\pom.xml
[INFO] run post-build script verify.groovy
[INFO]           multirelease-patterns\multimodule\pom.xml ........ SUCCESS (18.0 s)
[INFO] Building: multirelease-patterns\multiproject\pom.xml
[INFO] run post-build script verify.groovy
[INFO]           multirelease-patterns\multiproject\pom.xml ....... SUCCESS (44.9 s)
[INFO] Building: multirelease-patterns\packaging-plugin\pom.xml
[INFO] run post-build script verify.groovy
[INFO]           multirelease-patterns\packaging-plugin\pom.xml ... SUCCESS (19.4 s)
[INFO] Building: multirelease-patterns\singleproject-runtime\pom.xml
[INFO] run post-build script verify.groovy
[INFO]           multirelease-patterns\singleproject-runtime\pom.xml SUCCESS (14.0 s)
[INFO] Building: multirelease-patterns\singleproject-toolchains\pom.xml
[INFO] run post-build script verify.groovy
[INFO]           multirelease-patterns\singleproject-toolchains\pom.xml SUCCESS (16.2 s)
[INFO] Building: non-english-warnings\pom.xml
[INFO] run post-build script verify.bsh
[INFO]           non-english-warnings\pom.xml ..................... SUCCESS (3.0 s)
[INFO] Building: test1\pom.xml
[INFO]           test1\pom.xml .................................... SUCCESS (11.0 s)
[INFO] 
[INFO] --- maven-checkstyle-plugin:3.0.0:check (checkstyle-check) @ maven-compiler-plugin ---
[INFO] There are 2 errors reported by Checkstyle 6.18 with config/maven_checks.xml ruleset.
[INFO] Ignored 2 errors, 0 violation remaining.
[INFO] 
[INFO] --- maven-invoker-plugin:3.2.2:verify (integration-test) @ maven-compiler-plugin ---
[INFO] -------------------------------------------------
[INFO] Build Summary:
[INFO]   Passed: 59, Failed: 0, Errors: 0, Skipped: 3
[INFO] -------------------------------------------------
[ERROR] The following builds was skipped:
[ERROR] *  default-fork\pom.xml
[ERROR] *  groovy-project-with-new-plexus-compiler\pom.xml
[ERROR] *  MCOMPILER-197\pom.xml
[INFO] -------------------------------------------------
[INFO] ------------------------------------------------------------------------
[INFO] BUILD SUCCESS
[INFO] ------------------------------------------------------------------------
[INFO] Total time:  09:46 min
[INFO] Finished at: 2022-02-11T08:25:27Z
[INFO] ------------------------------------------------------------------------
[INFO] [jenkins-event-spy] Generated F:\jenkins\jenkins-home\82467a7c\workspace\hub_maven-compiler-plugin_master@2@tmp\withMaven1973fa50\maven-spy-20220211-081532-3404017665229243035646.log
[Pipeline] }
[Pipeline] // dir
[Pipeline] }
[withMaven] artifactsPublisher - Archive artifact windows-jdk11-m3.6.x_build\pom.xml under org\apache\maven\plugins\maven-compiler-plugin\3.10.0-SNAPSHPOT\maven-compiler-plugin-3.10.0-SNAPSHPOT.pom
[withMaven] artifactsPublisher - Archive artifact windows-jdk11-m3.6.x_build\target\maven-compiler-plugin-3.10.0-SNAPSHPOT.jar under org\apache\maven\plugins\maven-compiler-plugin\3.10.0-SNAPSHPOT\maven-compiler-plugin-3.10.0-SNAPSHPOT.jar
[withMaven] junitPublisher - Archive test results for Maven artifact org.apache.maven.plugins:maven-compiler-plugin:maven-plugin:3.10.0-SNAPSHPOT generated by maven-surefire-plugin:test (default-test): windows-jdk11-m3.6.x_build\target\surefire-reports\*.xml
Recording test results
[withMaven] Jenkins Task Scanner Plugin not found, don't display results of source code scanning for 'TODO' and 'FIXME' in pipeline screen.
[withMaven] invokerPublisher - Archive invoker results for Maven artifact MavenArtifact{org.apache.maven.plugins:maven-compiler-plugin:maven-plugin:3.10.0-SNAPSHPOT(version: 3.10.0-SNAPSHPOT, snapshot:false) } generated by PluginInvocation{org.apache.maven.plugins:maven-invoker-plugin:3.2.2@integration-test  integration-test}: windows-jdk11-m3.6.x_build\target\invoker-reports\*.xml
ERROR: [withMaven] invokerPublisher - Silently ignore exception archiving Invoker runs for Maven artifact MavenArtifact{org.apache.maven.plugins:maven-compiler-plugin:maven-plugin:3.10.0-SNAPSHPOT(version: 3.10.0-SNAPSHPOT, snapshot:false) } generated by PluginInvocation{org.apache.maven.plugins:maven-invoker-plugin:3.2.2@integration-test  integration-test}: java.io.IOException: Unknown attribute 'buildlog' for tag 'build-job' (position: START_TAG seen ...2\windows-jdk11-m3.6.x_build\target\it\MCOMPILER-129\build.log" />... @2:264) 
[withMaven] Publishers: Generated Artifacts Publisher: 104 ms, Junit Publisher: 53 ms, Open Task Scanner Publisher: 1 ms, Invoker Publisher: 433 ms
[Pipeline] // withMaven
[Pipeline] cleanWs
[WS-CLEANUP] Deleting project workspace...
[WS-CLEANUP] Deferred wipeout is used...
[WS-CLEANUP] done
[Pipeline] }
[Pipeline] // stage
[Pipeline] }
[Pipeline] // ws
[Pipeline] }
[Pipeline] // node
[Pipeline] }
[Pipeline] // parallel
[Pipeline] stage
[Pipeline] { (Notifications)
[Pipeline] echo
Build result: FAILURE
[Pipeline] jiraIssueSelector
[Pipeline] echo
The authors of changes [olamy].
[Pipeline] echo
Sending email ...
[Pipeline] emailext

Build failed in Jenkins: Maven » The Apache Software Foundation » maven-compiler-plugin » master #26

Posted by Apache Jenkins Server <je...@builds.apache.org>.
See https://ci-maven.apache.org/job/Maven/job/maven-github/job/maven-compiler-plugin/job/master/26/

Changes:

* back to snapshot again

All tests passed

Build log:
[...truncated 13233 lines...]
[INFO] [jenkins-event-spy] Generated F:\jenkins\jenkins-slave\82467a7c\workspace\hub_maven-compiler-plugin_master@2@tmp\withMavenc3c5898c\maven-spy-20220211-001225-2231823218348645839741.log
Picked up JAVA_TOOL_OPTIONS: -Dmaven.ext.class.path="f:\jenkins\jenkins-slave\82467a7c\workspace\hub_maven-compiler-plugin_master@2@tmp\withMavenc3c5898c\pipeline-maven-spy.jar" -Dorg.jenkinsci.plugins.pipeline.maven.reportsFolder="f:\jenkins\jenkins-slave\82467a7c\workspace\hub_maven-compiler-plugin_master@2@tmp\withMavenc3c5898c" 
[Pipeline] }
[Pipeline] // dir
[Pipeline] }
[INFO] run post-build script verify.groovy
[INFO]           default-incremental-disable/pom.xml .............. SUCCESS (8.2 s)
[INFO] Building: automodules-manifest/pom.xml
[withMaven] artifactsPublisher - Archive artifact windows-jdk8-m3.5.x_build\pom.xml under org\apache\maven\plugins\maven-compiler-plugin\3.10.0-SNAPSHPOT\maven-compiler-plugin-3.10.0-SNAPSHPOT.pom
[INFO] run post-build script verify.groovy
[INFO]           MCOMPILER-275_separate-moduleinfo\pom.xml ........ SUCCESS (5.5 s)
[INFO] Building: MCOMPILER-284\pom.xml
[withMaven] artifactsPublisher - Archive artifact windows-jdk8-m3.5.x_build\target\maven-compiler-plugin-3.10.0-SNAPSHPOT.jar under org\apache\maven\plugins\maven-compiler-plugin\3.10.0-SNAPSHPOT\maven-compiler-plugin-3.10.0-SNAPSHPOT.jar
[INFO] run post-build script verify.groovy
[INFO]           automodules-manifest/pom.xml ..................... SUCCESS (4.3 s)
[INFO] Building: mcompiler-179/pom.xml
[INFO] run post-build script verify.bsh
[INFO]           MCOMPILER-284\pom.xml ............................ SUCCESS (3.1 s)
[INFO] Building: MCOMPILER-294\pom.xml
[withMaven] junitPublisher - Archive test results for Maven artifact org.apache.maven.plugins:maven-compiler-plugin:maven-plugin:3.10.0-SNAPSHPOT generated by maven-surefire-plugin:test (default-test): windows-jdk8-m3.5.x_build\target\surefire-reports\*.xml
Recording test results
[INFO] run post-build script verify.groovy
[INFO]           mcompiler-179/pom.xml ............................ SUCCESS (3.7 s)
[INFO] 
[INFO] --- maven-checkstyle-plugin:3.0.0:check (checkstyle-check) @ maven-compiler-plugin ---
[INFO] run post-build script verify.groovy
[INFO]           multirelease-patterns\multiproject\pom.xml ....... SUCCESS (18.6 s)
[INFO] Building: multirelease-patterns\packaging-plugin\pom.xml
[INFO]           MCOMPILER-294\pom.xml ............................ SUCCESS (4.3 s)
[INFO] Building: MCOMPILER-298\pom.xml
[INFO] There are 2 errors reported by Checkstyle 6.18 with config/maven_checks.xml ruleset.
[INFO] Ignored 2 errors, 0 violation remaining.
[INFO] 
[INFO] --- maven-invoker-plugin:3.2.2:verify (integration-test) @ maven-compiler-plugin ---
[INFO] -------------------------------------------------
[INFO] Build Summary:
[INFO]   Passed: 59, Failed: 0, Errors: 0, Skipped: 3
[INFO] -------------------------------------------------
[ERROR] The following builds was skipped:
[ERROR] *  MCOMPILER-197/pom.xml
[ERROR] *  groovy-project-with-new-plexus-compiler/pom.xml
[ERROR] *  default-fork-windows/pom.xml
[INFO] -------------------------------------------------
[INFO] ------------------------------------------------------------------------
[INFO] BUILD SUCCESS
[INFO] ------------------------------------------------------------------------
[INFO] Total time:  06:59 min
[INFO] Finished at: 2022-02-11T08:15:59Z
[INFO] ------------------------------------------------------------------------
[INFO] [jenkins-event-spy] Generated /home/jenkins/jenkins-home/workspace/hub_maven-compiler-plugin_master@2@2@tmp/withMaven982fe86e/maven-spy-20220211-080859-13711812992627383265341.log
[Pipeline] }
[Pipeline] // dir
[Pipeline] }
[withMaven] artifactsPublisher - Archive artifact linux-jdk11-m3.6.x_build/pom.xml under org/apache/maven/plugins/maven-compiler-plugin/3.10.0-SNAPSHPOT/maven-compiler-plugin-3.10.0-SNAPSHPOT.pom
[withMaven] artifactsPublisher - Archive artifact linux-jdk11-m3.6.x_build/target/maven-compiler-plugin-3.10.0-SNAPSHPOT.jar under org/apache/maven/plugins/maven-compiler-plugin/3.10.0-SNAPSHPOT/maven-compiler-plugin-3.10.0-SNAPSHPOT.jar
[withMaven] junitPublisher - Archive test results for Maven artifact org.apache.maven.plugins:maven-compiler-plugin:maven-plugin:3.10.0-SNAPSHPOT generated by maven-surefire-plugin:test (default-test): linux-jdk11-m3.6.x_build/target/surefire-reports/*.xml
Recording test results
[withMaven] Jenkins Task Scanner Plugin not found, don't display results of source code scanning for 'TODO' and 'FIXME' in pipeline screen.
[withMaven] invokerPublisher - Archive invoker results for Maven artifact MavenArtifact{org.apache.maven.plugins:maven-compiler-plugin:maven-plugin:3.10.0-SNAPSHPOT(version: 3.10.0-SNAPSHPOT, snapshot:false) } generated by PluginInvocation{org.apache.maven.plugins:maven-invoker-plugin:3.2.2@integration-test  integration-test}: linux-jdk11-m3.6.x_build/target/invoker-reports/*.xml
ERROR: [withMaven] invokerPublisher - Silently ignore exception archiving Invoker runs for Maven artifact MavenArtifact{org.apache.maven.plugins:maven-compiler-plugin:maven-plugin:3.10.0-SNAPSHPOT(version: 3.10.0-SNAPSHPOT, snapshot:false) } generated by PluginInvocation{org.apache.maven.plugins:maven-invoker-plugin:3.2.2@integration-test  integration-test}: java.io.IOException: Unknown attribute 'buildlog' for tag 'build-job' (position: START_TAG seen ...2@2/linux-jdk11-m3.6.x_build/target/it/MCOMPILER-129/build.log" />... @2:257) 
[withMaven] Publishers: Generated Artifacts Publisher: 43 ms, Junit Publisher: 22 ms, Open Task Scanner Publisher: 6 ms, Invoker Publisher: 139 ms, Pipeline Graph Publisher: 2 ms
[Pipeline] // withMaven
[Pipeline] cleanWs
[WS-CLEANUP] Deleting project workspace...
[WS-CLEANUP] Deferred wipeout is used...
[WS-CLEANUP] done
[Pipeline] }
[Pipeline] // stage
[Pipeline] }
[Pipeline] // ws
[Pipeline] }
[Pipeline] // node
[Pipeline] }
[withMaven] Jenkins Task Scanner Plugin not found, don't display results of source code scanning for 'TODO' and 'FIXME' in pipeline screen.
[withMaven] invokerPublisher - Archive invoker results for Maven artifact MavenArtifact{org.apache.maven.plugins:maven-compiler-plugin:maven-plugin:3.10.0-SNAPSHPOT(version: 3.10.0-SNAPSHPOT, snapshot:false) } generated by PluginInvocation{org.apache.maven.plugins:maven-invoker-plugin:3.2.2@integration-test  integration-test}: windows-jdk8-m3.5.x_build\target\invoker-reports\*.xml
ERROR: [withMaven] invokerPublisher - Silently ignore exception archiving Invoker runs for Maven artifact MavenArtifact{org.apache.maven.plugins:maven-compiler-plugin:maven-plugin:3.10.0-SNAPSHPOT(version: 3.10.0-SNAPSHPOT, snapshot:false) } generated by PluginInvocation{org.apache.maven.plugins:maven-invoker-plugin:3.2.2@integration-test  integration-test}: java.io.IOException: Unknown attribute 'buildlog' for tag 'build-job' (position: START_TAG seen ...@2\windows-jdk8-m3.5.x_build\target\it\MCOMPILER-129\build.log" />... @2:262) 
[withMaven] Publishers: Generated Artifacts Publisher: 4742 ms, Junit Publisher: 5568 ms, Open Task Scanner Publisher: 1 ms, Invoker Publisher: 684 ms
[Pipeline] // withMaven
[Pipeline] cleanWs
[WS-CLEANUP] Deleting project workspace...
[WS-CLEANUP] Deferred wipeout is used...
[WS-CLEANUP] done
[Pipeline] }
[Pipeline] // stage
[Pipeline] }
[Pipeline] // ws
[Pipeline] }
[Pipeline] // node
[Pipeline] }
[INFO]           MCOMPILER-298\pom.xml ............................ SUCCESS (5.2 s)
[INFO] Building: MCOMPILER-321_pathexceptions\pom.xml
[INFO] run post-build script verify.groovy
[INFO]           multirelease-patterns\packaging-plugin\pom.xml ... SUCCESS (10.2 s)
[INFO] Building: multirelease-patterns\singleproject-runtime\pom.xml
[INFO] run post-build script verify.groovy
[INFO]           MCOMPILER-321_pathexceptions\pom.xml ............. SUCCESS (4.1 s)
[INFO] Building: MCOMPILER-328_multiReleaseOutput\pom.xml
[INFO] run post-build script verify.groovy
[INFO]           multirelease-patterns\singleproject-runtime\pom.xml SUCCESS (5.5 s)
[INFO] Building: multirelease-patterns\singleproject-toolchains\pom.xml
[INFO] run post-build script verify.groovy
[INFO]           MCOMPILER-328_multiReleaseOutput\pom.xml ......... SUCCESS (4.0 s)
[INFO] Building: MCOMPILER-336_incremental-modulepath\pom.xml
[INFO] run post-build script verify.groovy
[INFO]           multirelease-patterns\singleproject-toolchains\pom.xml SUCCESS (7.4 s)
[INFO] Building: non-english-warnings\pom.xml
[INFO]           MCOMPILER-336_incremental-modulepath\pom.xml ..... SUCCESS (9.7 s)
[INFO] Building: MCOMPILER-349_dependencyChanged\pom.xml
[INFO] run post-build script verify.bsh
[INFO]           non-english-warnings\pom.xml ..................... SUCCESS (2.6 s)
[INFO] Building: test1\pom.xml
[INFO]           test1\pom.xml .................................... SUCCESS (2.8 s)
[INFO] 
[INFO] --- maven-checkstyle-plugin:3.0.0:check (checkstyle-check) @ maven-compiler-plugin ---
[INFO] There are 2 errors reported by Checkstyle 6.18 with config/maven_checks.xml ruleset.
[INFO] Ignored 2 errors, 0 violation remaining.
[INFO] 
[INFO] --- maven-invoker-plugin:3.2.2:verify (integration-test) @ maven-compiler-plugin ---
[INFO] -------------------------------------------------
[INFO] Build Summary:
[INFO]   Passed: 59, Failed: 0, Errors: 0, Skipped: 3
[INFO] -------------------------------------------------
[ERROR] The following builds was skipped:
[ERROR] *  default-fork\pom.xml
[ERROR] *  groovy-project-with-new-plexus-compiler\pom.xml
[ERROR] *  MCOMPILER-197\pom.xml
[INFO] -------------------------------------------------
[INFO] ------------------------------------------------------------------------
[INFO] BUILD SUCCESS
[INFO] ------------------------------------------------------------------------
[INFO] Total time:  04:49 min
[INFO] Finished at: 2022-02-11T08:16:26Z
[INFO] ------------------------------------------------------------------------
[INFO] [jenkins-event-spy] Generated F:\jenkins\jenkins-home\82467a7c\workspace\hub_maven-compiler-plugin_master@2@tmp\withMavencf745c67\maven-spy-20220211-081136-62114278235359813076946.log
[Pipeline] }
[Pipeline] // dir
[Pipeline] }
[withMaven] artifactsPublisher - Archive artifact windows-jdk11-m3.6.x_build\pom.xml under org\apache\maven\plugins\maven-compiler-plugin\3.10.0-SNAPSHPOT\maven-compiler-plugin-3.10.0-SNAPSHPOT.pom
[withMaven] artifactsPublisher - Archive artifact windows-jdk11-m3.6.x_build\target\maven-compiler-plugin-3.10.0-SNAPSHPOT.jar under org\apache\maven\plugins\maven-compiler-plugin\3.10.0-SNAPSHPOT\maven-compiler-plugin-3.10.0-SNAPSHPOT.jar
[withMaven] junitPublisher - Archive test results for Maven artifact org.apache.maven.plugins:maven-compiler-plugin:maven-plugin:3.10.0-SNAPSHPOT generated by maven-surefire-plugin:test (default-test): windows-jdk11-m3.6.x_build\target\surefire-reports\*.xml
Recording test results
[withMaven] Jenkins Task Scanner Plugin not found, don't display results of source code scanning for 'TODO' and 'FIXME' in pipeline screen.
[withMaven] invokerPublisher - Archive invoker results for Maven artifact MavenArtifact{org.apache.maven.plugins:maven-compiler-plugin:maven-plugin:3.10.0-SNAPSHPOT(version: 3.10.0-SNAPSHPOT, snapshot:false) } generated by PluginInvocation{org.apache.maven.plugins:maven-invoker-plugin:3.2.2@integration-test  integration-test}: windows-jdk11-m3.6.x_build\target\invoker-reports\*.xml
ERROR: [withMaven] invokerPublisher - Silently ignore exception archiving Invoker runs for Maven artifact MavenArtifact{org.apache.maven.plugins:maven-compiler-plugin:maven-plugin:3.10.0-SNAPSHPOT(version: 3.10.0-SNAPSHPOT, snapshot:false) } generated by PluginInvocation{org.apache.maven.plugins:maven-invoker-plugin:3.2.2@integration-test  integration-test}: java.io.IOException: Unknown attribute 'buildlog' for tag 'build-job' (position: START_TAG seen ...2\windows-jdk11-m3.6.x_build\target\it\MCOMPILER-129\build.log" />... @2:263) 
[withMaven] Publishers: Generated Artifacts Publisher: 78 ms, Junit Publisher: 51 ms, Open Task Scanner Publisher: 1 ms, Invoker Publisher: 303 ms
[Pipeline] // withMaven
[Pipeline] cleanWs
[WS-CLEANUP] Deleting project workspace...
[WS-CLEANUP] Deferred wipeout is used...
[WS-CLEANUP] done
[Pipeline] }
[Pipeline] // stage
[Pipeline] }
[Pipeline] // ws
[Pipeline] }
[Pipeline] // node
[Pipeline] }
[INFO] run post-build script verify.groovy
[INFO]           MCOMPILER-349_dependencyChanged\pom.xml .......... SUCCESS (11.9 s)
[INFO] Building: MCOMPILER-360\pom.xml
[INFO]           MCOMPILER-360\pom.xml ............................ SUCCESS (3.5 s)
[INFO] Building: MCOMPILER-366\pom.xml
[INFO] run post-build script verify.groovy
[INFO]           MCOMPILER-366\pom.xml ............................ SUCCESS (4.2 s)
[INFO] Building: MCOMPILER-373_mrjar\pom.xml
[INFO]           MCOMPILER-373_mrjar\pom.xml ...................... SUCCESS (4.3 s)
[INFO] Building: MCOMPILER-379\pom.xml
[INFO]           MCOMPILER-379\pom.xml ............................ SUCCESS (3.5 s)
[INFO] Building: MCOMPILER-474_recompile-dependent-when-package\pom.xml
[INFO] run post-build script verify.groovy
[INFO]           MCOMPILER-474_recompile-dependent-when-package\pom.xml SUCCESS (13.6 s)
[INFO] Building: MCOMPILER-481-requires-static-included\pom.xml
[INFO]           MCOMPILER-481-requires-static-included\pom.xml ... SUCCESS (7.4 s)
[INFO] Building: multirelease-patterns\multimodule\pom.xml
[INFO] run post-build script verify.groovy
[INFO]           multirelease-patterns\multimodule\pom.xml ........ SUCCESS (10.1 s)
[INFO] Building: multirelease-patterns\multiproject\pom.xml
[INFO] run post-build script verify.groovy
[INFO]           multirelease-patterns\multiproject\pom.xml ....... SUCCESS (24.5 s)
[INFO] Building: multirelease-patterns\packaging-plugin\pom.xml
[INFO] run post-build script verify.groovy
[INFO]           multirelease-patterns\packaging-plugin\pom.xml ... SUCCESS (11.6 s)
[INFO] Building: multirelease-patterns\singleproject-runtime\pom.xml
[INFO] run post-build script verify.groovy
[INFO]           multirelease-patterns\singleproject-runtime\pom.xml SUCCESS (7.5 s)
[INFO] Building: multirelease-patterns\singleproject-toolchains\pom.xml
[INFO] run post-build script verify.groovy
[INFO]           multirelease-patterns\singleproject-toolchains\pom.xml SUCCESS (9.9 s)
[INFO] Building: non-english-warnings\pom.xml
[INFO] run post-build script verify.bsh
[INFO]           non-english-warnings\pom.xml ..................... SUCCESS (3.7 s)
[INFO] Building: test1\pom.xml
[INFO]           test1\pom.xml .................................... SUCCESS (4.1 s)
[INFO] 
[INFO] --- maven-checkstyle-plugin:3.0.0:check (checkstyle-check) @ maven-compiler-plugin ---
[INFO] There are 2 errors reported by Checkstyle 6.18 with config/maven_checks.xml ruleset.
[INFO] Ignored 2 errors, 0 violation remaining.
[INFO] 
[INFO] --- maven-invoker-plugin:3.2.2:verify (integration-test) @ maven-compiler-plugin ---
[INFO] -------------------------------------------------
[INFO] Build Summary:
[INFO]   Passed: 59, Failed: 0, Errors: 0, Skipped: 3
[INFO] -------------------------------------------------
[ERROR] The following builds was skipped:
[ERROR] *  default-fork\pom.xml
[ERROR] *  groovy-project-with-new-plexus-compiler\pom.xml
[ERROR] *  MCOMPILER-197\pom.xml
[INFO] -------------------------------------------------
[INFO] ------------------------------------------------------------------------
[INFO] BUILD SUCCESS
[INFO] ------------------------------------------------------------------------
[INFO] Total time:  06:30 min
[INFO] Finished at: 2022-02-11T00:18:23-08:00
[INFO] ------------------------------------------------------------------------
[INFO] [jenkins-event-spy] Generated F:\jenkins\jenkins-slave\82467a7c\workspace\hub_maven-compiler-plugin_master@2@tmp\withMaven82a39c67\maven-spy-20220211-001152-12511864464133004057029.log
[Pipeline] }
[Pipeline] // dir
[Pipeline] }
[withMaven] artifactsPublisher - Archive artifact windows-jdk17-m3.6.x_build\pom.xml under org\apache\maven\plugins\maven-compiler-plugin\3.10.0-SNAPSHPOT\maven-compiler-plugin-3.10.0-SNAPSHPOT.pom
[withMaven] artifactsPublisher - Archive artifact windows-jdk17-m3.6.x_build\target\maven-compiler-plugin-3.10.0-SNAPSHPOT.jar under org\apache\maven\plugins\maven-compiler-plugin\3.10.0-SNAPSHPOT\maven-compiler-plugin-3.10.0-SNAPSHPOT.jar
[withMaven] junitPublisher - Archive test results for Maven artifact org.apache.maven.plugins:maven-compiler-plugin:maven-plugin:3.10.0-SNAPSHPOT generated by maven-surefire-plugin:test (default-test): windows-jdk17-m3.6.x_build\target\surefire-reports\*.xml
Recording test results
[withMaven] Jenkins Task Scanner Plugin not found, don't display results of source code scanning for 'TODO' and 'FIXME' in pipeline screen.
[withMaven] invokerPublisher - Archive invoker results for Maven artifact MavenArtifact{org.apache.maven.plugins:maven-compiler-plugin:maven-plugin:3.10.0-SNAPSHPOT(version: 3.10.0-SNAPSHPOT, snapshot:false) } generated by PluginInvocation{org.apache.maven.plugins:maven-invoker-plugin:3.2.2@integration-test  integration-test}: windows-jdk17-m3.6.x_build\target\invoker-reports\*.xml
ERROR: [withMaven] invokerPublisher - Silently ignore exception archiving Invoker runs for Maven artifact MavenArtifact{org.apache.maven.plugins:maven-compiler-plugin:maven-plugin:3.10.0-SNAPSHPOT(version: 3.10.0-SNAPSHPOT, snapshot:false) } generated by PluginInvocation{org.apache.maven.plugins:maven-invoker-plugin:3.2.2@integration-test  integration-test}: java.io.IOException: Unknown attribute 'buildlog' for tag 'build-job' (position: START_TAG seen ...2\windows-jdk17-m3.6.x_build\target\it\MCOMPILER-129\build.log" />... @2:263) 
[withMaven] Publishers: Generated Artifacts Publisher: 760 ms, Junit Publisher: 438 ms, Open Task Scanner Publisher: 1 ms, Invoker Publisher: 663 ms
[Pipeline] // withMaven
[Pipeline] cleanWs
[WS-CLEANUP] Deleting project workspace...
[WS-CLEANUP] Deferred wipeout is used...
[WS-CLEANUP] done
[Pipeline] }
[Pipeline] // stage
[Pipeline] }
[Pipeline] // ws
[Pipeline] }
[Pipeline] // node
[Pipeline] }
[Pipeline] // parallel
[Pipeline] stage
[Pipeline] { (Notifications)
[Pipeline] echo
Build result: FAILURE
[Pipeline] jiraIssueSelector
[Pipeline] echo
The authors of changes [olamy].
[Pipeline] echo
Sending email ...
[Pipeline] emailext