You are viewing a plain text version of this content. The canonical link for it is here.
Posted to dev@kafka.apache.org by Apache Jenkins Server <je...@builds.apache.org> on 2015/04/26 22:16:56 UTC

Build failed in Jenkins: Kafka-trunk #475

See <https://builds.apache.org/job/Kafka-trunk/475/changes>

Changes:

[nehanarkhede] KAFKA-2140 follow up, checking in newly renamed file ConsumerRebalanceFailedException

[nehanarkhede] KAFKA-2128 kafka.Kafka should return non-zero exit code when caught exception; reviewed by Neha

------------------------------------------
[...truncated 986 lines...]
kafka.utils.UtilsTest > testReplaceSuffix PASSED

kafka.utils.UtilsTest > testReadInt PASSED

kafka.utils.UtilsTest > testCsvList PASSED

kafka.utils.UtilsTest > testCsvMap PASSED

kafka.utils.UtilsTest > testInLock PASSED

kafka.utils.UtilsTest > testDoublyLinkedList PASSED

kafka.utils.JsonTest > testJsonEncoding PASSED

kafka.utils.IteratorTemplateTest > testIterator PASSED

kafka.utils.timer.TimerTest > testAlreadyExpiredTask PASSED

kafka.utils.timer.TimerTest > testTaskExpiration PASSED

kafka.utils.timer.TimerTaskListTest > testAll PASSED

kafka.metrics.KafkaTimerTest > testKafkaTimer PASSED

kafka.consumer.TopicFilterTest > testWhitelists PASSED

kafka.consumer.TopicFilterTest > testBlacklists PASSED

kafka.consumer.TopicFilterTest > testWildcardTopicCountGetTopicCountMapEscapeJson PASSED

kafka.consumer.MetricsTest > testMetricsLeak PASSED

kafka.consumer.MetricsTest > testMetricsReporterAfterDeletingTopic PASSED

kafka.consumer.ZookeeperConsumerConnectorTest > testBasic PASSED

kafka.consumer.ZookeeperConsumerConnectorTest > testCompression PASSED

kafka.consumer.ZookeeperConsumerConnectorTest > testCompressionSetConsumption PASSED

kafka.consumer.ZookeeperConsumerConnectorTest > testConsumerDecoder PASSED

kafka.consumer.ZookeeperConsumerConnectorTest > testLeaderSelectionForPartition PASSED

kafka.consumer.ZookeeperConsumerConnectorTest > testConsumerRebalanceListener PASSED

kafka.consumer.ConsumerIteratorTest > testConsumerIteratorDeduplicationDeepIterator PASSED

kafka.consumer.ConsumerIteratorTest > testConsumerIteratorDecodingFailure PASSED

kafka.javaapi.consumer.ZookeeperConsumerConnectorTest > testBasic PASSED

kafka.javaapi.message.ByteBufferMessageSetTest > testWrittenEqualsRead PASSED

kafka.javaapi.message.ByteBufferMessageSetTest > testIteratorIsConsistent PASSED

kafka.javaapi.message.ByteBufferMessageSetTest > testIteratorIsConsistentWithCompression PASSED

kafka.javaapi.message.ByteBufferMessageSetTest > testSizeInBytes PASSED

kafka.javaapi.message.ByteBufferMessageSetTest > testSizeInBytesWithCompression PASSED

kafka.javaapi.message.ByteBufferMessageSetTest > testEquals PASSED

kafka.javaapi.message.ByteBufferMessageSetTest > testEqualsWithCompression PASSED

kafka.server.LogOffsetTest > testGetOffsetsForUnknownTopic PASSED

kafka.server.LogOffsetTest > testGetOffsetsBeforeLatestTime PASSED

kafka.server.LogOffsetTest > testEmptyLogsGetOffsets PASSED

kafka.server.LogOffsetTest > testGetOffsetsBeforeNow PASSED

kafka.server.LogOffsetTest > testGetOffsetsBeforeEarliestTime PASSED

kafka.server.HighwatermarkPersistenceTest > testHighWatermarkPersistenceSinglePartition PASSED

kafka.server.HighwatermarkPersistenceTest > testHighWatermarkPersistenceMultiplePartitions PASSED

kafka.server.KafkaConfigTest > testLogRetentionTimeHoursProvided PASSED

kafka.server.KafkaConfigTest > testLogRetentionTimeMinutesProvided PASSED

kafka.server.KafkaConfigTest > testLogRetentionTimeMsProvided PASSED

kafka.server.KafkaConfigTest > testLogRetentionTimeNoConfigProvided PASSED

kafka.server.KafkaConfigTest > testLogRetentionTimeBothMinutesAndHoursProvided PASSED

kafka.server.KafkaConfigTest > testLogRetentionTimeBothMinutesAndMsProvided PASSED

kafka.server.KafkaConfigTest > testLogRetentionUnlimited PASSED

kafka.server.KafkaConfigTest > testLogRetentionValid PASSED

kafka.server.KafkaConfigTest > testAdvertiseDefaults PASSED

kafka.server.KafkaConfigTest > testAdvertiseConfigured PASSED

kafka.server.KafkaConfigTest > testDuplicateListeners PASSED

kafka.server.KafkaConfigTest > testBadListenerProtocol PASSED

kafka.server.KafkaConfigTest > testListenerDefaults PASSED

kafka.server.KafkaConfigTest > testVersionConfiguration PASSED

kafka.server.KafkaConfigTest > testUncleanLeaderElectionDefault PASSED

kafka.server.KafkaConfigTest > testUncleanElectionDisabled PASSED

kafka.server.KafkaConfigTest > testUncleanElectionEnabled PASSED

kafka.server.KafkaConfigTest > testUncleanElectionInvalid PASSED

kafka.server.KafkaConfigTest > testLogRollTimeMsProvided PASSED

kafka.server.KafkaConfigTest > testLogRollTimeBothMsAndHoursProvided PASSED

kafka.server.KafkaConfigTest > testLogRollTimeNoConfigProvided PASSED

kafka.server.KafkaConfigTest > testDefaultCompressionType PASSED

kafka.server.KafkaConfigTest > testValidCompressionType PASSED

kafka.server.KafkaConfigTest > testInvalidCompressionType PASSED

kafka.server.LogRecoveryTest > testHWCheckpointNoFailuresSingleLogSegment PASSED

kafka.server.LogRecoveryTest > testHWCheckpointWithFailuresSingleLogSegment PASSED

kafka.server.LogRecoveryTest > testHWCheckpointNoFailuresMultipleLogSegments PASSED

kafka.server.LogRecoveryTest > testHWCheckpointWithFailuresMultipleLogSegments PASSED

kafka.server.DelayedOperationTest > testRequestSatisfaction PASSED

kafka.server.DelayedOperationTest > testRequestExpiry PASSED

kafka.server.DelayedOperationTest > testRequestPurge PASSED

kafka.server.AdvertiseBrokerTest > testBrokerAdvertiseToZK PASSED

kafka.server.ReplicaManagerTest > testHighWaterMarkDirectoryMapping PASSED

kafka.server.ReplicaManagerTest > testHighwaterMarkRelativeDirectoryMapping PASSED

kafka.server.ReplicaManagerTest > testIllegalRequiredAcks PASSED

kafka.server.ServerGenerateBrokerIdTest > testAutoGenerateBrokerId PASSED

kafka.server.ServerGenerateBrokerIdTest > testUserConfigAndGeneratedBrokerId PASSED

kafka.server.ServerGenerateBrokerIdTest > testMultipleLogDirsMetaProps PASSED

kafka.server.ServerGenerateBrokerIdTest > testConsistentBrokerIdFromUserConfigAndMetaProps PASSED

kafka.server.OffsetCommitTest > testUpdateOffsets PASSED

kafka.server.OffsetCommitTest > testCommitAndFetchOffsets PASSED

kafka.server.OffsetCommitTest > testLargeMetadataPayload PASSED

kafka.server.OffsetCommitTest > testOffsetExpiration PASSED

kafka.server.OffsetCommitTest > testNonExistingTopicOffsetCommit PASSED

kafka.server.ReplicaFetchTest > testReplicaFetcherThread PASSED

kafka.server.ServerStartupTest > testBrokerCreatesZKChroot PASSED

kafka.server.ServerStartupTest > testConflictBrokerRegistration PASSED

kafka.server.LeaderElectionTest > testLeaderElectionAndEpoch PASSED

kafka.server.LeaderElectionTest > testLeaderElectionWithStaleControllerEpoch PASSED

kafka.server.IsrExpirationTest > testIsrExpirationForStuckFollowers PASSED

kafka.server.IsrExpirationTest > testIsrExpirationIfNoFetchRequestMade PASSED

kafka.server.IsrExpirationTest > testIsrExpirationForSlowFollowers PASSED

kafka.server.SimpleFetchTest > testReadFromLog PASSED

kafka.server.ServerShutdownTest > testCleanShutdown PASSED

kafka.server.ServerShutdownTest > testCleanShutdownWithDeleteTopicEnabled PASSED

kafka.server.ServerShutdownTest > testCleanShutdownAfterFailedStartup PASSED

kafka.server.ServerShutdownTest > testConsecutiveShutdown PASSED

kafka.server.DynamicConfigChangeTest > testConfigChange PASSED

kafka.server.DynamicConfigChangeTest > testConfigChangeOnNonExistingTopic PASSED

kafka.zk.ZKEphemeralTest > testEphemeralNodeCleanup PASSED

kafka.api.ProducerFailureHandlingTest > testNotEnoughReplicas PASSED

kafka.api.ProducerFailureHandlingTest > testInvalidPartition PASSED

kafka.api.ProducerFailureHandlingTest > testTooLargeRecordWithAckZero PASSED

kafka.api.ProducerFailureHandlingTest > testTooLargeRecordWithAckOne PASSED

kafka.api.ProducerFailureHandlingTest > testNonExistentTopic PASSED

kafka.api.ProducerFailureHandlingTest > testWrongBrokerList PASSED

kafka.api.ProducerFailureHandlingTest > testNoResponse PASSED

kafka.api.ProducerFailureHandlingTest > testSendAfterClosed PASSED

kafka.api.ProducerFailureHandlingTest > testCannotSendToInternalTopic PASSED

kafka.api.ProducerFailureHandlingTest > testNotEnoughReplicasAfterBrokerShutdown PASSED

kafka.api.ConsumerBounceTest > testConsumptionWithBrokerFailures PASSED

kafka.api.ConsumerBounceTest > testSeekAndCommitWithBrokerFailures FAILED
    java.lang.AssertionError: expected:<1000> but was:<980>
        at org.junit.Assert.fail(Assert.java:92)
        at org.junit.Assert.failNotEquals(Assert.java:689)
        at org.junit.Assert.assertEquals(Assert.java:127)
        at org.junit.Assert.assertEquals(Assert.java:514)
        at org.junit.Assert.assertEquals(Assert.java:498)
        at kafka.api.ConsumerBounceTest.seekAndCommitWithBrokerFailures(ConsumerBounceTest.scala:117)
        at kafka.api.ConsumerBounceTest.testSeekAndCommitWithBrokerFailures(ConsumerBounceTest.scala:98)

255 tests completed, 1 failed
:core:test FAILED

FAILURE: Build failed with an exception.

* What went wrong:
Execution failed for task ':core:test'.
> Process 'Gradle Test Executor 3' finished with non-zero exit value 1

* Try:
Run with --stacktrace option to get the stack trace. Run with --info or --debug option to get more log output.

BUILD FAILED

Total time: 8 mins 19.863 secs
Build step 'Execute shell' marked build as failure
Setting GRADLE_2_1_HOME=/jenkins/tools/hudson.plugins.gradle.GradleInstallation/Gradle_2.1

Jenkins build is back to normal : Kafka-trunk #476

Posted by Apache Jenkins Server <je...@builds.apache.org>.
See <https://builds.apache.org/job/Kafka-trunk/476/changes>