You are viewing a plain text version of this content. The canonical link for it is here.
Posted to builds@beam.apache.org by Apache Jenkins Server <je...@builds.apache.org> on 2020/08/17 19:00:17 UTC
Build failed in Jenkins: beam_PostCommit_Python36 #2816
See <https://ci-beam.apache.org/job/beam_PostCommit_Python36/2816/display/redirect?page=changes>
Changes:
[katarzyna.kucharczyk] [BEAM-10672] Added streaming option to combine test
[katarzyna.kucharczyk] [BEAM-10672] Added experimental dataflow param
[katarzyna.kucharczyk] [BEAM-10672] Spottless Apply
[katarzyna.kucharczyk] [BEAM-10672] Updated streaming commands
[katarzyna.kucharczyk] [BEAM-10672] Fixes after review in combine python load test
[katarzyna.kucharczyk] [BEAM-10672] Changed jobType variable into mode to declare if it is
------------------------------------------
[...truncated 21.46 MB...]
"parallel_input": {
"@type": "OutputReference",
"output_name": "SINGLE_PARTITION",
"step_name": "s23"
},
"serialized_fn": "QlpoOTFBWSZTWVycNwwABcb/+///////////////////////////////wABAEAgAIOAGN8DVobruzl3bQOvbOtt4Imk1PQKaT09U8phlNHiI/VM00yajymQ2pk0bUAGnpGmgANNGIYnqAA2iY1MjJoGj1HpAeoMmGjRGg0hMqenpG0g9Jop5NRkNGgD1AZAAAAAAAAAANAaaaAAAB6gAAAAAImImBCnqj0nqaMgAAHqA09JoABoAAAAAGmhpoAAAAAAAAaAAAGUe/VU0GIyNMgAaBoaAGgNA0ABkAyAABiAAA0AGgAAADQDQANBA0NGgGEBoNAwIADQGmQGgMAgMmmgAAGmCaaYIDJoyDRhAAZDCGmQMSBBNBMmjSbRoTTQTepNGh6mgaZA00A0AA0BoAaZHqaYjQ0AAAAAAAAAM8bVLqnZSESWI4bkDjiJc5wQOttj02tpKjsJMgQpeoImpfTGiiVGCEmvbfHdppYlae7ZqdWrDFFjJauASBTumIHPBDJzGLkARv0SR0u2TPR75wYk+TIYPGnsaavav3PM/2yR49ItVmNxWbmhqRcjRIKY2t20+78VwlSd1HhUCZ1MQDU4OsPAZzg4FzMA0XBxMN4Iea8MtLf7/gcFJb1zFpxM0gHoJpU6XAD3qLEUUb6d8tRUDWRsNXDkyYBzmCRfec4BIpWmDJYWDLA5MHIhWdsubfXuXRDwn2LIu5EZnzT6InDISFrAKHKDrlh9l9NybHwxZ7mPIBY8EfG4cV72w5EWme3z/BwznOc/3/OPlYDnIZ/YcZogv0YEY5CGvYjDO8uISkgw/qDTYXXntFr+zM9SDyiCYg72BSA/OqkgBgmBKL8SF7kSIewgIoYHTqt+LB0ekMyI1GrzrVSTwHM9aIlWfNtVGEaE9oxMXFkHxLh0EdK3VvpSWKBZuqHF6t+nLyzMzI1YKVum8V6ZcJqcamivJxkBdIw6Vosk5kIMmKTWuVb6hzNCKIQ140Y3a7d5p40+ygJUvwxqJoIsKNprnOC1gAk+btkwEYGDrJlyOpVKymAXBQBaMM5xUQWMRMI7u09JbkULc5YwWVliSLpOgbVaeF57l835KjjKcQrqsi3lDDd+u7Fj3i3Y3aq2ZhJXt0wlm9TaRiebnP4NPvUNVYlKIYFi7yLxOK+42WwhU4bEkDkky4Wz61THP4bggyFA5faCdPepgnkQRpIL0klo11YxKWRxzAuN8HARTNzSqESdCAJp/m1Y0rhJAyLZmhbcLECl4kNydEIyIIokK9AOBiNqQJ0QjCkiEBQZA4ar1cIrWAMRVHMuNPelkql4p9EcRM8B5ZEA1mdH+Ko7wCIpJhe5CYKCBygK0z8fnjRtXf633Yq3vlYcrNknI/xo9rbTMbqv9ZhGg8kC+niGSgFmghtW3D8a+CEQ+NG55iW86ZyHnSG0rhhqEy2LThVHWIWn2XPGuRBDibIKHE3LYBoUxAyDbvPFN+E+m0lU0l8osUItlQYzqKEADYhBoriBoMSulQCAeARKKyFeAa2pWBvKdRA4NCrkVPLsAqCGjTDCCzOIMSpmjmIFGRCQYG6gQweLqaMwUwk+cGdJQakqU5k8mHINmnmkHDzjPrQcqEcglQUCSg7tYKlSz7ujDbbPpvopCa2zSdUAxCADMZ1miXZnAMdWpyalapGDK2MvS0NuuvRV5FyTcJLLO11ANrH5mVIBcMKI14QlThG+CASQoa0bEBm4MOeKbxTGcO64QDZiFyxDFLFelQNKmOyg6mOi9iuFGxrz0wcLZTkkHRljMRm7K5gsza7Ky4YMuuJNEY0CMFFt8wMUDYrKocAz1oiNTISAGIiCHiYz23vEgz5YrOeTJq2Q+Z0BoxAkgo7ekinPoMkakIKimiagAtBmRCDaW4eEknBTUiKLhSRBk8zOQYMVmMN6MQJAfUOithEYwADXLeVCqyJPfSc5wZKaLAPxcW/OKzrNwGeaRbLmyap8BAto1jFYiMsYkCwOjNSIyWN6QkJAXQ6JFpDVDToKkztj43C+xK1mNAbekiIijUCSrWSYwcKuMUHUkNZIREqWBxPdQ0HTbdPSFj7aMRnK93T31uotzTvzoPyoSpflRaFFGQhrhWKggwykEkMDocYZsoXaSSTK+H8sWMHCgAAAAAAABUAFwDjc6ZMDctIiIiIjI0zgZkRQeZqhM14MARBEogie4jU5maqmaC04EhvpuOKhqqAxMRqxrK9E0VEnPRIdFNfCFWVOBbU9+qLucFy9IjVQWsCNENhVVU1nHvPGzQ+52tgshMsbjeogapIXAcSYA1oODmkBpnmQJJTkSCJcfeGiNqDYMZ1VTBJmavPl0wjXkKsaMQXBlMgkKUGAmFqDtbFqeelBvQwIrOAhLLARWi/gMKRLnFt20JmLuDl54GWydMCJiet8B8qEyVCFrOIfZ8uywQAC1V6nK59hX2hOrKIiwKGgGMGkzCoVDQccVKq/ax8cXqTlIJFQY1CE6LpWM9+goTcfbkIDSiQRBksNKKITQpLq3EbDE1GCKNGFbXLhJbfuYdcJ5T1EHqQMjJysvMlZudLnrMQa6LtBCCQgAWfG+b0ACAmETHEZbV+6pHKIcF1xM8ysvPWtVN8skloaCHyG4FgIiBBECB/RACE9FN/jz+j/xdyRThQkFycNwwA==",
"user_name": "write/BigQueryBatchFileLoads/TriggerLoadJobsWithoutTempTables/TriggerLoadJobsWithoutTempTables"
}
},
{
"kind": "CollectionToSingleton",
"name": "SideInput-s40",
"properties": {
"output_info": [
{
"encoding": {
"@type": "kind:stream",
"component_encodings": [
{
"@type": "kind:windowed_value",
"component_encodings": [
{
"@type": "FastPrimitivesCoder$QlpoOTFBWSZTWYQR6NMAAEDXwH8QgCEJAEBAv279AmAAIABqEqnqGgaABpoyNAGVHpGgMgDQBk0oR6IeoECBiqqU5NY23ndshzT2UPUOGrg42YPi9VyA8lbwwPJgtghxs5Qq1aWwExCDeMa0RHC2QigTCdizz1nx+LuSKcKEhCCPRpg=",
"component_encodings": [
{
"@type": "FastPrimitivesCoder$QlpoOTFBWSZTWYQR6NMAAEDXwH8QgCEJAEBAv279AmAAIABqEqnqGgaABpoyNAGVHpGgMgDQBk0oR6IeoECBiqqU5NY23ndshzT2UPUOGrg42YPi9VyA8lbwwPJgtghxs5Qq1aWwExCDeMa0RHC2QigTCdizz1nx+LuSKcKEhCCPRpg=",
"component_encodings": [],
"pipeline_proto_coder_id": "ref_Coder_FastPrimitivesCoder_5"
},
{
"@type": "FastPrimitivesCoder$QlpoOTFBWSZTWYQR6NMAAEDXwH8QgCEJAEBAv279AmAAIABqEqnqGgaABpoyNAGVHpGgMgDQBk0oR6IeoECBiqqU5NY23ndshzT2UPUOGrg42YPi9VyA8lbwwPJgtghxs5Qq1aWwExCDeMa0RHC2QigTCdizz1nx+LuSKcKEhCCPRpg=",
"component_encodings": [],
"pipeline_proto_coder_id": "ref_Coder_FastPrimitivesCoder_5"
}
],
"is_pair_like": true,
"pipeline_proto_coder_id": "ref_Coder_FastPrimitivesCoder_5"
},
{
"@type": "kind:global_window"
}
],
"is_wrapper": true
}
],
"is_stream_like": {
"value": true
}
},
"output_name": "out",
"user_name": "write/BigQueryBatchFileLoads/WaitForDestinationLoadJobs/_UnpickledSideInput(TriggerLoadJobsWithoutTempTables.out.0).output"
}
],
"parallel_input": {
"@type": "OutputReference",
"output_name": "None",
"step_name": "s39"
},
"user_name": "write/BigQueryBatchFileLoads/WaitForDestinationLoadJobs/_UnpickledSideInput(TriggerLoadJobsWithoutTempTables.out.0)",
"windowing_strategy": "%0A%8C%11%22%40%0A%1Dref_Coder_GlobalWindowCoder_1%12%1F%0A%1D%0A%1Bbeam%3Acoder%3Aglobal_window%3Av1%2A%C7%10%0A%25ref_Environment_default_environment_1%12%9D%10%12%12beam%3Aenv%3Adocker%3Av1%1A%3D%0A%3Bgcr.io/cloud-dataflow/v1beta3/python36%3Abeam-master-20200630%2A%13beam%3Acoder%3Abytes%3Av1%2A%19beam%3Acoder%3Astring_utf8%3Av1%2A%10beam%3Acoder%3Akv%3Av1%2A%12beam%3Acoder%3Abool%3Av1%2A%14beam%3Acoder%3Avarint%3Av1%2A%14beam%3Acoder%3Adouble%3Av1%2A%16beam%3Acoder%3Aiterable%3Av1%2A%13beam%3Acoder%3Atimer%3Av1%2A%1Dbeam%3Acoder%3Ainterval_window%3Av1%2A%1Bbeam%3Acoder%3Alength_prefix%3Av1%2A%1Bbeam%3Acoder%3Aglobal_window%3Av1%2A%1Cbeam%3Acoder%3Awindowed_value%3Av1%2A%22beam%3Acoder%3Aparam_windowed_value%3Av1%2A%23beam%3Acoder%3Astate_backed_iterable%3Av1%2A%11beam%3Acoder%3Arow%3Av1%2A%23beam%3Aprotocol%3Aprogress_reporting%3Av0%2A%1Ebeam%3Aprotocol%3Aworker_status%3Av1%2A%3Abeam%3Aversion%3Asdk_base%3Aapache/beam_python3.6_sdk%3A2.25.0.dev2q%0A%1Abeam%3Aartifact%3Atype%3Afile%3Av1%12%1D%0A%1Bpostcommit_requirements.txt%1A%20beam%3Aartifact%3Arole%3Astaging_to%3Av1%22%12%0A%10requirements.txt2%9B%01%0A%1Abeam%3Aartifact%3Atype%3Afile%3Av1%12%3D%0A%3B/tmp/dataflow-requirements-cache/parameterized-0.7.4.tar.gz%1A%20beam%3Aartifact%3Arole%3Astaging_to%3Av1%22%1C%0A%1Aparameterized-0.7.4.tar.gz2%89%01%0A%1Abeam%3Aartifact%3Atype%3Afile%3Av1%124%0A2/tmp/dataflow-requirements-cache/mock-2.0.0.tar.gz%1A%20beam%3Aartifact%3Arole%3Astaging_to%3Av1%22%13%0A%11mock-2.0.0.tar.gz2%89%01%0A%1Abeam%3Aartifact%3Atype%3Afile%3Av1%124%0A2/tmp/dataflow-requirements-cache/six-1.15.0.tar.gz%1A%20beam%3Aartifact%3Arole%3Astaging_to%3Av1%22%13%0A%11six-1.15.0.tar.gz2%91%01%0A%1Abeam%3Aartifact%3Atype%3Afile%3Av1%128%0A6/tmp/dataflow-requirements-cache/funcsigs-1.0.2.tar.gz%1A%20beam%3Aartifact%3Arole%3Astaging_to%3Av1%22%17%0A%15funcsigs-1.0.2.tar.gz2%87%01%0A%1Abeam%3Aartifact%3Atype%3Afile%3Av1%123%0A1/tmp/dataflow-requirements-cache/pbr-5.4.5.tar.gz%1A%20beam%3Aartifact%3Arole%3Astaging_to%3Av1%22%12%0A%10pbr-5.4.5.tar.gz2%97%01%0A%1Abeam%3Aartifact%3Atype%3Afile%3Av1%12%3B%0A9/tmp/dataflow-requirements-cache/PyHamcrest-1.10.1.tar.gz%1A%20beam%3Aartifact%3Arole%3Astaging_to%3Av1%22%1A%0A%18PyHamcrest-1.10.1.tar.gz2%C4%01%0A%1Abeam%3Aartifact%3Atype%3Afile%3Av1%12i%0Ag<https://ci-beam.apache.org/job/beam_PostCommit_Python36/ws/src/sdks/python/build/apache-beam.tar.gz%1A%20beam%3Aartifact%3Arole%3Astaging_to%3Av1%22%19%0A%17dataflow_python_sdk.tar2%9C%02%0A%1Abeam%3Aartifact%3Atype%3Afile%3Av1%12%C4%01%0A%C1%01/home/jenkins/jenkins-slave/workspace/beam_PostCommit_Python36/src/runners/google-cloud-dataflow-java/worker/build/libs/beam-runners-google-cloud-dataflow-java-fn-api-worker-2.25.0-SNAPSHOT.jar%1A%20beam%3Aartifact%3Arole%3Astaging_to%3Av1%22%15%0A%13dataflow-worker.jarjx%0A%22%0A%20beam%3Awindow_fn%3Aglobal_windows%3Av1%10%01%1A%1Dref_Coder_GlobalWindowCoder_1%22%02%3A%00%28%010%018%01H%01Z%25ref_Environment_default_environment_1">
}
},
{
"kind": "ParallelDo",
"name": "s41",
"properties": {
"display_data": [
{
"key": "fn",
"label": "Transform Function",
"namespace": "apache_beam.transforms.core.ParDo",
"shortValue": "WaitForBQJobs",
"type": "STRING",
"value": "apache_beam.io.gcp.bigquery_file_loads.WaitForBQJobs"
}
],
"non_parallel_inputs": {
"python_side_input0-write/BigQueryBatchFileLoads/WaitForDestinationLoadJobs": {
"@type": "OutputReference",
"output_name": "out",
"step_name": "SideInput-s40"
}
},
"output_info": [
{
"encoding": {
"@type": "kind:windowed_value",
"component_encodings": [
{
"@type": "FastPrimitivesCoder$QlpoOTFBWSZTWYQR6NMAAEDXwH8QgCEJAEBAv279AmAAIABqEqnqGgaABpoyNAGVHpGgMgDQBk0oR6IeoECBiqqU5NY23ndshzT2UPUOGrg42YPi9VyA8lbwwPJgtghxs5Qq1aWwExCDeMa0RHC2QigTCdizz1nx+LuSKcKEhCCPRpg=",
"component_encodings": [
{
"@type": "FastPrimitivesCoder$QlpoOTFBWSZTWYQR6NMAAEDXwH8QgCEJAEBAv279AmAAIABqEqnqGgaABpoyNAGVHpGgMgDQBk0oR6IeoECBiqqU5NY23ndshzT2UPUOGrg42YPi9VyA8lbwwPJgtghxs5Qq1aWwExCDeMa0RHC2QigTCdizz1nx+LuSKcKEhCCPRpg=",
"component_encodings": [],
"pipeline_proto_coder_id": "ref_Coder_FastPrimitivesCoder_5"
},
{
"@type": "FastPrimitivesCoder$QlpoOTFBWSZTWYQR6NMAAEDXwH8QgCEJAEBAv279AmAAIABqEqnqGgaABpoyNAGVHpGgMgDQBk0oR6IeoECBiqqU5NY23ndshzT2UPUOGrg42YPi9VyA8lbwwPJgtghxs5Qq1aWwExCDeMa0RHC2QigTCdizz1nx+LuSKcKEhCCPRpg=",
"component_encodings": [],
"pipeline_proto_coder_id": "ref_Coder_FastPrimitivesCoder_5"
}
],
"is_pair_like": true,
"pipeline_proto_coder_id": "ref_Coder_FastPrimitivesCoder_5"
},
{
"@type": "kind:global_window"
}
],
"is_wrapper": true
},
"output_name": "None",
"user_name": "write/BigQueryBatchFileLoads/WaitForDestinationLoadJobs.out"
}
],
"parallel_input": {
"@type": "OutputReference",
"output_name": "out",
"step_name": "s7"
},
"serialized_fn": "QlpoOTFBWSZTWbr5ox8AAxV/4///////////////wr/v/6Li0AAEAEAQCAAA0AM+83pygGRg1NEyp6Q0Bo0MgxGRoPSAABoNGmgeo0ANMTTEGmj1AxAgwAAAAAAAAAAAAAAAAAAAABEzUJqnlGgGgaDIAAANAAAAAAAGgAAABE/VKan6o00AA0ADTQA0aA0AA0xGgAAaAwRoMhkAkkJkBNMUwg0CaaQ2o9R6mNJ6TQ00AaGQAAAGmhp6E9TRo1U1rie267Z1rKIzunL/YhVkwvjiwy3IS7LAjrMgYcd05VACgA+1r8pMnz9gPFstS2DGwLZK7/RppSN28egaY4UjgQQQEAEABEQFJIWLREvuJ1hPrtk0rbN4+0oezF3meXoeyK4CK9F0i5MKJgQ9TgHMRgRJIHE1L5F8gNGoiRrApV3FpvScYTXzhVK4H5IwRvrIBRvUKIVOkjw4OmQwYK59WBPnLCbX2ARWlCLLzuBFiuZd6sKCUu3gOClR2YnbM00JcbW45iJ1/Q5dJK8I66o9mysuytemADsmmGCTC7AwMaAKpTarIKeQfMbzqXTRkOdtP4P0gQxIC7hD+Cl4ccuidti0QRsFYjjEpMO4iHW9C/nU3z1Odfadj8sp3ZZQ4EBhDRh2I/i2B1HKZPXnTeeDLlN+6R40cSgoS5x3784MB7h06IBwDAnx2ETTyimaUAlF2rrsCHk5uApqCjW3Go3MTns/dHddAQhAhNvCCUIb5Hl+NM+12OmJbhZHSYTRZhyL2EQN6oqmjSKuqu8YMWPdRRFjLjTwk0cNf3LRBXJreO67rmNSzaXkWhbVv7+mDw7gxFs5wDJmYndjLDWwz6eg+F1Svnw2C3dzy1FokEkatGzDawycNA1OR4VFJzFkqmKyKSIlbn7cwqGjMK9EdacHzRBZ2ZlD3+q8ZlGQUIkQZkzedYMwc0zdFGCS0NJOq2yBfYjUmftgVsqlJlagMOJarLM4zTJ6K22Cvi5P6j4kGUu+5ve5HOcxzg1YgRgdemszf+X4a3OAAAAAAAAogBDAEnCWtcACIjzQGPOgKM4iKMRhRVk0sp5ma2vNlW5FE0orkAHsVBW0/izvRrwbYGUZU4atPfYyo2ebsWFJiljqga7AWZQYrmuZ0CLxMTMNCm3akrB5POp2mnhRXOKeMVK7GRY7fc/ympHO+DNUaNTS4eYK1Z3V6ji4zZckkabINgsoggox3Qb3ZAVkayaah/En5+vulTg/1r7AxqlKnUwnMT8kuP1v/f4u5IpwoSF180Y+",
"user_name": "write/BigQueryBatchFileLoads/WaitForDestinationLoadJobs/WaitForDestinationLoadJobs"
}
},
{
"kind": "Flatten",
"name": "s42",
"properties": {
"display_data": [],
"inputs": [
{
"@type": "OutputReference",
"output_name": "None",
"step_name": "s25"
},
{
"@type": "OutputReference",
"output_name": "None",
"step_name": "s39"
}
],
"output_info": [
{
"encoding": {
"@type": "kind:windowed_value",
"component_encodings": [
{
"@type": "FastPrimitivesCoder$QlpoOTFBWSZTWYQR6NMAAEDXwH8QgCEJAEBAv279AmAAIABqEqnqGgaABpoyNAGVHpGgMgDQBk0oR6IeoECBiqqU5NY23ndshzT2UPUOGrg42YPi9VyA8lbwwPJgtghxs5Qq1aWwExCDeMa0RHC2QigTCdizz1nx+LuSKcKEhCCPRpg=",
"component_encodings": [
{
"@type": "FastPrimitivesCoder$QlpoOTFBWSZTWYQR6NMAAEDXwH8QgCEJAEBAv279AmAAIABqEqnqGgaABpoyNAGVHpGgMgDQBk0oR6IeoECBiqqU5NY23ndshzT2UPUOGrg42YPi9VyA8lbwwPJgtghxs5Qq1aWwExCDeMa0RHC2QigTCdizz1nx+LuSKcKEhCCPRpg=",
"component_encodings": [],
"pipeline_proto_coder_id": "ref_Coder_FastPrimitivesCoder_5"
},
{
"@type": "FastPrimitivesCoder$QlpoOTFBWSZTWYQR6NMAAEDXwH8QgCEJAEBAv279AmAAIABqEqnqGgaABpoyNAGVHpGgMgDQBk0oR6IeoECBiqqU5NY23ndshzT2UPUOGrg42YPi9VyA8lbwwPJgtghxs5Qq1aWwExCDeMa0RHC2QigTCdizz1nx+LuSKcKEhCCPRpg=",
"component_encodings": [],
"pipeline_proto_coder_id": "ref_Coder_FastPrimitivesCoder_5"
}
],
"is_pair_like": true,
"pipeline_proto_coder_id": "ref_Coder_FastPrimitivesCoder_5"
},
{
"@type": "kind:global_window"
}
],
"is_wrapper": true
},
"output_name": "out",
"user_name": "write/BigQueryBatchFileLoads/Flatten.out"
}
],
"user_name": "write/BigQueryBatchFileLoads/Flatten"
}
}
],
"type": "JOB_TYPE_BATCH"
}
apache_beam.runners.dataflow.internal.apiclient: INFO: Create job: <Job
createTime: '2020-08-17T18:19:40.344250Z'
currentStateTime: '1970-01-01T00:00:00Z'
id: '2020-08-17_11_19_39-17481942586409921657'
location: 'us-central1'
name: 'beamapp-jenkins-0817181930-601641'
projectId: 'apache-beam-testing'
stageStates: []
startTime: '2020-08-17T18:19:40.344250Z'
steps: []
tempFiles: []
type: TypeValueValuesEnum(JOB_TYPE_BATCH, 1)>
apache_beam.runners.dataflow.internal.apiclient: INFO: Created job with id: [2020-08-17_11_19_39-17481942586409921657]
apache_beam.runners.dataflow.internal.apiclient: INFO: Submitted job: 2020-08-17_11_19_39-17481942586409921657
apache_beam.runners.dataflow.internal.apiclient: INFO: To access the Dataflow monitoring console, please navigate to https://console.cloud.google.com/dataflow/jobs/us-central1/2020-08-17_11_19_39-17481942586409921657?project=apache-beam-testing
--------------------- >> end captured logging << ---------------------
----------------------------------------------------------------------
XML: nosetests-postCommitIT-df-py36.xml
----------------------------------------------------------------------
XML: <https://ci-beam.apache.org/job/beam_PostCommit_Python36/ws/src/sdks/python/nosetests.xml>
----------------------------------------------------------------------
Ran 66 tests in 3455.724s
FAILED (SKIP=6, errors=9, failures=2)
> Task :sdks:python:test-suites:dataflow:py36:postCommitIT FAILED
FAILURE: Build completed with 2 failures.
1: Task failed with an exception.
-----------
* Where:
Script '<https://ci-beam.apache.org/job/beam_PostCommit_Python36/ws/src/sdks/python/test-suites/direct/common.gradle'> line: 48
* What went wrong:
Execution failed for task ':sdks:python:test-suites:direct:py36:postCommitIT'.
> Process 'command 'sh'' finished with non-zero exit value 1
* Try:
Run with --stacktrace option to get the stack trace. Run with --info or --debug option to get more log output. Run with --scan to get full insights.
==============================================================================
2: Task failed with an exception.
-----------
* Where:
Script '<https://ci-beam.apache.org/job/beam_PostCommit_Python36/ws/src/sdks/python/test-suites/dataflow/common.gradle'> line: 116
* What went wrong:
Execution failed for task ':sdks:python:test-suites:dataflow:py36:postCommitIT'.
> Process 'command 'sh'' finished with non-zero exit value 1
* Try:
Run with --stacktrace option to get the stack trace. Run with --info or --debug option to get more log output. Run with --scan to get full insights.
==============================================================================
* Get more help at https://help.gradle.org
Deprecated Gradle features were used in this build, making it incompatible with Gradle 6.0.
Use '--warning-mode all' to show the individual deprecation warnings.
See https://docs.gradle.org/5.2.1/userguide/command_line_interface.html#sec:command_line_warnings
BUILD FAILED in 59m 46s
153 actionable tasks: 117 executed, 34 from cache, 2 up-to-date
Publishing build scan...
https://gradle.com/s/mom7canaozsxc
Build step 'Invoke Gradle script' changed build result to FAILURE
Build step 'Invoke Gradle script' marked build as failure
---------------------------------------------------------------------
To unsubscribe, e-mail: builds-unsubscribe@beam.apache.org
For additional commands, e-mail: builds-help@beam.apache.org
Jenkins build is back to normal : beam_PostCommit_Python36 #2820
Posted by Apache Jenkins Server <je...@builds.apache.org>.
See <https://ci-beam.apache.org/job/beam_PostCommit_Python36/2820/display/redirect?page=changes>
---------------------------------------------------------------------
To unsubscribe, e-mail: builds-unsubscribe@beam.apache.org
For additional commands, e-mail: builds-help@beam.apache.org
Build failed in Jenkins: beam_PostCommit_Python36 #2819
Posted by Apache Jenkins Server <je...@builds.apache.org>.
See <https://ci-beam.apache.org/job/beam_PostCommit_Python36/2819/display/redirect?page=changes>
Changes:
[tobiasz.kedzierski] Improve CI documentation
------------------------------------------
[...truncated 21.98 MB...]
"windowing_strategy": "%0A%8C%11%22%40%0A%1Dref_Coder_GlobalWindowCoder_1%12%1F%0A%1D%0A%1Bbeam%3Acoder%3Aglobal_window%3Av1%2A%C7%10%0A%25ref_Environment_default_environment_1%12%9D%10%12%12beam%3Aenv%3Adocker%3Av1%1A%3D%0A%3Bgcr.io/cloud-dataflow/v1beta3/python36%3Abeam-master-20200630%2A%13beam%3Acoder%3Abytes%3Av1%2A%19beam%3Acoder%3Astring_utf8%3Av1%2A%10beam%3Acoder%3Akv%3Av1%2A%12beam%3Acoder%3Abool%3Av1%2A%14beam%3Acoder%3Avarint%3Av1%2A%14beam%3Acoder%3Adouble%3Av1%2A%16beam%3Acoder%3Aiterable%3Av1%2A%13beam%3Acoder%3Atimer%3Av1%2A%1Dbeam%3Acoder%3Ainterval_window%3Av1%2A%1Bbeam%3Acoder%3Alength_prefix%3Av1%2A%1Bbeam%3Acoder%3Aglobal_window%3Av1%2A%1Cbeam%3Acoder%3Awindowed_value%3Av1%2A%22beam%3Acoder%3Aparam_windowed_value%3Av1%2A%23beam%3Acoder%3Astate_backed_iterable%3Av1%2A%11beam%3Acoder%3Arow%3Av1%2A%23beam%3Aprotocol%3Aprogress_reporting%3Av0%2A%1Ebeam%3Aprotocol%3Aworker_status%3Av1%2A%3Abeam%3Aversion%3Asdk_base%3Aapache/beam_python3.6_sdk%3A2.25.0.dev2q%0A%1Abeam%3Aartifact%3Atype%3Afile%3Av1%12%1D%0A%1Bpostcommit_requirements.txt%1A%20beam%3Aartifact%3Arole%3Astaging_to%3Av1%22%12%0A%10requirements.txt2%9B%01%0A%1Abeam%3Aartifact%3Atype%3Afile%3Av1%12%3D%0A%3B/tmp/dataflow-requirements-cache/parameterized-0.7.4.tar.gz%1A%20beam%3Aartifact%3Arole%3Astaging_to%3Av1%22%1C%0A%1Aparameterized-0.7.4.tar.gz2%89%01%0A%1Abeam%3Aartifact%3Atype%3Afile%3Av1%124%0A2/tmp/dataflow-requirements-cache/mock-2.0.0.tar.gz%1A%20beam%3Aartifact%3Arole%3Astaging_to%3Av1%22%13%0A%11mock-2.0.0.tar.gz2%89%01%0A%1Abeam%3Aartifact%3Atype%3Afile%3Av1%124%0A2/tmp/dataflow-requirements-cache/six-1.15.0.tar.gz%1A%20beam%3Aartifact%3Arole%3Astaging_to%3Av1%22%13%0A%11six-1.15.0.tar.gz2%91%01%0A%1Abeam%3Aartifact%3Atype%3Afile%3Av1%128%0A6/tmp/dataflow-requirements-cache/funcsigs-1.0.2.tar.gz%1A%20beam%3Aartifact%3Arole%3Astaging_to%3Av1%22%17%0A%15funcsigs-1.0.2.tar.gz2%87%01%0A%1Abeam%3Aartifact%3Atype%3Afile%3Av1%123%0A1/tmp/dataflow-requirements-cache/pbr-5.4.5.tar.gz%1A%20beam%3Aartifact%3Arole%3Astaging_to%3Av1%22%12%0A%10pbr-5.4.5.tar.gz2%97%01%0A%1Abeam%3Aartifact%3Atype%3Afile%3Av1%12%3B%0A9/tmp/dataflow-requirements-cache/PyHamcrest-1.10.1.tar.gz%1A%20beam%3Aartifact%3Arole%3Astaging_to%3Av1%22%1A%0A%18PyHamcrest-1.10.1.tar.gz2%C4%01%0A%1Abeam%3Aartifact%3Atype%3Afile%3Av1%12i%0Ag<https://ci-beam.apache.org/job/beam_PostCommit_Python36/ws/src/sdks/python/build/apache-beam.tar.gz%1A%20beam%3Aartifact%3Arole%3Astaging_to%3Av1%22%19%0A%17dataflow_python_sdk.tar2%9C%02%0A%1Abeam%3Aartifact%3Atype%3Afile%3Av1%12%C4%01%0A%C1%01/home/jenkins/jenkins-slave/workspace/beam_PostCommit_Python36/src/runners/google-cloud-dataflow-java/worker/build/libs/beam-runners-google-cloud-dataflow-java-fn-api-worker-2.25.0-SNAPSHOT.jar%1A%20beam%3Aartifact%3Arole%3Astaging_to%3Av1%22%15%0A%13dataflow-worker.jarjx%0A%22%0A%20beam%3Awindow_fn%3Aglobal_windows%3Av1%10%01%1A%1Dref_Coder_GlobalWindowCoder_1%22%02%3A%00%28%010%018%01H%01Z%25ref_Environment_default_environment_1">
}
},
{
"kind": "CollectionToSingleton",
"name": "SideInput-s19",
"properties": {
"output_info": [
{
"encoding": {
"@type": "kind:stream",
"component_encodings": [
{
"@type": "kind:windowed_value",
"component_encodings": [
{
"@type": "FastPrimitivesCoder$QlpoOTFBWSZTWYQR6NMAAEDXwH8QgCEJAEBAv279AmAAIABqEqnqGgaABpoyNAGVHpGgMgDQBk0oR6IeoECBiqqU5NY23ndshzT2UPUOGrg42YPi9VyA8lbwwPJgtghxs5Qq1aWwExCDeMa0RHC2QigTCdizz1nx+LuSKcKEhCCPRpg=",
"component_encodings": [
{
"@type": "FastPrimitivesCoder$QlpoOTFBWSZTWYQR6NMAAEDXwH8QgCEJAEBAv279AmAAIABqEqnqGgaABpoyNAGVHpGgMgDQBk0oR6IeoECBiqqU5NY23ndshzT2UPUOGrg42YPi9VyA8lbwwPJgtghxs5Qq1aWwExCDeMa0RHC2QigTCdizz1nx+LuSKcKEhCCPRpg=",
"component_encodings": [],
"pipeline_proto_coder_id": "ref_Coder_FastPrimitivesCoder_5"
},
{
"@type": "FastPrimitivesCoder$QlpoOTFBWSZTWYQR6NMAAEDXwH8QgCEJAEBAv279AmAAIABqEqnqGgaABpoyNAGVHpGgMgDQBk0oR6IeoECBiqqU5NY23ndshzT2UPUOGrg42YPi9VyA8lbwwPJgtghxs5Qq1aWwExCDeMa0RHC2QigTCdizz1nx+LuSKcKEhCCPRpg=",
"component_encodings": [],
"pipeline_proto_coder_id": "ref_Coder_FastPrimitivesCoder_5"
}
],
"is_pair_like": true,
"pipeline_proto_coder_id": "ref_Coder_FastPrimitivesCoder_5"
},
{
"@type": "kind:global_window"
}
],
"is_wrapper": true
}
],
"is_stream_like": {
"value": true
}
},
"output_name": "out",
"user_name": "Write/Write/WriteImpl/FinalizeWrite/_UnpickledSideInput(Extract.out.0).output"
}
],
"parallel_input": {
"@type": "OutputReference",
"output_name": "None",
"step_name": "s14"
},
"user_name": "Write/Write/WriteImpl/FinalizeWrite/_UnpickledSideInput(Extract.out.0)",
"windowing_strategy": "%0A%8C%11%22%40%0A%1Dref_Coder_GlobalWindowCoder_1%12%1F%0A%1D%0A%1Bbeam%3Acoder%3Aglobal_window%3Av1%2A%C7%10%0A%25ref_Environment_default_environment_1%12%9D%10%12%12beam%3Aenv%3Adocker%3Av1%1A%3D%0A%3Bgcr.io/cloud-dataflow/v1beta3/python36%3Abeam-master-20200630%2A%13beam%3Acoder%3Abytes%3Av1%2A%19beam%3Acoder%3Astring_utf8%3Av1%2A%10beam%3Acoder%3Akv%3Av1%2A%12beam%3Acoder%3Abool%3Av1%2A%14beam%3Acoder%3Avarint%3Av1%2A%14beam%3Acoder%3Adouble%3Av1%2A%16beam%3Acoder%3Aiterable%3Av1%2A%13beam%3Acoder%3Atimer%3Av1%2A%1Dbeam%3Acoder%3Ainterval_window%3Av1%2A%1Bbeam%3Acoder%3Alength_prefix%3Av1%2A%1Bbeam%3Acoder%3Aglobal_window%3Av1%2A%1Cbeam%3Acoder%3Awindowed_value%3Av1%2A%22beam%3Acoder%3Aparam_windowed_value%3Av1%2A%23beam%3Acoder%3Astate_backed_iterable%3Av1%2A%11beam%3Acoder%3Arow%3Av1%2A%23beam%3Aprotocol%3Aprogress_reporting%3Av0%2A%1Ebeam%3Aprotocol%3Aworker_status%3Av1%2A%3Abeam%3Aversion%3Asdk_base%3Aapache/beam_python3.6_sdk%3A2.25.0.dev2q%0A%1Abeam%3Aartifact%3Atype%3Afile%3Av1%12%1D%0A%1Bpostcommit_requirements.txt%1A%20beam%3Aartifact%3Arole%3Astaging_to%3Av1%22%12%0A%10requirements.txt2%9B%01%0A%1Abeam%3Aartifact%3Atype%3Afile%3Av1%12%3D%0A%3B/tmp/dataflow-requirements-cache/parameterized-0.7.4.tar.gz%1A%20beam%3Aartifact%3Arole%3Astaging_to%3Av1%22%1C%0A%1Aparameterized-0.7.4.tar.gz2%89%01%0A%1Abeam%3Aartifact%3Atype%3Afile%3Av1%124%0A2/tmp/dataflow-requirements-cache/mock-2.0.0.tar.gz%1A%20beam%3Aartifact%3Arole%3Astaging_to%3Av1%22%13%0A%11mock-2.0.0.tar.gz2%89%01%0A%1Abeam%3Aartifact%3Atype%3Afile%3Av1%124%0A2/tmp/dataflow-requirements-cache/six-1.15.0.tar.gz%1A%20beam%3Aartifact%3Arole%3Astaging_to%3Av1%22%13%0A%11six-1.15.0.tar.gz2%91%01%0A%1Abeam%3Aartifact%3Atype%3Afile%3Av1%128%0A6/tmp/dataflow-requirements-cache/funcsigs-1.0.2.tar.gz%1A%20beam%3Aartifact%3Arole%3Astaging_to%3Av1%22%17%0A%15funcsigs-1.0.2.tar.gz2%87%01%0A%1Abeam%3Aartifact%3Atype%3Afile%3Av1%123%0A1/tmp/dataflow-requirements-cache/pbr-5.4.5.tar.gz%1A%20beam%3Aartifact%3Arole%3Astaging_to%3Av1%22%12%0A%10pbr-5.4.5.tar.gz2%97%01%0A%1Abeam%3Aartifact%3Atype%3Afile%3Av1%12%3B%0A9/tmp/dataflow-requirements-cache/PyHamcrest-1.10.1.tar.gz%1A%20beam%3Aartifact%3Arole%3Astaging_to%3Av1%22%1A%0A%18PyHamcrest-1.10.1.tar.gz2%C4%01%0A%1Abeam%3Aartifact%3Atype%3Afile%3Av1%12i%0Ag<https://ci-beam.apache.org/job/beam_PostCommit_Python36/ws/src/sdks/python/build/apache-beam.tar.gz%1A%20beam%3Aartifact%3Arole%3Astaging_to%3Av1%22%19%0A%17dataflow_python_sdk.tar2%9C%02%0A%1Abeam%3Aartifact%3Atype%3Afile%3Av1%12%C4%01%0A%C1%01/home/jenkins/jenkins-slave/workspace/beam_PostCommit_Python36/src/runners/google-cloud-dataflow-java/worker/build/libs/beam-runners-google-cloud-dataflow-java-fn-api-worker-2.25.0-SNAPSHOT.jar%1A%20beam%3Aartifact%3Arole%3Astaging_to%3Av1%22%15%0A%13dataflow-worker.jarjx%0A%22%0A%20beam%3Awindow_fn%3Aglobal_windows%3Av1%10%01%1A%1Dref_Coder_GlobalWindowCoder_1%22%02%3A%00%28%010%018%01H%01Z%25ref_Environment_default_environment_1">
}
},
{
"kind": "CollectionToSingleton",
"name": "SideInput-s20",
"properties": {
"output_info": [
{
"encoding": {
"@type": "kind:stream",
"component_encodings": [
{
"@type": "kind:windowed_value",
"component_encodings": [
{
"@type": "FastPrimitivesCoder$QlpoOTFBWSZTWYQR6NMAAEDXwH8QgCEJAEBAv279AmAAIABqEqnqGgaABpoyNAGVHpGgMgDQBk0oR6IeoECBiqqU5NY23ndshzT2UPUOGrg42YPi9VyA8lbwwPJgtghxs5Qq1aWwExCDeMa0RHC2QigTCdizz1nx+LuSKcKEhCCPRpg=",
"component_encodings": [
{
"@type": "FastPrimitivesCoder$QlpoOTFBWSZTWYQR6NMAAEDXwH8QgCEJAEBAv279AmAAIABqEqnqGgaABpoyNAGVHpGgMgDQBk0oR6IeoECBiqqU5NY23ndshzT2UPUOGrg42YPi9VyA8lbwwPJgtghxs5Qq1aWwExCDeMa0RHC2QigTCdizz1nx+LuSKcKEhCCPRpg=",
"component_encodings": [],
"pipeline_proto_coder_id": "ref_Coder_FastPrimitivesCoder_5"
},
{
"@type": "FastPrimitivesCoder$QlpoOTFBWSZTWYQR6NMAAEDXwH8QgCEJAEBAv279AmAAIABqEqnqGgaABpoyNAGVHpGgMgDQBk0oR6IeoECBiqqU5NY23ndshzT2UPUOGrg42YPi9VyA8lbwwPJgtghxs5Qq1aWwExCDeMa0RHC2QigTCdizz1nx+LuSKcKEhCCPRpg=",
"component_encodings": [],
"pipeline_proto_coder_id": "ref_Coder_FastPrimitivesCoder_5"
}
],
"is_pair_like": true,
"pipeline_proto_coder_id": "ref_Coder_FastPrimitivesCoder_5"
},
{
"@type": "kind:global_window"
}
],
"is_wrapper": true
}
],
"is_stream_like": {
"value": true
}
},
"output_name": "out",
"user_name": "Write/Write/WriteImpl/FinalizeWrite/_UnpickledSideInput(PreFinalize.out.0).output"
}
],
"parallel_input": {
"@type": "OutputReference",
"output_name": "None",
"step_name": "s17"
},
"user_name": "Write/Write/WriteImpl/FinalizeWrite/_UnpickledSideInput(PreFinalize.out.0)",
"windowing_strategy": "%0A%8C%11%22%40%0A%1Dref_Coder_GlobalWindowCoder_1%12%1F%0A%1D%0A%1Bbeam%3Acoder%3Aglobal_window%3Av1%2A%C7%10%0A%25ref_Environment_default_environment_1%12%9D%10%12%12beam%3Aenv%3Adocker%3Av1%1A%3D%0A%3Bgcr.io/cloud-dataflow/v1beta3/python36%3Abeam-master-20200630%2A%13beam%3Acoder%3Abytes%3Av1%2A%19beam%3Acoder%3Astring_utf8%3Av1%2A%10beam%3Acoder%3Akv%3Av1%2A%12beam%3Acoder%3Abool%3Av1%2A%14beam%3Acoder%3Avarint%3Av1%2A%14beam%3Acoder%3Adouble%3Av1%2A%16beam%3Acoder%3Aiterable%3Av1%2A%13beam%3Acoder%3Atimer%3Av1%2A%1Dbeam%3Acoder%3Ainterval_window%3Av1%2A%1Bbeam%3Acoder%3Alength_prefix%3Av1%2A%1Bbeam%3Acoder%3Aglobal_window%3Av1%2A%1Cbeam%3Acoder%3Awindowed_value%3Av1%2A%22beam%3Acoder%3Aparam_windowed_value%3Av1%2A%23beam%3Acoder%3Astate_backed_iterable%3Av1%2A%11beam%3Acoder%3Arow%3Av1%2A%23beam%3Aprotocol%3Aprogress_reporting%3Av0%2A%1Ebeam%3Aprotocol%3Aworker_status%3Av1%2A%3Abeam%3Aversion%3Asdk_base%3Aapache/beam_python3.6_sdk%3A2.25.0.dev2q%0A%1Abeam%3Aartifact%3Atype%3Afile%3Av1%12%1D%0A%1Bpostcommit_requirements.txt%1A%20beam%3Aartifact%3Arole%3Astaging_to%3Av1%22%12%0A%10requirements.txt2%9B%01%0A%1Abeam%3Aartifact%3Atype%3Afile%3Av1%12%3D%0A%3B/tmp/dataflow-requirements-cache/parameterized-0.7.4.tar.gz%1A%20beam%3Aartifact%3Arole%3Astaging_to%3Av1%22%1C%0A%1Aparameterized-0.7.4.tar.gz2%89%01%0A%1Abeam%3Aartifact%3Atype%3Afile%3Av1%124%0A2/tmp/dataflow-requirements-cache/mock-2.0.0.tar.gz%1A%20beam%3Aartifact%3Arole%3Astaging_to%3Av1%22%13%0A%11mock-2.0.0.tar.gz2%89%01%0A%1Abeam%3Aartifact%3Atype%3Afile%3Av1%124%0A2/tmp/dataflow-requirements-cache/six-1.15.0.tar.gz%1A%20beam%3Aartifact%3Arole%3Astaging_to%3Av1%22%13%0A%11six-1.15.0.tar.gz2%91%01%0A%1Abeam%3Aartifact%3Atype%3Afile%3Av1%128%0A6/tmp/dataflow-requirements-cache/funcsigs-1.0.2.tar.gz%1A%20beam%3Aartifact%3Arole%3Astaging_to%3Av1%22%17%0A%15funcsigs-1.0.2.tar.gz2%87%01%0A%1Abeam%3Aartifact%3Atype%3Afile%3Av1%123%0A1/tmp/dataflow-requirements-cache/pbr-5.4.5.tar.gz%1A%20beam%3Aartifact%3Arole%3Astaging_to%3Av1%22%12%0A%10pbr-5.4.5.tar.gz2%97%01%0A%1Abeam%3Aartifact%3Atype%3Afile%3Av1%12%3B%0A9/tmp/dataflow-requirements-cache/PyHamcrest-1.10.1.tar.gz%1A%20beam%3Aartifact%3Arole%3Astaging_to%3Av1%22%1A%0A%18PyHamcrest-1.10.1.tar.gz2%C4%01%0A%1Abeam%3Aartifact%3Atype%3Afile%3Av1%12i%0Ag<https://ci-beam.apache.org/job/beam_PostCommit_Python36/ws/src/sdks/python/build/apache-beam.tar.gz%1A%20beam%3Aartifact%3Arole%3Astaging_to%3Av1%22%19%0A%17dataflow_python_sdk.tar2%9C%02%0A%1Abeam%3Aartifact%3Atype%3Afile%3Av1%12%C4%01%0A%C1%01/home/jenkins/jenkins-slave/workspace/beam_PostCommit_Python36/src/runners/google-cloud-dataflow-java/worker/build/libs/beam-runners-google-cloud-dataflow-java-fn-api-worker-2.25.0-SNAPSHOT.jar%1A%20beam%3Aartifact%3Arole%3Astaging_to%3Av1%22%15%0A%13dataflow-worker.jarjx%0A%22%0A%20beam%3Awindow_fn%3Aglobal_windows%3Av1%10%01%1A%1Dref_Coder_GlobalWindowCoder_1%22%02%3A%00%28%010%018%01H%01Z%25ref_Environment_default_environment_1">
}
},
{
"kind": "ParallelDo",
"name": "s21",
"properties": {
"display_data": [
{
"key": "fn",
"label": "Transform Function",
"namespace": "apache_beam.transforms.core.ParDo",
"shortValue": "CallableWrapperDoFn",
"type": "STRING",
"value": "apache_beam.transforms.core.CallableWrapperDoFn"
},
{
"key": "fn",
"label": "Transform Function",
"namespace": "apache_beam.transforms.core.CallableWrapperDoFn",
"type": "STRING",
"value": "_finalize_write"
}
],
"non_parallel_inputs": {
"python_side_input0-Write/Write/WriteImpl/FinalizeWrite": {
"@type": "OutputReference",
"output_name": "out",
"step_name": "SideInput-s18"
},
"python_side_input1-Write/Write/WriteImpl/FinalizeWrite": {
"@type": "OutputReference",
"output_name": "out",
"step_name": "SideInput-s19"
},
"python_side_input2-Write/Write/WriteImpl/FinalizeWrite": {
"@type": "OutputReference",
"output_name": "out",
"step_name": "SideInput-s20"
}
},
"output_info": [
{
"encoding": {
"@type": "kind:windowed_value",
"component_encodings": [
{
"@type": "FastPrimitivesCoder$QlpoOTFBWSZTWYQR6NMAAEDXwH8QgCEJAEBAv279AmAAIABqEqnqGgaABpoyNAGVHpGgMgDQBk0oR6IeoECBiqqU5NY23ndshzT2UPUOGrg42YPi9VyA8lbwwPJgtghxs5Qq1aWwExCDeMa0RHC2QigTCdizz1nx+LuSKcKEhCCPRpg=",
"component_encodings": [
{
"@type": "FastPrimitivesCoder$QlpoOTFBWSZTWYQR6NMAAEDXwH8QgCEJAEBAv279AmAAIABqEqnqGgaABpoyNAGVHpGgMgDQBk0oR6IeoECBiqqU5NY23ndshzT2UPUOGrg42YPi9VyA8lbwwPJgtghxs5Qq1aWwExCDeMa0RHC2QigTCdizz1nx+LuSKcKEhCCPRpg=",
"component_encodings": [],
"pipeline_proto_coder_id": "ref_Coder_FastPrimitivesCoder_5"
},
{
"@type": "FastPrimitivesCoder$QlpoOTFBWSZTWYQR6NMAAEDXwH8QgCEJAEBAv279AmAAIABqEqnqGgaABpoyNAGVHpGgMgDQBk0oR6IeoECBiqqU5NY23ndshzT2UPUOGrg42YPi9VyA8lbwwPJgtghxs5Qq1aWwExCDeMa0RHC2QigTCdizz1nx+LuSKcKEhCCPRpg=",
"component_encodings": [],
"pipeline_proto_coder_id": "ref_Coder_FastPrimitivesCoder_5"
}
],
"is_pair_like": true,
"pipeline_proto_coder_id": "ref_Coder_FastPrimitivesCoder_5"
},
{
"@type": "kind:global_window"
}
],
"is_wrapper": true
},
"output_name": "None",
"user_name": "Write/Write/WriteImpl/FinalizeWrite.out"
}
],
"parallel_input": {
"@type": "OutputReference",
"output_name": "out",
"step_name": "s7"
},
"serialized_fn": "QlpoOTFBWSZTWWTrV70ACJB/////////////////////////////////////////////4AjT6j0dtyXF3N2BrJkFcDaUTqg1NRJqfopiemjU0xDRoyeSepoNMJoMTRiAzU00Aep6g0AAAAD1ABoAGgAaA0DIMmjTQA2oAGjGoaYI09I9IZDTyQZIQAQwRMJpoaU00A9NQ2oaAAPUAeo0AA0ANAANAAAAAAAAAAAAAAAZAAAAAACTAATAAEwAAAAAAAAAAAAAAAAAAAAAAAAAAAAAAAAAAAAAKaeog0U000aTIAaAAAA0aADQAAAAAADQGmgAAAAAABoAAAAAAAAAAAAACTAATAAEwAAAAAAAAAAAAAAAAAAAAAAAAAAAAAAAAAAAAAEihDQgCMlT3qmypvRNqnlPSep+lHqfqh6TTaj1MymanqbQjQBoAyNGnqeo0G1BoA9QAAADRkDEAAAAAAADQ00ANAAGVS7W2gwgSU8wKjLUc9J8TSviWGrVrYMN8aVYtsgeWLS6WsNxxv2LDjbTJ3lyK0I15p33aKIFzPwB40r20YgiEBChQICRpiTaQDODkODJJcqmMa0egeiRkxjQlIQgnXcZAGLO8BYCgTxIRwCsOFDwZHZqXJrVu3eXr9exZzbNdKzMXS8Xzyv+DXJHkDIEJZjKSFoszGibTDmDKVWkwdYtxDGcIkWnCOhIhMuhd4JUePtC7YSKkVXyIeEp2WMqCqVJIJBKBKIo1kZBICUyXEkpRgGRe7yiNv+BIiSlIOGY5DJyJJGjgaQNII0BfFGCWEHM45GrTViLwRvQCGAjBxUIkYjYSNcRihsbxECDYbQgoaZEZHI5JkG0yGA3wzfkrxnGgFBlJFawhkMxSTJEymvchWEGc5C8ztaoN6ETGi59fP7rc/9uo6HuXyU4VviXeLx0nNdLxIgJtOaS7lHU1k3Ij9AxTx70HqY9K/EibKGwUaD8Ca9ZjNZ3P6PT6thhhhhlSkpSlKlKSkD+wB57CmnhiiTJNd7xGKiqLS4nObrhcWuTicoWb4VAuME01awsWIlJkhN0MgsPDv0J0F7TiotlwqMLjxYBvfNG4d8dLmYwTEtpWdle/rsUyoZiCyto6mVZMUze3oe4BupEpEmSkZzMViqUiCaqUUEQbUoWcfv/OkDgFFR20nZeuN7HY8QwqxzyONqLK4EZQRpLmDFRIoUIBTUxRMC5c6CB2XhrjSakzNI4hEkb4LlrXOko+MnH5nnvehGXW4zdoo3ntB7by/h/TIunlqnkz5pMPl2qYRl9d6IpfqLTQQl6/W7mQ3yHDs8jnep1WHjnp+govxUP7sCIgQg3R0iq8qr5zmRjtq7oIEjJBLFnrAlBIRpoMGONu4aBX3WQ66xsiCTSIiZfVzO42Dvy65BJYr0T7jJ21c4yi1QugVqOQWbHeEpWoKkDpYkFRyJuOkjxKOp2f2js6vmKw5t/tknlYvrzbPVPzhhEk+XXn5yhVehxaJikg5PFxkbO26LZBeDObUjiB6NhUoiQhwIMcEeKDJjTFhJlGaQoOURDr0x2zhkziASzJTLU4deU8cVLsiqYTkPGpNAsXOWlRRcoBhb32vnkcsmKtJKaqC8LEWi3YKtibNqo5zzgqqFiLGYNzxs9ItzvQLSAMhalNNw0DLeFeBXXpXbQhUJgIBeM5YXQPNPU8iky4A4vnZpAlIwbTjCtmhe13rt3X7jvGaP6EtKn2KXTeAhNOYEBMcP4nxvf0hsdDbrZbShAtuDoORvkwe5BQhjibghJUkYlvLrlCZmO3ERh7sqD0x4aw1JLUUcMdNXL6z2LFHFGTHt2KbEGTJSlni2auoWAnCy+r9thHA3X2C9rOg8CWkDBuq1MWBaq49WKhu2lblRcrivIFRRODqqFBVSdEW6qjKkldX/a7KyRgIdmJWcfUVSvx5AITC/E0ynXS5oVNouKpxspdBGyEJELc9oHTJBBkQMrBQMjQY6aSKgBbY6HglcBtrxE4vAFkCzYmtGWYLXpKga9SssZhVQDALSxqMjGFBEjO89h7rVMRs8hpT3a4mh9v8thrDLIacoWDKCMG0QAewkAjgnVPrhg1zYZ4BmDGjpYOZZNxgDPLzWnCzIlL/frW/K6xGGUGApVL4mbxTEYXkBizpKpYFYCwAgL0BUUTJrGAaVZh/izOyZvAbzX7barapb04xhohyVvIm7rBROSatZvRk7NZV7w5YaG2aOOOIIYTFWLQ2e8x7UWDf5D4EYpota0JRDDHqVU0EHLFpspMGlP1RCHwNEAtZ6DJrIw2XGLBUL41DiPkG8tFC8i79mVK58CoV4zbL820hDYXcArNAXBNBYrpwBAU2KFrujvWbpPPvzKpwamJNgljakoqsM4kpAylNu0pyQJCwXjilGasOTLFNrzipp3d0V3T0qAmMDA0UzC4FpW1FCdBAhKAF9xFL292Qm27WVwKWEVS1aKEHILCLUCCs7CYZSymnA2nAyije73lYusJBDQNQy5SkxzU5KShWF0kKDTeDaizN5ZF0I8YwyQtAB5u4rAMjwwnmhdBDSGAiVBfrMgV86FRuwbBs4uAUq5r4TSnC7DQUZ4WA2Zw2ciI5HZPbI+jsCEemQRxGIKLjEIQppqnACIEPHtJW001AJabUp7DkTcGUC2222dt4ykP0KDV+JJEw9ewKAUPykpedx81I1qgmFJZcEhUhS1w5RBOLQaBdQZMLDMRanYRCHpBa3j9IAAAAAAADYAcADrbb1LgYBERERFALQCfwTZn79a2UIaBERES1oBLWsy1uOOMQYM66+DDqEOEHz6BBEREREpToZCgREREuCAbAQhDkEApJzNEY750GhnhlQpHOEnPf4ttkRrgqCBBaLovhbU1mrUORR7BjjAKyQ8ILpwpaTHrKhzgltmChMcNgqxU3MBA5oMhlMyqFqFL60OTCFeIcOIUq93EHzImOofABbMrgiBdGSoB0M5xnwcQZI0pDI1KJRQqqukKqWHJS0C6GGVYMUUq5EwsHgw0LIQdMEGUDZ4TCXI7hiinKEcdC2V6nHMxVifIUzERWe4CJrKrEop2WCh2yHCAqMvlwOipJI4gTIGGKmJYZXFBBrkFppxvMvuY4RE/Bilih+7bmJmibhnK0DtM3KwngECEXl97XZdjJ8v1/zjUEZCQEzLzyXEnLVAFu/afFw2NKrkiuYGwsRkXmdFZM1WiRjNadZolJhitgO1wYNqworYRqKLxqKimmdhUrkZms0NkV9ZrWTVFQn5PbFw2B4I9wMkaoVaoRTjFjKuPwhVb1OxM7QUMJRUnz+kPS/VMyTU32+7NHTo1H5/VRU/v+1X+aNat82Yez+fHQN+HKgI64R6+apWDBkhjJFINhwOb0D/X+408BqdCNIhqfVtwaNGt7Sgix4chVoOQB5xw95zIEDwCIAjMGwaYNgxfghBIY0A2khttA/ewEc20HnWhUjS6z0n/xdyRThQkGTrV70=",
"user_name": "Write/Write/WriteImpl/FinalizeWrite/FinalizeWrite"
}
}
],
"type": "JOB_TYPE_BATCH"
}
apache_beam.runners.dataflow.internal.apiclient: INFO: Create job: <Job
createTime: '2020-08-18T12:11:17.451468Z'
currentStateTime: '1970-01-01T00:00:00Z'
id: '2020-08-18_05_11_16-9006266519784321054'
location: 'us-central1'
name: 'beamapp-jenkins-0818121105-616547'
projectId: 'apache-beam-testing'
stageStates: []
startTime: '2020-08-18T12:11:17.451468Z'
steps: []
tempFiles: []
type: TypeValueValuesEnum(JOB_TYPE_BATCH, 1)>
apache_beam.runners.dataflow.internal.apiclient: INFO: Created job with id: [2020-08-18_05_11_16-9006266519784321054]
apache_beam.runners.dataflow.internal.apiclient: INFO: Submitted job: 2020-08-18_05_11_16-9006266519784321054
apache_beam.runners.dataflow.internal.apiclient: INFO: To access the Dataflow monitoring console, please navigate to https://console.cloud.google.com/dataflow/jobs/us-central1/2020-08-18_05_11_16-9006266519784321054?project=apache-beam-testing
apache_beam.io.filesystem: DEBUG: Listing files in 'gs://temp-storage-for-end-to-end-tests/py-it-cloud/output/1597752658803/results'
apache_beam.io.filesystem: DEBUG: translate_pattern: 'gs://temp-storage-for-end-to-end-tests/py-it-cloud/output/1597752658803/results*' -> 'gs\\:\\/\\/temp\\-storage\\-for\\-end\\-to\\-end\\-tests\\/py\\-it\\-cloud\\/output\\/1597752658803\\/results[^/\\\\]*'
apache_beam.io.gcp.gcsio: INFO: Starting the size estimation of the input
apache_beam.io.gcp.gcsio: INFO: Finished listing 0 files in 0.044730424880981445 seconds.
--------------------- >> end captured logging << ---------------------
----------------------------------------------------------------------
XML: nosetests-postCommitIT-df-py36.xml
----------------------------------------------------------------------
XML: <https://ci-beam.apache.org/job/beam_PostCommit_Python36/ws/src/sdks/python/nosetests.xml>
----------------------------------------------------------------------
Ran 66 tests in 3842.605s
FAILED (SKIP=7, errors=1, failures=1)
> Task :sdks:python:test-suites:dataflow:py36:postCommitIT FAILED
FAILURE: Build failed with an exception.
* Where:
Script '<https://ci-beam.apache.org/job/beam_PostCommit_Python36/ws/src/sdks/python/test-suites/dataflow/common.gradle'> line: 118
* What went wrong:
Execution failed for task ':sdks:python:test-suites:dataflow:py36:postCommitIT'.
> Process 'command 'sh'' finished with non-zero exit value 1
* Try:
Run with --stacktrace option to get the stack trace. Run with --info or --debug option to get more log output. Run with --scan to get full insights.
* Get more help at https://help.gradle.org
Deprecated Gradle features were used in this build, making it incompatible with Gradle 6.0.
Use '--warning-mode all' to show the individual deprecation warnings.
See https://docs.gradle.org/5.2.1/userguide/command_line_interface.html#sec:command_line_warnings
BUILD FAILED in 1h 6m 11s
153 actionable tasks: 117 executed, 34 from cache, 2 up-to-date
Publishing build scan...
https://gradle.com/s/mkuvdb5f4smg6
Build step 'Invoke Gradle script' changed build result to FAILURE
Build step 'Invoke Gradle script' marked build as failure
---------------------------------------------------------------------
To unsubscribe, e-mail: builds-unsubscribe@beam.apache.org
For additional commands, e-mail: builds-help@beam.apache.org
Build failed in Jenkins: beam_PostCommit_Python36 #2818
Posted by Apache Jenkins Server <je...@builds.apache.org>.
See <https://ci-beam.apache.org/job/beam_PostCommit_Python36/2818/display/redirect?page=changes>
Changes:
[heejong] [BEAM-10679] improving XLang KafkaIO streaming test
[heejong] fix formatting
[heejong] fix incorrect coder issue
[heejong] use Create
[noreply] [BEAM-9919] Added an External Transform API to Go SDK (#12445)
------------------------------------------
[...truncated 21.47 MB...]
},
"output_name": "None",
"user_name": "m_out.out"
}
],
"parallel_input": {
"@type": "OutputReference",
"output_name": "out",
"step_name": "s4"
},
"serialized_fn": "QlpoOTFBWSZTWXI5+EkAApP/8H/////////////cwr///+ZrwCAAAEBAAvYZlANGGqYqeamp6IPUGGptT1GQADTQ0DQDRp6T1AHqeoBoPU9QZGTRkaCVNAmjQTTKeon6jJMTQAAAAAAAAAAAAA0aBoKaETI0GmJ6gAA0AAAAAAaNAAMgNNDQAHAAAAAAAAAAAAAAAAAAAAMjtJpzFFK4LYqyzjaFELa4VuSZq6LrLJsLgAp9yw6aAEwjBSTUyE4oiRSEJhDnlkr+AQNjGF8k++GNttBFVUVVI0QGgQgktElTZs51pkwhNCuGH3orT8g4ZUAQIYOSiGZlMMiCGAIz0OuasKyOuS9Ik8HI2BSHCiEFKMcXzQwDMHKitKyCim3MkNTwEZ9AUtsyJ+fibxgf1nfK3aotYaCkQpLJIovY7PmiTvRjxoxk1NIosScQM2oIpPHGOKAla0zdncrbnVmLLXfovDxyval1L1TvSprS8481pR3nwW5LjRT0UnvXsc4VQd3YYvCGaB08Rt9pulHKIEj0ILZuFtOO5cpK+QcL1jIqDguD44OS/8TqCWiAzig/mAiehklIPFsRKofUbX+K7pAI0G3EjKMe1tQovpjs/wTRhU1TACAFYLAIUJAHiS8Jm0ZKgmH7D+8SpKVoKnUZdIVTPwGfiHwxZzs5/VAz2lAusURJHd/Vx7TnKh4h2qbUaNcIjvyLapg9cBohcZBqAXVgwgwvllBlUMoIe3t/GoCmUxXGCuYtesFih2Qg159zLL2YbPyQzDwItV5jnsK5laCrC8stwii9NikbsSVXZRmCiVySa/ZBM96I9SjQEqaQMNj2DxyYAh3HqHox6lSlC0GtGToghKCOQE1VBHZ0GTeyAsTA9yl45wy8h/gfqKFCKoMqsD9AtKRJkLi2SSa6kXrczb6WlIwv/mlKwmnWvT2Ulf80XzRuv02tnmZc5dcJEVXUtHaa1zpmuHOauCQtV8qoiQXVVivQ4UEOmYMCPTV7rAghBHnCxDYCqKlxpwnGPHn25pghqWDG7HSooLYsHh3pNoycwEbWJXM4Wh0dyOroqfGOSZIQHLVojbrIzPU4+idbjP21swTiRZUETG3Vqeh/f9GOKGzmMK8gp22cU5fdYS4WqVI/CzElox2gikQlNrPFLJiV5HlZroCAg++qtWtW/f6DXWpu/4u5IpwoSDkc/CSA",
"user_name": "m_out"
}
}
],
"type": "JOB_TYPE_BATCH"
}
INFO:apache_beam.runners.dataflow.dataflow_runner:2020-08-18T07:02:06.740Z: JOB_MESSAGE_DETAILED: Workers have started successfully.
INFO:apache_beam.runners.dataflow.dataflow_runner:2020-08-18T07:02:06.798Z: JOB_MESSAGE_DETAILED: Workers have started successfully.
INFO:apache_beam.runners.dataflow.internal.apiclient:Create job: <Job
createTime: '2020-08-18T07:02:08.993291Z'
currentStateTime: '1970-01-01T00:00:00Z'
id: '2020-08-18_00_02_07-4605807894610304866'
location: 'us-central1'
name: 'beamapp-jenkins-0818070157-822083'
projectId: 'apache-beam-testing'
stageStates: []
startTime: '2020-08-18T07:02:08.993291Z'
steps: []
tempFiles: []
type: TypeValueValuesEnum(JOB_TYPE_BATCH, 1)>
INFO:apache_beam.runners.dataflow.internal.apiclient:Created job with id: [2020-08-18_00_02_07-4605807894610304866]
INFO:apache_beam.runners.dataflow.internal.apiclient:Submitted job: 2020-08-18_00_02_07-4605807894610304866
INFO:apache_beam.runners.dataflow.internal.apiclient:To access the Dataflow monitoring console, please navigate to https://console.cloud.google.com/dataflow/jobs/us-central1/2020-08-18_00_02_07-4605807894610304866?project=apache-beam-testing
INFO:apache_beam.runners.dataflow.dataflow_runner:Job 2020-08-18_00_02_07-4605807894610304866 is in state JOB_STATE_RUNNING
INFO:apache_beam.runners.dataflow.dataflow_runner:2020-08-18T07:02:07.874Z: JOB_MESSAGE_DETAILED: Autoscaling was automatically enabled for job 2020-08-18_00_02_07-4605807894610304866.
INFO:apache_beam.runners.dataflow.dataflow_runner:2020-08-18T07:02:07.874Z: JOB_MESSAGE_DETAILED: Autoscaling is enabled for job 2020-08-18_00_02_07-4605807894610304866. The number of workers will be between 1 and 1000.
INFO:apache_beam.runners.dataflow.dataflow_runner:2020-08-18T07:02:11.951Z: JOB_MESSAGE_BASIC: Worker configuration: n1-standard-1 in us-central1-f.
INFO:apache_beam.runners.dataflow.dataflow_runner:2020-08-18T07:02:13.704Z: JOB_MESSAGE_DETAILED: Expanding CoGroupByKey operations into optimizable parts.
INFO:apache_beam.runners.dataflow.dataflow_runner:2020-08-18T07:02:13.742Z: JOB_MESSAGE_DEBUG: Combiner lifting skipped for step GroupByKey: GroupByKey not followed by a combiner.
INFO:apache_beam.runners.dataflow.dataflow_runner:2020-08-18T07:02:13.780Z: JOB_MESSAGE_DETAILED: Expanding GroupByKey operations into optimizable parts.
INFO:apache_beam.runners.dataflow.dataflow_runner:2020-08-18T07:02:13.821Z: JOB_MESSAGE_DETAILED: Lifting ValueCombiningMappingFns into MergeBucketsMappingFns
INFO:apache_beam.runners.dataflow.dataflow_runner:2020-08-18T07:02:13.882Z: JOB_MESSAGE_DEBUG: Annotating graph with Autotuner information.
INFO:apache_beam.runners.dataflow.dataflow_runner:2020-08-18T07:02:13.929Z: JOB_MESSAGE_DETAILED: Fusing adjacent ParDo, Read, Write, and Flatten operations
INFO:apache_beam.runners.dataflow.dataflow_runner:2020-08-18T07:02:13.962Z: JOB_MESSAGE_DETAILED: Fusing consumer metrics into Create/Read
INFO:apache_beam.runners.dataflow.dataflow_runner:2020-08-18T07:02:13.996Z: JOB_MESSAGE_DETAILED: Fusing consumer map_to_common_key into metrics
INFO:apache_beam.runners.dataflow.dataflow_runner:2020-08-18T07:02:14.021Z: JOB_MESSAGE_DETAILED: Fusing consumer GroupByKey/Reify into map_to_common_key
INFO:apache_beam.runners.dataflow.dataflow_runner:2020-08-18T07:02:14.054Z: JOB_MESSAGE_DETAILED: Fusing consumer GroupByKey/Write into GroupByKey/Reify
INFO:apache_beam.runners.dataflow.dataflow_runner:2020-08-18T07:02:14.086Z: JOB_MESSAGE_DETAILED: Fusing consumer GroupByKey/GroupByWindow into GroupByKey/Read
INFO:apache_beam.runners.dataflow.dataflow_runner:2020-08-18T07:02:14.121Z: JOB_MESSAGE_DETAILED: Fusing consumer m_out into GroupByKey/GroupByWindow
INFO:apache_beam.runners.dataflow.dataflow_runner:2020-08-18T07:02:14.157Z: JOB_MESSAGE_DEBUG: Workflow config is missing a default resource spec.
INFO:apache_beam.runners.dataflow.dataflow_runner:2020-08-18T07:02:14.194Z: JOB_MESSAGE_DEBUG: Adding StepResource setup and teardown to workflow graph.
INFO:apache_beam.runners.dataflow.dataflow_runner:2020-08-18T07:02:14.226Z: JOB_MESSAGE_DEBUG: Adding workflow start and stop steps.
INFO:apache_beam.runners.dataflow.dataflow_runner:2020-08-18T07:02:14.262Z: JOB_MESSAGE_DEBUG: Assigning stage ids.
INFO:apache_beam.runners.dataflow.dataflow_runner:2020-08-18T07:02:14.455Z: JOB_MESSAGE_DEBUG: Executing wait step start13
INFO:apache_beam.runners.dataflow.dataflow_runner:2020-08-18T07:02:14.524Z: JOB_MESSAGE_BASIC: Executing operation GroupByKey/Create
INFO:apache_beam.runners.dataflow.dataflow_runner:2020-08-18T07:02:14.568Z: JOB_MESSAGE_DEBUG: Starting worker pool setup.
INFO:apache_beam.runners.dataflow.dataflow_runner:2020-08-18T07:02:14.602Z: JOB_MESSAGE_BASIC: Starting 1 workers in us-central1-f...
INFO:apache_beam.runners.dataflow.dataflow_runner:2020-08-18T07:02:14.652Z: JOB_MESSAGE_BASIC: Finished operation GroupByKey/Create
INFO:apache_beam.runners.dataflow.dataflow_runner:2020-08-18T07:02:14.744Z: JOB_MESSAGE_DEBUG: Value "GroupByKey/Session" materialized.
INFO:apache_beam.runners.dataflow.dataflow_runner:2020-08-18T07:02:14.825Z: JOB_MESSAGE_BASIC: Executing operation Create/Read+metrics+map_to_common_key+GroupByKey/Reify+GroupByKey/Write
INFO:apache_beam.runners.dataflow.dataflow_runner:2020-08-18T07:02:24.933Z: JOB_MESSAGE_WARNING: Your project already contains 100 Dataflow-created metric descriptors and Stackdriver will not create new Dataflow custom metrics for this job. Each unique user-defined metric name (independent of the DoFn in which it is defined) produces a new metric descriptor. To delete old / unused metric descriptors see https://developers.google.com/apis-explorer/#p/monitoring/v3/monitoring.projects.metricDescriptors.list and https://developers.google.com/apis-explorer/#p/monitoring/v3/monitoring.projects.metricDescriptors.delete
INFO:apache_beam.runners.dataflow.dataflow_runner:2020-08-18T07:02:31.165Z: JOB_MESSAGE_DETAILED: BigQuery export job progress: "dataflow_job_8678625429798208004" observed total of 1 exported files thus far.
INFO:apache_beam.runners.dataflow.dataflow_runner:2020-08-18T07:02:31.189Z: JOB_MESSAGE_BASIC: BigQuery export job finished: "dataflow_job_8678625429798208004"
INFO:apache_beam.runners.dataflow.dataflow_runner:2020-08-18T07:02:33.565Z: JOB_MESSAGE_DETAILED: Workers have started successfully.
INFO:apache_beam.runners.dataflow.dataflow_runner:2020-08-18T07:02:33.596Z: JOB_MESSAGE_DETAILED: Workers have started successfully.
INFO:apache_beam.runners.dataflow.dataflow_runner:2020-08-18T07:02:32.880Z: JOB_MESSAGE_DETAILED: Workers have started successfully.
INFO:apache_beam.runners.dataflow.dataflow_runner:2020-08-18T07:02:32.916Z: JOB_MESSAGE_DETAILED: Workers have started successfully.
INFO:apache_beam.runners.dataflow.dataflow_runner:2020-08-18T07:02:38.237Z: JOB_MESSAGE_DETAILED: Autoscaling: Raised the number of workers to 1 based on the rate of progress in the currently running stage(s).
INFO:apache_beam.runners.dataflow.dataflow_runner:2020-08-18T07:04:31.684Z: JOB_MESSAGE_DETAILED: Workers have started successfully.
INFO:apache_beam.runners.dataflow.dataflow_runner:2020-08-18T07:04:32.652Z: JOB_MESSAGE_DETAILED: Workers have started successfully.
INFO:apache_beam.runners.dataflow.dataflow_runner:2020-08-18T07:05:43.353Z: JOB_MESSAGE_BASIC: Executing BigQuery import job "dataflow_job_1625605645312600986". You can check its status with the bq tool: "bq show -j --project_id=apache-beam-testing dataflow_job_1625605645312600986".
INFO:apache_beam.runners.dataflow.dataflow_runner:2020-08-18T07:05:41.570Z: JOB_MESSAGE_BASIC: Finished operation Type matches/Create/Read+Type matches/Group/pair_with_0+Type matches/Group/GroupByKey/Reify+Type matches/Group/GroupByKey/Write
INFO:apache_beam.runners.dataflow.dataflow_runner:2020-08-18T07:05:45.860Z: JOB_MESSAGE_BASIC: Finished operation Create/Read+InspectForDetails/ParDo(_InspectFn)+ParDo(CallableWrapperDoFn)/ParDo(CallableWrapperDoFn)+Type matches/WindowInto(WindowIntoFn)+Type matches/ToVoidKey+Type matches/Group/pair_with_1+Type matches/Group/GroupByKey/Reify+Type matches/Group/GroupByKey/Write
INFO:apache_beam.runners.dataflow.dataflow_runner:2020-08-18T07:05:45.918Z: JOB_MESSAGE_BASIC: Executing operation Type matches/Group/GroupByKey/Close
INFO:apache_beam.runners.dataflow.dataflow_runner:2020-08-18T07:05:45.958Z: JOB_MESSAGE_BASIC: Finished operation Type matches/Group/GroupByKey/Close
INFO:apache_beam.runners.dataflow.dataflow_runner:2020-08-18T07:05:46.018Z: JOB_MESSAGE_BASIC: Executing operation Type matches/Group/GroupByKey/Read+Type matches/Group/GroupByKey/GroupByWindow+Type matches/Group/Map(_merge_tagged_vals_under_key)+Type matches/Unkey+Type matches/Match
INFO:apache_beam.runners.dataflow.dataflow_runner:2020-08-18T07:05:54.032Z: JOB_MESSAGE_BASIC: BigQuery import job "dataflow_job_1625605645312600986" done.
INFO:apache_beam.runners.dataflow.dataflow_runner:2020-08-18T07:05:55.262Z: JOB_MESSAGE_BASIC: Finished operation Type matches/Group/GroupByKey/Read+Type matches/Group/GroupByKey/GroupByWindow+Type matches/Group/Map(_merge_tagged_vals_under_key)+Type matches/Unkey+Type matches/Match
INFO:apache_beam.runners.dataflow.dataflow_runner:2020-08-18T07:05:55.318Z: JOB_MESSAGE_DEBUG: Executing success step success19
INFO:apache_beam.runners.dataflow.dataflow_runner:2020-08-18T07:05:55.381Z: JOB_MESSAGE_DETAILED: Cleaning up.
INFO:apache_beam.runners.dataflow.dataflow_runner:2020-08-18T07:05:55.433Z: JOB_MESSAGE_DEBUG: Starting worker pool teardown.
INFO:apache_beam.runners.dataflow.dataflow_runner:2020-08-18T07:05:55.459Z: JOB_MESSAGE_BASIC: Stopping worker pool...
INFO:apache_beam.runners.dataflow.dataflow_runner:2020-08-18T07:05:54.838Z: JOB_MESSAGE_BASIC: Finished operation read+write/NativeWrite
INFO:apache_beam.runners.dataflow.dataflow_runner:2020-08-18T07:05:54.907Z: JOB_MESSAGE_DEBUG: Executing success step success1
INFO:apache_beam.runners.dataflow.dataflow_runner:2020-08-18T07:05:54.982Z: JOB_MESSAGE_DETAILED: Cleaning up.
INFO:apache_beam.runners.dataflow.dataflow_runner:2020-08-18T07:05:55.275Z: JOB_MESSAGE_DEBUG: Starting worker pool teardown.
INFO:apache_beam.runners.dataflow.dataflow_runner:2020-08-18T07:05:55.294Z: JOB_MESSAGE_BASIC: Stopping worker pool...
INFO:apache_beam.runners.dataflow.dataflow_runner:2020-08-18T07:06:12.925Z: JOB_MESSAGE_BASIC: Finished operation assert_that/Create/Read+assert_that/Group/pair_with_0+assert_that/Group/GroupByKey/Reify+assert_that/Group/GroupByKey/Write
INFO:apache_beam.runners.dataflow.dataflow_runner:2020-08-18T07:06:16.073Z: JOB_MESSAGE_BASIC: Finished operation Create/Read+ExternalTransform(simple)/Map(<lambda at external_it_test.py:43>)+assert_that/WindowInto(WindowIntoFn)+assert_that/ToVoidKey+assert_that/Group/pair_with_1+assert_that/Group/GroupByKey/Reify+assert_that/Group/GroupByKey/Write
INFO:apache_beam.runners.dataflow.dataflow_runner:2020-08-18T07:06:16.140Z: JOB_MESSAGE_BASIC: Executing operation assert_that/Group/GroupByKey/Close
INFO:apache_beam.runners.dataflow.dataflow_runner:2020-08-18T07:06:16.181Z: JOB_MESSAGE_BASIC: Finished operation assert_that/Group/GroupByKey/Close
INFO:apache_beam.runners.dataflow.dataflow_runner:2020-08-18T07:06:16.225Z: JOB_MESSAGE_BASIC: Executing operation assert_that/Group/GroupByKey/Read+assert_that/Group/GroupByKey/GroupByWindow+assert_that/Group/Map(_merge_tagged_vals_under_key)+assert_that/Unkey+assert_that/Match
INFO:oauth2client.transport:Refreshing due to a 401 (attempt 1/2)
INFO:oauth2client.transport:Refreshing due to a 401 (attempt 1/2)
INFO:oauth2client.transport:Refreshing due to a 401 (attempt 1/2)
INFO:apache_beam.runners.dataflow.dataflow_runner:2020-08-18T07:06:25.469Z: JOB_MESSAGE_BASIC: Finished operation assert_that/Group/GroupByKey/Read+assert_that/Group/GroupByKey/GroupByWindow+assert_that/Group/Map(_merge_tagged_vals_under_key)+assert_that/Unkey+assert_that/Match
INFO:apache_beam.runners.dataflow.dataflow_runner:2020-08-18T07:06:25.525Z: JOB_MESSAGE_DEBUG: Executing success step success19
INFO:apache_beam.runners.dataflow.dataflow_runner:2020-08-18T07:06:25.600Z: JOB_MESSAGE_DETAILED: Cleaning up.
INFO:apache_beam.runners.dataflow.dataflow_runner:2020-08-18T07:06:25.663Z: JOB_MESSAGE_DEBUG: Starting worker pool teardown.
INFO:apache_beam.runners.dataflow.dataflow_runner:2020-08-18T07:06:25.686Z: JOB_MESSAGE_BASIC: Stopping worker pool...
INFO:oauth2client.transport:Refreshing due to a 401 (attempt 1/2)
INFO:apache_beam.runners.dataflow.dataflow_runner:2020-08-18T07:06:41.298Z: JOB_MESSAGE_DETAILED: Autoscaling: Resized worker pool from 1 to 0.
INFO:apache_beam.runners.dataflow.dataflow_runner:2020-08-18T07:06:41.328Z: JOB_MESSAGE_BASIC: Worker pool stopped.
INFO:apache_beam.runners.dataflow.dataflow_runner:2020-08-18T07:06:41.356Z: JOB_MESSAGE_DEBUG: Tearing down pending resources...
INFO:apache_beam.runners.dataflow.dataflow_runner:2020-08-18T07:06:46.754Z: JOB_MESSAGE_DETAILED: Autoscaling: Resized worker pool from 1 to 0.
INFO:apache_beam.runners.dataflow.dataflow_runner:2020-08-18T07:06:46.790Z: JOB_MESSAGE_BASIC: Worker pool stopped.
INFO:apache_beam.runners.dataflow.dataflow_runner:2020-08-18T07:06:46.818Z: JOB_MESSAGE_DEBUG: Tearing down pending resources...
INFO:apache_beam.runners.dataflow.dataflow_runner:Job 2020-08-17_23_59_50-4821588316035178261 is in state JOB_STATE_DONE
INFO:apache_beam.runners.dataflow.dataflow_runner:Job 2020-08-18_00_00_08-3262315565744148667 is in state JOB_STATE_DONE
INFO:apache_beam.io.gcp.tests.bigquery_matcher:Attempting to perform query SELECT fruit from `python_query_to_table_15977339965208.output_table`; to BQ
DEBUG:google.auth._default:Checking None for explicit credentials as part of auth process...
DEBUG:google.auth._default:Checking Cloud SDK credentials as part of auth process...
DEBUG:google.auth._default:Cloud SDK credentials not found on disk; not using them
DEBUG:google.auth._default:Checking for App Engine runtime as part of auth process...
DEBUG:google.auth._default:No App Engine library was found so cannot authentication via App Engine Identity Credentials.
DEBUG:google.auth.transport._http_client:Making request: GET http://169.254.169.254
DEBUG:google.auth.transport._http_client:Making request: GET http://metadata.google.internal/computeMetadata/v1/project/project-id
DEBUG:urllib3.util.retry:Converted retries value: 3 -> Retry(total=3, connect=None, read=None, redirect=None, status=None)
DEBUG:google.auth.transport.requests:Making request: GET http://metadata.google.internal/computeMetadata/v1/instance/service-accounts/default/?recursive=true
DEBUG:urllib3.connectionpool:Starting new HTTP connection (1): metadata.google.internal:80
DEBUG:urllib3.connectionpool:http://metadata.google.internal:80 "GET /computeMetadata/v1/instance/service-accounts/default/?recursive=true HTTP/1.1" 200 144
DEBUG:google.auth.transport.requests:Making request: GET http://metadata.google.internal/computeMetadata/v1/instance/service-accounts/844138762903-compute@developer.gserviceaccount.com/token
DEBUG:urllib3.connectionpool:http://metadata.google.internal:80 "GET /computeMetadata/v1/instance/service-accounts/844138762903-compute@developer.gserviceaccount.com/token HTTP/1.1" 200 221
DEBUG:urllib3.connectionpool:Starting new HTTPS connection (1): bigquery.googleapis.com:443
DEBUG:urllib3.connectionpool:https://bigquery.googleapis.com:443 "POST /bigquery/v2/projects/apache-beam-testing/jobs HTTP/1.1" 200 None
DEBUG:urllib3.connectionpool:https://bigquery.googleapis.com:443 "GET /bigquery/v2/projects/apache-beam-testing/queries/537e348a-3289-4ec7-bf37-55f8cfd454bc?maxResults=0&location=US HTTP/1.1" 200 None
DEBUG:urllib3.connectionpool:https://bigquery.googleapis.com:443 "GET /bigquery/v2/projects/apache-beam-testing/datasets/_7357fab0f784d2a7327ddbe81cdd1f4ca7e429cd/tables/anon7cf2547bbe2d9e43e0c2e2f3afd59347a9cab72e/data HTTP/1.1" 200 None
INFO:apache_beam.io.gcp.tests.bigquery_matcher:Read from given query (SELECT fruit from `python_query_to_table_15977339965208.output_table`;), total rows 2
INFO:apache_beam.io.gcp.tests.bigquery_matcher:Generate checksum: 158a8ea1c254fcf40d4ed3e7c0242c3ea0a29e72
INFO:apache_beam.runners.dataflow.dataflow_runner:2020-08-18T07:07:20.577Z: JOB_MESSAGE_DETAILED: Autoscaling: Resized worker pool from 1 to 0.
INFO:apache_beam.runners.dataflow.dataflow_runner:2020-08-18T07:07:20.618Z: JOB_MESSAGE_BASIC: Worker pool stopped.
INFO:apache_beam.runners.dataflow.dataflow_runner:2020-08-18T07:07:20.653Z: JOB_MESSAGE_DEBUG: Tearing down pending resources...
INFO:apache_beam.runners.dataflow.dataflow_runner:Job 2020-08-18_00_00_19-334392657831892281 is in state JOB_STATE_DONE
INFO:apache_beam.runners.dataflow.dataflow_runner:2020-08-18T07:08:15.486Z: JOB_MESSAGE_BASIC: Finished operation Create/Read+metrics+map_to_common_key+GroupByKey/Reify+GroupByKey/Write
INFO:apache_beam.runners.dataflow.dataflow_runner:2020-08-18T07:08:15.597Z: JOB_MESSAGE_BASIC: Executing operation GroupByKey/Close
INFO:apache_beam.runners.dataflow.dataflow_runner:2020-08-18T07:08:15.656Z: JOB_MESSAGE_BASIC: Finished operation GroupByKey/Close
INFO:apache_beam.runners.dataflow.dataflow_runner:2020-08-18T07:08:15.736Z: JOB_MESSAGE_BASIC: Executing operation GroupByKey/Read+GroupByKey/GroupByWindow+m_out
INFO:apache_beam.runners.dataflow.dataflow_runner:2020-08-18T07:08:24.801Z: JOB_MESSAGE_BASIC: Finished operation GroupByKey/Read+GroupByKey/GroupByWindow+m_out
INFO:apache_beam.runners.dataflow.dataflow_runner:2020-08-18T07:08:24.899Z: JOB_MESSAGE_DEBUG: Executing success step success11
INFO:apache_beam.runners.dataflow.dataflow_runner:2020-08-18T07:08:24.986Z: JOB_MESSAGE_DETAILED: Cleaning up.
INFO:apache_beam.runners.dataflow.dataflow_runner:2020-08-18T07:08:25.055Z: JOB_MESSAGE_DEBUG: Starting worker pool teardown.
INFO:apache_beam.runners.dataflow.dataflow_runner:2020-08-18T07:08:25.093Z: JOB_MESSAGE_BASIC: Stopping worker pool...
INFO:apache_beam.runners.dataflow.dataflow_runner:2020-08-18T07:09:15.823Z: JOB_MESSAGE_DETAILED: Autoscaling: Resized worker pool from 1 to 0.
INFO:apache_beam.runners.dataflow.dataflow_runner:2020-08-18T07:09:15.884Z: JOB_MESSAGE_BASIC: Worker pool stopped.
INFO:apache_beam.runners.dataflow.dataflow_runner:2020-08-18T07:09:15.918Z: JOB_MESSAGE_DEBUG: Tearing down pending resources...
INFO:apache_beam.runners.dataflow.dataflow_runner:Job 2020-08-18_00_02_07-4605807894610304866 is in state JOB_STATE_DONE
test_bigquery_tornadoes_it (apache_beam.examples.cookbook.bigquery_tornadoes_it_test.BigqueryTornadoesIT) ... ok
test_streaming_wordcount_debugging_it (apache_beam.examples.streaming_wordcount_debugging_it_test.StreamingWordcountDebuggingIT) ... SKIP: Skipped due to [BEAM-3377]: assert_that not working for streaming
test_autocomplete_it (apache_beam.examples.complete.autocomplete_test.AutocompleteTest) ... ok
test_datastore_wordcount_it (apache_beam.examples.cookbook.datastore_wordcount_it_test.DatastoreWordCountIT) ... ok
test_leader_board_it (apache_beam.examples.complete.game.leader_board_it_test.LeaderBoardIT) ... ok
test_game_stats_it (apache_beam.examples.complete.game.game_stats_it_test.GameStatsIT) ... ok
test_streaming_wordcount_it (apache_beam.examples.streaming_wordcount_it_test.StreamingWordCountIT) ... ok
test_wordcount_fnapi_it (apache_beam.examples.wordcount_it_test.WordCountIT) ... ok
test_user_score_it (apache_beam.examples.complete.game.user_score_it_test.UserScoreIT) ... ok
test_wordcount_it (apache_beam.examples.wordcount_it_test.WordCountIT) ... ok
test_hourly_team_score_it (apache_beam.examples.complete.game.hourly_team_score_it_test.HourlyTeamScoreIT) ... ok
test_avro_it (apache_beam.examples.fastavro_it_test.FastavroIT) ... ok
test_read_via_sql (apache_beam.io.gcp.experimental.spannerio_read_it_test.SpannerReadIntegrationTest) ... ok
test_read_via_table (apache_beam.io.gcp.experimental.spannerio_read_it_test.SpannerReadIntegrationTest) ... ok
test_bigquery_read_1M_python (apache_beam.io.gcp.bigquery_io_read_it_test.BigqueryIOReadIT) ... ok
test_bigquery_read_custom_1M_python (apache_beam.io.gcp.bigquery_io_read_it_test.BigqueryIOReadIT) ... ok
test_iobase_source (apache_beam.io.gcp.bigquery_read_it_test.ReadNewTypesTests) ... ok
test_native_source (apache_beam.io.gcp.bigquery_read_it_test.ReadNewTypesTests) ... ok
test_iobase_source (apache_beam.io.gcp.bigquery_read_it_test.ReadTests) ... ok
test_native_source (apache_beam.io.gcp.bigquery_read_it_test.ReadTests) ... ok
test_bqfl_streaming (apache_beam.io.gcp.bigquery_file_loads_test.BigQueryFileLoadsIT) ... SKIP: TestStream is not supported on TestDataflowRunner
test_multiple_destinations_transform (apache_beam.io.gcp.bigquery_file_loads_test.BigQueryFileLoadsIT) ... ok
test_one_job_fails_all_jobs_fail (apache_beam.io.gcp.bigquery_file_loads_test.BigQueryFileLoadsIT) ... ok
test_avro_file_load (apache_beam.io.gcp.bigquery_test.BigQueryFileLoadsIntegrationTests) ... ok
test_spanner_error (apache_beam.io.gcp.experimental.spannerio_write_it_test.SpannerWriteIntegrationTest) ... ok
test_spanner_update (apache_beam.io.gcp.experimental.spannerio_write_it_test.SpannerWriteIntegrationTest) ... ok
test_write_batches (apache_beam.io.gcp.experimental.spannerio_write_it_test.SpannerWriteIntegrationTest) ... ok
test_copy (apache_beam.io.gcp.gcsio_integration_test.GcsIOIntegrationTest) ... ok
test_copy_batch (apache_beam.io.gcp.gcsio_integration_test.GcsIOIntegrationTest) ... ok
test_copy_batch_kms (apache_beam.io.gcp.gcsio_integration_test.GcsIOIntegrationTest) ... ok
test_copy_batch_rewrite_token (apache_beam.io.gcp.gcsio_integration_test.GcsIOIntegrationTest) ... ok
test_copy_kms (apache_beam.io.gcp.gcsio_integration_test.GcsIOIntegrationTest) ... ok
test_copy_rewrite_token (apache_beam.io.gcp.gcsio_integration_test.GcsIOIntegrationTest) ... ok
test_multiple_destinations_transform (apache_beam.io.gcp.bigquery_test.BigQueryStreamingInsertTransformIntegrationTests) ... ok
test_value_provider_transform (apache_beam.io.gcp.bigquery_test.BigQueryStreamingInsertTransformIntegrationTests) ... ok
test_datastore_write_limit (apache_beam.io.gcp.datastore.v1new.datastore_write_it_test.DatastoreWriteIT) ... ok
test_transform_on_gcs (apache_beam.io.fileio_test.MatchIntegrationTest) ... ok
test_parquetio_it (apache_beam.io.parquetio_it_test.TestParquetIT) ... ok
test_file_loads (apache_beam.io.gcp.bigquery_test.PubSubBigQueryIT) ... SKIP: https://issuetracker.google.com/issues/118375066
test_streaming_inserts (apache_beam.io.gcp.bigquery_test.PubSubBigQueryIT) ... ok
test_dicom_search_instances (apache_beam.io.gcp.dicomio_integration_test.DICOMIoIntegrationTest) ... ok
test_dicom_store_instance_from_gcs (apache_beam.io.gcp.dicomio_integration_test.DICOMIoIntegrationTest) ... ok
test_streaming_data_only (apache_beam.io.gcp.pubsub_integration_test.PubSubIntegrationTest) ... ok
test_streaming_with_attributes (apache_beam.io.gcp.pubsub_integration_test.PubSubIntegrationTest) ... ok
test_analyzing_syntax (apache_beam.ml.gcp.naturallanguageml_test_it.NaturalLanguageMlTestIT) ... ok
test_text_detection_with_language_hint (apache_beam.ml.gcp.visionml_test_it.VisionMlTestIT) ... ok
test_basic_execution (apache_beam.testing.test_stream_it_test.TestStreamIntegrationTests) ... SKIP: The "TestDataflowRunner", does not support the TestStream transform. Supported runners: ['DirectRunner', 'SwitchingDirectRunner']
Tests that the TestStream supports emitting to multiple PCollections. ... SKIP: The "TestDataflowRunner", does not support the TestStream transform. Supported runners: ['DirectRunner', 'SwitchingDirectRunner']
Tests that the TestStream can independently control output watermarks. ... SKIP: The "TestDataflowRunner", does not support the TestStream transform. Supported runners: ['DirectRunner', 'SwitchingDirectRunner']
test_label_detection_with_video_context (apache_beam.ml.gcp.videointelligenceml_test_it.VideoIntelligenceMlTestIT) ... ok
test_big_query_write (apache_beam.io.gcp.bigquery_write_it_test.BigQueryWriteIntegrationTests) ... ok
test_big_query_write_new_types (apache_beam.io.gcp.bigquery_write_it_test.BigQueryWriteIntegrationTests) ... ok
test_big_query_write_schema_autodetect (apache_beam.io.gcp.bigquery_write_it_test.BigQueryWriteIntegrationTests) ... SKIP: DataflowRunner does not support schema autodetection
test_big_query_write_without_schema (apache_beam.io.gcp.bigquery_write_it_test.BigQueryWriteIntegrationTests) ... ok
Runs streaming Dataflow job and verifies that user metrics are reported ... ok
test_deidentification (apache_beam.ml.gcp.cloud_dlp_it_test.CloudDLPIT) ... ok
test_inspection (apache_beam.ml.gcp.cloud_dlp_it_test.CloudDLPIT) ... ok
test_big_query_legacy_sql (apache_beam.io.gcp.big_query_query_to_table_it_test.BigQueryQueryToTableIT) ... ok
test_big_query_new_types (apache_beam.io.gcp.big_query_query_to_table_it_test.BigQueryQueryToTableIT) ... ok
test_big_query_new_types_avro (apache_beam.io.gcp.big_query_query_to_table_it_test.BigQueryQueryToTableIT) ... ok
test_big_query_new_types_native (apache_beam.io.gcp.big_query_query_to_table_it_test.BigQueryQueryToTableIT) ... ok
test_big_query_standard_sql (apache_beam.io.gcp.big_query_query_to_table_it_test.BigQueryQueryToTableIT) ... ok
test_big_query_standard_sql_kms_key_native (apache_beam.io.gcp.big_query_query_to_table_it_test.BigQueryQueryToTableIT) ... ok
test_job_python_from_python_it (apache_beam.transforms.external_it_test.ExternalTransformIT) ... ok
test_metrics_fnapi_it (apache_beam.runners.dataflow.dataflow_exercise_metrics_pipeline_test.ExerciseMetricsPipelineTest) ... ok
test_metrics_it (apache_beam.runners.dataflow.dataflow_exercise_metrics_pipeline_test.ExerciseMetricsPipelineTest) ... ok
----------------------------------------------------------------------
XML: nosetests-postCommitIT-df-py36.xml
----------------------------------------------------------------------
XML: <https://ci-beam.apache.org/job/beam_PostCommit_Python36/ws/src/sdks/python/nosetests.xml>
----------------------------------------------------------------------
Ran 66 tests in 4010.229s
OK (SKIP=7)
FAILURE: Build failed with an exception.
* Where:
Script '<https://ci-beam.apache.org/job/beam_PostCommit_Python36/ws/src/sdks/python/test-suites/direct/common.gradle'> line: 48
* What went wrong:
Execution failed for task ':sdks:python:test-suites:direct:py36:postCommitIT'.
> Process 'command 'sh'' finished with non-zero exit value 1
* Try:
Run with --stacktrace option to get the stack trace. Run with --info or --debug option to get more log output. Run with --scan to get full insights.
* Get more help at https://help.gradle.org
Deprecated Gradle features were used in this build, making it incompatible with Gradle 6.0.
Use '--warning-mode all' to show the individual deprecation warnings.
See https://docs.gradle.org/5.2.1/userguide/command_line_interface.html#sec:command_line_warnings
BUILD FAILED in 1h 8m 57s
153 actionable tasks: 117 executed, 34 from cache, 2 up-to-date
Publishing build scan...
https://gradle.com/s/cqimsuez4oiym
Build step 'Invoke Gradle script' changed build result to FAILURE
Build step 'Invoke Gradle script' marked build as failure
---------------------------------------------------------------------
To unsubscribe, e-mail: builds-unsubscribe@beam.apache.org
For additional commands, e-mail: builds-help@beam.apache.org
Build failed in Jenkins: beam_PostCommit_Python36 #2817
Posted by Apache Jenkins Server <je...@builds.apache.org>.
See <https://ci-beam.apache.org/job/beam_PostCommit_Python36/2817/display/redirect?page=changes>
Changes:
[yoshiki.obata] [BEAM-9980] add groovy functions for python versions
[yoshiki.obata] [BEAM-9980] update dataflow test-suites to switch python versions using
[yoshiki.obata] [BEAM-9980] version switchable dataflow tasks to be invoked
[yoshiki.obata] [BEAM-9980] :sdks:python:test-suites:dataflow included in
[Luke Cwik] [BEAM-10670] Make key coder deterministic by using upstream PCollection
[Udi Meiri] [BEAM-10697] Remove testPy2Cython from precommit
[noreply] [BEAM-9891] Generate query execution summary table after finishing jobs
------------------------------------------
[...truncated 21.54 MB...]
"@type": "kind:pair",
"component_encodings": [
{
"@type": "kind:bytes"
},
{
"@type": "FastPrimitivesCoder$QlpoOTFBWSZTWYQR6NMAAEDXwH8QgCEJAEBAv279AmAAIABqEqnqGgaABpoyNAGVHpGgMgDQBk0oR6IeoECBiqqU5NY23ndshzT2UPUOGrg42YPi9VyA8lbwwPJgtghxs5Qq1aWwExCDeMa0RHC2QigTCdizz1nx+LuSKcKEhCCPRpg=",
"component_encodings": [
{
"@type": "FastPrimitivesCoder$QlpoOTFBWSZTWYQR6NMAAEDXwH8QgCEJAEBAv279AmAAIABqEqnqGgaABpoyNAGVHpGgMgDQBk0oR6IeoECBiqqU5NY23ndshzT2UPUOGrg42YPi9VyA8lbwwPJgtghxs5Qq1aWwExCDeMa0RHC2QigTCdizz1nx+LuSKcKEhCCPRpg=",
"component_encodings": [],
"pipeline_proto_coder_id": "ref_Coder_FastPrimitivesCoder_3"
},
{
"@type": "FastPrimitivesCoder$QlpoOTFBWSZTWYQR6NMAAEDXwH8QgCEJAEBAv279AmAAIABqEqnqGgaABpoyNAGVHpGgMgDQBk0oR6IeoECBiqqU5NY23ndshzT2UPUOGrg42YPi9VyA8lbwwPJgtghxs5Qq1aWwExCDeMa0RHC2QigTCdizz1nx+LuSKcKEhCCPRpg=",
"component_encodings": [],
"pipeline_proto_coder_id": "ref_Coder_FastPrimitivesCoder_3"
}
],
"is_pair_like": true,
"pipeline_proto_coder_id": "ref_Coder_FastPrimitivesCoder_3"
}
],
"is_pair_like": true
},
{
"@type": "kind:global_window"
}
],
"is_wrapper": true
},
"output_name": "None",
"user_name": "Write/Write/WriteImpl/FinalizeWrite/MapToVoidKey0.out"
}
],
"parallel_input": {
"@type": "OutputReference",
"output_name": "None",
"step_name": "s17"
},
"serialized_fn": "ref_AppliedPTransform_Write/Write/WriteImpl/FinalizeWrite/MapToVoidKey0_39",
"user_name": "Write/Write/WriteImpl/FinalizeWrite/MapToVoidKey0"
}
},
{
"kind": "ParallelDo",
"name": "s41",
"properties": {
"display_data": [
{
"key": "fn",
"label": "Transform Function",
"namespace": "apache_beam.transforms.core.ParDo",
"shortValue": "CallableWrapperDoFn",
"type": "STRING",
"value": "apache_beam.transforms.core.CallableWrapperDoFn"
},
{
"key": "fn",
"label": "Transform Function",
"namespace": "apache_beam.transforms.core.CallableWrapperDoFn",
"type": "STRING",
"value": "<lambda>"
}
],
"non_parallel_inputs": {},
"output_info": [
{
"encoding": {
"@type": "kind:windowed_value",
"component_encodings": [
{
"@type": "kind:pair",
"component_encodings": [
{
"@type": "kind:bytes"
},
{
"@type": "FastPrimitivesCoder$QlpoOTFBWSZTWYQR6NMAAEDXwH8QgCEJAEBAv279AmAAIABqEqnqGgaABpoyNAGVHpGgMgDQBk0oR6IeoECBiqqU5NY23ndshzT2UPUOGrg42YPi9VyA8lbwwPJgtghxs5Qq1aWwExCDeMa0RHC2QigTCdizz1nx+LuSKcKEhCCPRpg=",
"component_encodings": [
{
"@type": "FastPrimitivesCoder$QlpoOTFBWSZTWYQR6NMAAEDXwH8QgCEJAEBAv279AmAAIABqEqnqGgaABpoyNAGVHpGgMgDQBk0oR6IeoECBiqqU5NY23ndshzT2UPUOGrg42YPi9VyA8lbwwPJgtghxs5Qq1aWwExCDeMa0RHC2QigTCdizz1nx+LuSKcKEhCCPRpg=",
"component_encodings": [],
"pipeline_proto_coder_id": "ref_Coder_FastPrimitivesCoder_3"
},
{
"@type": "FastPrimitivesCoder$QlpoOTFBWSZTWYQR6NMAAEDXwH8QgCEJAEBAv279AmAAIABqEqnqGgaABpoyNAGVHpGgMgDQBk0oR6IeoECBiqqU5NY23ndshzT2UPUOGrg42YPi9VyA8lbwwPJgtghxs5Qq1aWwExCDeMa0RHC2QigTCdizz1nx+LuSKcKEhCCPRpg=",
"component_encodings": [],
"pipeline_proto_coder_id": "ref_Coder_FastPrimitivesCoder_3"
}
],
"is_pair_like": true,
"pipeline_proto_coder_id": "ref_Coder_FastPrimitivesCoder_3"
}
],
"is_pair_like": true
},
{
"@type": "kind:global_window"
}
],
"is_wrapper": true
},
"output_name": "None",
"user_name": "Write/Write/WriteImpl/FinalizeWrite/MapToVoidKey1.out"
}
],
"parallel_input": {
"@type": "OutputReference",
"output_name": "None",
"step_name": "s24"
},
"serialized_fn": "ref_AppliedPTransform_Write/Write/WriteImpl/FinalizeWrite/MapToVoidKey1_40",
"user_name": "Write/Write/WriteImpl/FinalizeWrite/MapToVoidKey1"
}
},
{
"kind": "ParallelDo",
"name": "s42",
"properties": {
"display_data": [
{
"key": "fn",
"label": "Transform Function",
"namespace": "apache_beam.transforms.core.ParDo",
"shortValue": "CallableWrapperDoFn",
"type": "STRING",
"value": "apache_beam.transforms.core.CallableWrapperDoFn"
},
{
"key": "fn",
"label": "Transform Function",
"namespace": "apache_beam.transforms.core.CallableWrapperDoFn",
"type": "STRING",
"value": "<lambda>"
}
],
"non_parallel_inputs": {},
"output_info": [
{
"encoding": {
"@type": "kind:windowed_value",
"component_encodings": [
{
"@type": "kind:pair",
"component_encodings": [
{
"@type": "kind:bytes"
},
{
"@type": "FastPrimitivesCoder$QlpoOTFBWSZTWYQR6NMAAEDXwH8QgCEJAEBAv279AmAAIABqEqnqGgaABpoyNAGVHpGgMgDQBk0oR6IeoECBiqqU5NY23ndshzT2UPUOGrg42YPi9VyA8lbwwPJgtghxs5Qq1aWwExCDeMa0RHC2QigTCdizz1nx+LuSKcKEhCCPRpg=",
"component_encodings": [
{
"@type": "FastPrimitivesCoder$QlpoOTFBWSZTWYQR6NMAAEDXwH8QgCEJAEBAv279AmAAIABqEqnqGgaABpoyNAGVHpGgMgDQBk0oR6IeoECBiqqU5NY23ndshzT2UPUOGrg42YPi9VyA8lbwwPJgtghxs5Qq1aWwExCDeMa0RHC2QigTCdizz1nx+LuSKcKEhCCPRpg=",
"component_encodings": [],
"pipeline_proto_coder_id": "ref_Coder_FastPrimitivesCoder_3"
},
{
"@type": "FastPrimitivesCoder$QlpoOTFBWSZTWYQR6NMAAEDXwH8QgCEJAEBAv279AmAAIABqEqnqGgaABpoyNAGVHpGgMgDQBk0oR6IeoECBiqqU5NY23ndshzT2UPUOGrg42YPi9VyA8lbwwPJgtghxs5Qq1aWwExCDeMa0RHC2QigTCdizz1nx+LuSKcKEhCCPRpg=",
"component_encodings": [],
"pipeline_proto_coder_id": "ref_Coder_FastPrimitivesCoder_3"
}
],
"is_pair_like": true,
"pipeline_proto_coder_id": "ref_Coder_FastPrimitivesCoder_3"
}
],
"is_pair_like": true
},
{
"@type": "kind:global_window"
}
],
"is_wrapper": true
},
"output_name": "None",
"user_name": "Write/Write/WriteImpl/FinalizeWrite/MapToVoidKey2.out"
}
],
"parallel_input": {
"@type": "OutputReference",
"output_name": "None",
"step_name": "s29"
},
"serialized_fn": "ref_AppliedPTransform_Write/Write/WriteImpl/FinalizeWrite/MapToVoidKey2_41",
"user_name": "Write/Write/WriteImpl/FinalizeWrite/MapToVoidKey2"
}
}
],
"type": "JOB_TYPE_BATCH"
}
apache_beam.runners.dataflow.internal.apiclient: INFO: Create job: <Job
createTime: '2020-08-18T00:14:49.809374Z'
currentStateTime: '1970-01-01T00:00:00Z'
id: '2020-08-17_17_14_48-15680573168063063466'
location: 'us-central1'
name: 'beamapp-jenkins-0818001438-785237'
projectId: 'apache-beam-testing'
stageStates: []
startTime: '2020-08-18T00:14:49.809374Z'
steps: []
tempFiles: []
type: TypeValueValuesEnum(JOB_TYPE_BATCH, 1)>
apache_beam.runners.dataflow.internal.apiclient: INFO: Created job with id: [2020-08-17_17_14_48-15680573168063063466]
apache_beam.runners.dataflow.internal.apiclient: INFO: Submitted job: 2020-08-17_17_14_48-15680573168063063466
apache_beam.runners.dataflow.internal.apiclient: INFO: To access the Dataflow monitoring console, please navigate to https://console.cloud.google.com/dataflow/jobs/us-central1/2020-08-17_17_14_48-15680573168063063466?project=apache-beam-testing
apache_beam.io.filesystem: DEBUG: Listing files in 'gs://temp-storage-for-end-to-end-tests/py-it-cloud/output/1597709673748/results'
apache_beam.io.filesystem: DEBUG: translate_pattern: 'gs://temp-storage-for-end-to-end-tests/py-it-cloud/output/1597709673748/results*' -> 'gs\\:\\/\\/temp\\-storage\\-for\\-end\\-to\\-end\\-tests\\/py\\-it\\-cloud\\/output\\/1597709673748\\/results[^/\\\\]*'
apache_beam.io.gcp.gcsio: INFO: Starting the size estimation of the input
apache_beam.io.gcp.gcsio: INFO: Finished listing 0 files in 0.04163312911987305 seconds.
--------------------- >> end captured logging << ---------------------
----------------------------------------------------------------------
XML: nosetests-postCommitIT-df-py36.xml
----------------------------------------------------------------------
XML: <https://ci-beam.apache.org/job/beam_PostCommit_Python36/ws/src/sdks/python/nosetests.xml>
----------------------------------------------------------------------
Ran 66 tests in 3927.799s
FAILED (SKIP=7, failures=2)
> Task :sdks:python:test-suites:dataflow:py36:postCommitIT FAILED
FAILURE: Build failed with an exception.
* Where:
Script '<https://ci-beam.apache.org/job/beam_PostCommit_Python36/ws/src/sdks/python/test-suites/dataflow/common.gradle'> line: 118
* What went wrong:
Execution failed for task ':sdks:python:test-suites:dataflow:py36:postCommitIT'.
> Process 'command 'sh'' finished with non-zero exit value 1
* Try:
Run with --stacktrace option to get the stack trace. Run with --info or --debug option to get more log output. Run with --scan to get full insights.
* Get more help at https://help.gradle.org
Deprecated Gradle features were used in this build, making it incompatible with Gradle 6.0.
Use '--warning-mode all' to show the individual deprecation warnings.
See https://docs.gradle.org/5.2.1/userguide/command_line_interface.html#sec:command_line_warnings
BUILD FAILED in 1h 8m 39s
153 actionable tasks: 123 executed, 28 from cache, 2 up-to-date
Publishing build scan...
https://gradle.com/s/56v6wjosftita
Build step 'Invoke Gradle script' changed build result to FAILURE
Build step 'Invoke Gradle script' marked build as failure
---------------------------------------------------------------------
To unsubscribe, e-mail: builds-unsubscribe@beam.apache.org
For additional commands, e-mail: builds-help@beam.apache.org