You are viewing a plain text version of this content. The canonical link for it is here.
Posted to dev@lucene.apache.org by Policeman Jenkins Server <je...@thetaphi.de> on 2017/07/24 03:15:14 UTC

[JENKINS-EA] Lucene-Solr-master-Windows (32bit/jdk-9-ea+178) - Build # 6775 - Still Unstable!

Build: https://jenkins.thetaphi.de/job/Lucene-Solr-master-Windows/6775/
Java: 32bit/jdk-9-ea+178 -client -XX:+UseG1GC --illegal-access=deny

4 tests failed.
FAILED:  junit.framework.TestSuite.org.apache.solr.SampleTest

Error Message:
Could not remove the following files (in the order of attempts):    C:\Users\jenkins\workspace\Lucene-Solr-master-Windows\solr\build\solr-core\test\J1\temp\solr.SampleTest_79D73AB6ACDE3985-001\init-core-data-001: java.nio.file.AccessDeniedException: C:\Users\jenkins\workspace\Lucene-Solr-master-Windows\solr\build\solr-core\test\J1\temp\solr.SampleTest_79D73AB6ACDE3985-001\init-core-data-001    C:\Users\jenkins\workspace\Lucene-Solr-master-Windows\solr\build\solr-core\test\J1\temp\solr.SampleTest_79D73AB6ACDE3985-001: java.nio.file.DirectoryNotEmptyException: C:\Users\jenkins\workspace\Lucene-Solr-master-Windows\solr\build\solr-core\test\J1\temp\solr.SampleTest_79D73AB6ACDE3985-001 

Stack Trace:
java.io.IOException: Could not remove the following files (in the order of attempts):
   C:\Users\jenkins\workspace\Lucene-Solr-master-Windows\solr\build\solr-core\test\J1\temp\solr.SampleTest_79D73AB6ACDE3985-001\init-core-data-001: java.nio.file.AccessDeniedException: C:\Users\jenkins\workspace\Lucene-Solr-master-Windows\solr\build\solr-core\test\J1\temp\solr.SampleTest_79D73AB6ACDE3985-001\init-core-data-001
   C:\Users\jenkins\workspace\Lucene-Solr-master-Windows\solr\build\solr-core\test\J1\temp\solr.SampleTest_79D73AB6ACDE3985-001: java.nio.file.DirectoryNotEmptyException: C:\Users\jenkins\workspace\Lucene-Solr-master-Windows\solr\build\solr-core\test\J1\temp\solr.SampleTest_79D73AB6ACDE3985-001

	at __randomizedtesting.SeedInfo.seed([79D73AB6ACDE3985]:0)
	at org.apache.lucene.util.IOUtils.rm(IOUtils.java:329)
	at org.apache.lucene.util.TestRuleTemporaryFilesCleanup.afterAlways(TestRuleTemporaryFilesCleanup.java:216)
	at com.carrotsearch.randomizedtesting.rules.TestRuleAdapter$1.afterAlways(TestRuleAdapter.java:31)
	at com.carrotsearch.randomizedtesting.rules.StatementAdapter.evaluate(StatementAdapter.java:43)
	at com.carrotsearch.randomizedtesting.rules.StatementAdapter.evaluate(StatementAdapter.java:36)
	at org.apache.lucene.util.TestRuleAssertionsRequired$1.evaluate(TestRuleAssertionsRequired.java:53)
	at org.apache.lucene.util.TestRuleMarkFailure$1.evaluate(TestRuleMarkFailure.java:47)
	at org.apache.lucene.util.TestRuleIgnoreAfterMaxFailures$1.evaluate(TestRuleIgnoreAfterMaxFailures.java:64)
	at org.apache.lucene.util.TestRuleIgnoreTestSuites$1.evaluate(TestRuleIgnoreTestSuites.java:54)
	at com.carrotsearch.randomizedtesting.rules.StatementAdapter.evaluate(StatementAdapter.java:36)
	at com.carrotsearch.randomizedtesting.ThreadLeakControl$StatementRunner.run(ThreadLeakControl.java:368)
	at java.base/java.lang.Thread.run(Thread.java:844)


FAILED:  org.apache.solr.cloud.ChaosMonkeyNothingIsSafeTest.test

Error Message:
Timeout occured while waiting response from server at: http://127.0.0.1:62799/o_yga/wh/collection1

Stack Trace:
org.apache.solr.client.solrj.SolrServerException: Timeout occured while waiting response from server at: http://127.0.0.1:62799/o_yga/wh/collection1
	at __randomizedtesting.SeedInfo.seed([79D73AB6ACDE3985:F183056C0222547D]:0)
	at org.apache.solr.client.solrj.impl.HttpSolrClient.executeMethod(HttpSolrClient.java:637)
	at org.apache.solr.client.solrj.impl.HttpSolrClient.request(HttpSolrClient.java:252)
	at org.apache.solr.client.solrj.impl.HttpSolrClient.request(HttpSolrClient.java:241)
	at org.apache.solr.client.solrj.impl.LBHttpSolrClient.doRequest(LBHttpSolrClient.java:483)
	at org.apache.solr.client.solrj.impl.LBHttpSolrClient.request(LBHttpSolrClient.java:413)
	at org.apache.solr.client.solrj.impl.CloudSolrClient.sendRequest(CloudSolrClient.java:1121)
	at org.apache.solr.client.solrj.impl.CloudSolrClient.requestWithRetryOnStaleState(CloudSolrClient.java:862)
	at org.apache.solr.client.solrj.impl.CloudSolrClient.request(CloudSolrClient.java:793)
	at org.apache.solr.client.solrj.SolrRequest.process(SolrRequest.java:178)
	at org.apache.solr.client.solrj.SolrClient.commit(SolrClient.java:484)
	at org.apache.solr.client.solrj.SolrClient.commit(SolrClient.java:463)
	at org.apache.solr.cloud.AbstractFullDistribZkTestBase.commit(AbstractFullDistribZkTestBase.java:1581)
	at org.apache.solr.cloud.ChaosMonkeyNothingIsSafeTest.test(ChaosMonkeyNothingIsSafeTest.java:213)
	at java.base/jdk.internal.reflect.NativeMethodAccessorImpl.invoke0(Native Method)
	at java.base/jdk.internal.reflect.NativeMethodAccessorImpl.invoke(NativeMethodAccessorImpl.java:62)
	at java.base/jdk.internal.reflect.DelegatingMethodAccessorImpl.invoke(DelegatingMethodAccessorImpl.java:43)
	at java.base/java.lang.reflect.Method.invoke(Method.java:564)
	at com.carrotsearch.randomizedtesting.RandomizedRunner.invoke(RandomizedRunner.java:1713)
	at com.carrotsearch.randomizedtesting.RandomizedRunner$8.evaluate(RandomizedRunner.java:907)
	at com.carrotsearch.randomizedtesting.RandomizedRunner$9.evaluate(RandomizedRunner.java:943)
	at com.carrotsearch.randomizedtesting.RandomizedRunner$10.evaluate(RandomizedRunner.java:957)
	at org.apache.solr.BaseDistributedSearchTestCase$ShardsRepeatRule$ShardsFixedStatement.callStatement(BaseDistributedSearchTestCase.java:985)
	at org.apache.solr.BaseDistributedSearchTestCase$ShardsRepeatRule$ShardsStatement.evaluate(BaseDistributedSearchTestCase.java:960)
	at com.carrotsearch.randomizedtesting.rules.SystemPropertiesRestoreRule$1.evaluate(SystemPropertiesRestoreRule.java:57)
	at org.apache.lucene.util.TestRuleSetupTeardownChained$1.evaluate(TestRuleSetupTeardownChained.java:49)
	at org.apache.lucene.util.AbstractBeforeAfterRule$1.evaluate(AbstractBeforeAfterRule.java:45)
	at org.apache.lucene.util.TestRuleThreadAndTestName$1.evaluate(TestRuleThreadAndTestName.java:48)
	at org.apache.lucene.util.TestRuleIgnoreAfterMaxFailures$1.evaluate(TestRuleIgnoreAfterMaxFailures.java:64)
	at org.apache.lucene.util.TestRuleMarkFailure$1.evaluate(TestRuleMarkFailure.java:47)
	at com.carrotsearch.randomizedtesting.rules.StatementAdapter.evaluate(StatementAdapter.java:36)
	at com.carrotsearch.randomizedtesting.ThreadLeakControl$StatementRunner.run(ThreadLeakControl.java:368)
	at com.carrotsearch.randomizedtesting.ThreadLeakControl.forkTimeoutingTask(ThreadLeakControl.java:817)
	at com.carrotsearch.randomizedtesting.ThreadLeakControl$3.evaluate(ThreadLeakControl.java:468)
	at com.carrotsearch.randomizedtesting.RandomizedRunner.runSingleTest(RandomizedRunner.java:916)
	at com.carrotsearch.randomizedtesting.RandomizedRunner$5.evaluate(RandomizedRunner.java:802)
	at com.carrotsearch.randomizedtesting.RandomizedRunner$6.evaluate(RandomizedRunner.java:852)
	at com.carrotsearch.randomizedtesting.RandomizedRunner$7.evaluate(RandomizedRunner.java:863)
	at com.carrotsearch.randomizedtesting.rules.StatementAdapter.evaluate(StatementAdapter.java:36)
	at com.carrotsearch.randomizedtesting.rules.SystemPropertiesRestoreRule$1.evaluate(SystemPropertiesRestoreRule.java:57)
	at org.apache.lucene.util.AbstractBeforeAfterRule$1.evaluate(AbstractBeforeAfterRule.java:45)
	at com.carrotsearch.randomizedtesting.rules.StatementAdapter.evaluate(StatementAdapter.java:36)
	at org.apache.lucene.util.TestRuleStoreClassName$1.evaluate(TestRuleStoreClassName.java:41)
	at com.carrotsearch.randomizedtesting.rules.NoShadowingOrOverridesOnMethodsRule$1.evaluate(NoShadowingOrOverridesOnMethodsRule.java:40)
	at com.carrotsearch.randomizedtesting.rules.NoShadowingOrOverridesOnMethodsRule$1.evaluate(NoShadowingOrOverridesOnMethodsRule.java:40)
	at com.carrotsearch.randomizedtesting.rules.StatementAdapter.evaluate(StatementAdapter.java:36)
	at com.carrotsearch.randomizedtesting.rules.StatementAdapter.evaluate(StatementAdapter.java:36)
	at org.apache.lucene.util.TestRuleAssertionsRequired$1.evaluate(TestRuleAssertionsRequired.java:53)
	at org.apache.lucene.util.TestRuleMarkFailure$1.evaluate(TestRuleMarkFailure.java:47)
	at org.apache.lucene.util.TestRuleIgnoreAfterMaxFailures$1.evaluate(TestRuleIgnoreAfterMaxFailures.java:64)
	at org.apache.lucene.util.TestRuleIgnoreTestSuites$1.evaluate(TestRuleIgnoreTestSuites.java:54)
	at com.carrotsearch.randomizedtesting.rules.StatementAdapter.evaluate(StatementAdapter.java:36)
	at com.carrotsearch.randomizedtesting.ThreadLeakControl$StatementRunner.run(ThreadLeakControl.java:368)
	at java.base/java.lang.Thread.run(Thread.java:844)
Caused by: java.net.SocketTimeoutException: Read timed out
	at java.base/java.net.SocketInputStream.socketRead0(Native Method)
	at java.base/java.net.SocketInputStream.socketRead(SocketInputStream.java:116)
	at java.base/java.net.SocketInputStream.read(SocketInputStream.java:171)
	at java.base/java.net.SocketInputStream.read(SocketInputStream.java:141)
	at org.apache.http.impl.io.SessionInputBufferImpl.streamRead(SessionInputBufferImpl.java:139)
	at org.apache.http.impl.io.SessionInputBufferImpl.fillBuffer(SessionInputBufferImpl.java:155)
	at org.apache.http.impl.io.SessionInputBufferImpl.readLine(SessionInputBufferImpl.java:284)
	at org.apache.http.impl.conn.DefaultHttpResponseParser.parseHead(DefaultHttpResponseParser.java:140)
	at org.apache.http.impl.conn.DefaultHttpResponseParser.parseHead(DefaultHttpResponseParser.java:57)
	at org.apache.http.impl.io.AbstractMessageParser.parse(AbstractMessageParser.java:261)
	at org.apache.http.impl.DefaultBHttpClientConnection.receiveResponseHeader(DefaultBHttpClientConnection.java:165)
	at org.apache.http.impl.conn.CPoolProxy.receiveResponseHeader(CPoolProxy.java:167)
	at org.apache.http.protocol.HttpRequestExecutor.doReceiveResponse(HttpRequestExecutor.java:272)
	at org.apache.http.protocol.HttpRequestExecutor.execute(HttpRequestExecutor.java:124)
	at org.apache.http.impl.execchain.MainClientExec.execute(MainClientExec.java:271)
	at org.apache.http.impl.execchain.ProtocolExec.execute(ProtocolExec.java:184)
	at org.apache.http.impl.execchain.RetryExec.execute(RetryExec.java:88)
	at org.apache.http.impl.execchain.RedirectExec.execute(RedirectExec.java:110)
	at org.apache.http.impl.client.InternalHttpClient.doExecute(InternalHttpClient.java:184)
	at org.apache.http.impl.client.CloseableHttpClient.execute(CloseableHttpClient.java:82)
	at org.apache.http.impl.client.CloseableHttpClient.execute(CloseableHttpClient.java:55)
	at org.apache.solr.client.solrj.impl.HttpSolrClient.executeMethod(HttpSolrClient.java:523)
	... 52 more


FAILED:  junit.framework.TestSuite.org.apache.solr.cloud.ChaosMonkeyNothingIsSafeTest

Error Message:
9 threads leaked from SUITE scope at org.apache.solr.cloud.ChaosMonkeyNothingIsSafeTest:     1) Thread[id=13370, name=zkCallback-1787-thread-4, state=TIMED_WAITING, group=TGRP-ChaosMonkeyNothingIsSafeTest]         at java.base@9/jdk.internal.misc.Unsafe.park(Native Method)         at java.base@9/java.util.concurrent.locks.LockSupport.parkNanos(LockSupport.java:234)         at java.base@9/java.util.concurrent.SynchronousQueue$TransferStack.awaitFulfill(SynchronousQueue.java:462)         at java.base@9/java.util.concurrent.SynchronousQueue$TransferStack.transfer(SynchronousQueue.java:361)         at java.base@9/java.util.concurrent.SynchronousQueue.poll(SynchronousQueue.java:937)         at java.base@9/java.util.concurrent.ThreadPoolExecutor.getTask(ThreadPoolExecutor.java:1085)         at java.base@9/java.util.concurrent.ThreadPoolExecutor.runWorker(ThreadPoolExecutor.java:1146)         at java.base@9/java.util.concurrent.ThreadPoolExecutor$Worker.run(ThreadPoolExecutor.java:635)         at java.base@9/java.lang.Thread.run(Thread.java:844)    2) Thread[id=13421, name=zkCallback-1787-thread-5, state=TIMED_WAITING, group=TGRP-ChaosMonkeyNothingIsSafeTest]         at java.base@9/jdk.internal.misc.Unsafe.park(Native Method)         at java.base@9/java.util.concurrent.locks.LockSupport.parkNanos(LockSupport.java:234)         at java.base@9/java.util.concurrent.SynchronousQueue$TransferStack.awaitFulfill(SynchronousQueue.java:462)         at java.base@9/java.util.concurrent.SynchronousQueue$TransferStack.transfer(SynchronousQueue.java:361)         at java.base@9/java.util.concurrent.SynchronousQueue.poll(SynchronousQueue.java:937)         at java.base@9/java.util.concurrent.ThreadPoolExecutor.getTask(ThreadPoolExecutor.java:1085)         at java.base@9/java.util.concurrent.ThreadPoolExecutor.runWorker(ThreadPoolExecutor.java:1146)         at java.base@9/java.util.concurrent.ThreadPoolExecutor$Worker.run(ThreadPoolExecutor.java:635)         at java.base@9/java.lang.Thread.run(Thread.java:844)    3) Thread[id=13230, name=TEST-ChaosMonkeyNothingIsSafeTest.test-seed#[79D73AB6ACDE3985]-EventThread, state=WAITING, group=TGRP-ChaosMonkeyNothingIsSafeTest]         at java.base@9/jdk.internal.misc.Unsafe.park(Native Method)         at java.base@9/java.util.concurrent.locks.LockSupport.park(LockSupport.java:194)         at java.base@9/java.util.concurrent.locks.AbstractQueuedSynchronizer$ConditionObject.await(AbstractQueuedSynchronizer.java:2062)         at java.base@9/java.util.concurrent.LinkedBlockingQueue.take(LinkedBlockingQueue.java:435)         at app//org.apache.zookeeper.ClientCnxn$EventThread.run(ClientCnxn.java:501)    4) Thread[id=13231, name=zkCallback-1787-thread-1, state=TIMED_WAITING, group=TGRP-ChaosMonkeyNothingIsSafeTest]         at java.base@9/jdk.internal.misc.Unsafe.park(Native Method)         at java.base@9/java.util.concurrent.locks.LockSupport.parkNanos(LockSupport.java:234)         at java.base@9/java.util.concurrent.SynchronousQueue$TransferStack.awaitFulfill(SynchronousQueue.java:462)         at java.base@9/java.util.concurrent.SynchronousQueue$TransferStack.transfer(SynchronousQueue.java:361)         at java.base@9/java.util.concurrent.SynchronousQueue.poll(SynchronousQueue.java:937)         at java.base@9/java.util.concurrent.ThreadPoolExecutor.getTask(ThreadPoolExecutor.java:1085)         at java.base@9/java.util.concurrent.ThreadPoolExecutor.runWorker(ThreadPoolExecutor.java:1146)         at java.base@9/java.util.concurrent.ThreadPoolExecutor$Worker.run(ThreadPoolExecutor.java:635)         at java.base@9/java.lang.Thread.run(Thread.java:844)    5) Thread[id=13422, name=zkCallback-1787-thread-6, state=TIMED_WAITING, group=TGRP-ChaosMonkeyNothingIsSafeTest]         at java.base@9/jdk.internal.misc.Unsafe.park(Native Method)         at java.base@9/java.util.concurrent.locks.LockSupport.parkNanos(LockSupport.java:234)         at java.base@9/java.util.concurrent.SynchronousQueue$TransferStack.awaitFulfill(SynchronousQueue.java:462)         at java.base@9/java.util.concurrent.SynchronousQueue$TransferStack.transfer(SynchronousQueue.java:361)         at java.base@9/java.util.concurrent.SynchronousQueue.poll(SynchronousQueue.java:937)         at java.base@9/java.util.concurrent.ThreadPoolExecutor.getTask(ThreadPoolExecutor.java:1085)         at java.base@9/java.util.concurrent.ThreadPoolExecutor.runWorker(ThreadPoolExecutor.java:1146)         at java.base@9/java.util.concurrent.ThreadPoolExecutor$Worker.run(ThreadPoolExecutor.java:635)         at java.base@9/java.lang.Thread.run(Thread.java:844)    6) Thread[id=13369, name=zkCallback-1787-thread-3, state=TIMED_WAITING, group=TGRP-ChaosMonkeyNothingIsSafeTest]         at java.base@9/jdk.internal.misc.Unsafe.park(Native Method)         at java.base@9/java.util.concurrent.locks.LockSupport.parkNanos(LockSupport.java:234)         at java.base@9/java.util.concurrent.SynchronousQueue$TransferStack.awaitFulfill(SynchronousQueue.java:462)         at java.base@9/java.util.concurrent.SynchronousQueue$TransferStack.transfer(SynchronousQueue.java:361)         at java.base@9/java.util.concurrent.SynchronousQueue.poll(SynchronousQueue.java:937)         at java.base@9/java.util.concurrent.ThreadPoolExecutor.getTask(ThreadPoolExecutor.java:1085)         at java.base@9/java.util.concurrent.ThreadPoolExecutor.runWorker(ThreadPoolExecutor.java:1146)         at java.base@9/java.util.concurrent.ThreadPoolExecutor$Worker.run(ThreadPoolExecutor.java:635)         at java.base@9/java.lang.Thread.run(Thread.java:844)    7) Thread[id=13229, name=TEST-ChaosMonkeyNothingIsSafeTest.test-seed#[79D73AB6ACDE3985]-SendThread(127.0.0.1:62724), state=RUNNABLE, group=TGRP-ChaosMonkeyNothingIsSafeTest]         at java.base@9/sun.nio.ch.WindowsSelectorImpl$SubSelector.poll0(Native Method)         at java.base@9/sun.nio.ch.WindowsSelectorImpl$SubSelector.poll(WindowsSelectorImpl.java:296)         at java.base@9/sun.nio.ch.WindowsSelectorImpl$SubSelector.access$400(WindowsSelectorImpl.java:278)         at java.base@9/sun.nio.ch.WindowsSelectorImpl.doSelect(WindowsSelectorImpl.java:159)         at java.base@9/sun.nio.ch.SelectorImpl.lockAndDoSelect(SelectorImpl.java:86)         at java.base@9/sun.nio.ch.SelectorImpl.select(SelectorImpl.java:97)         at app//org.apache.zookeeper.ClientCnxnSocketNIO.doTransport(ClientCnxnSocketNIO.java:349)         at app//org.apache.zookeeper.ClientCnxn$SendThread.run(ClientCnxn.java:1141)    8) Thread[id=13228, name=Connection evictor, state=TIMED_WAITING, group=TGRP-ChaosMonkeyNothingIsSafeTest]         at java.base@9/java.lang.Thread.sleep(Native Method)         at app//org.apache.http.impl.client.IdleConnectionEvictor$1.run(IdleConnectionEvictor.java:66)         at java.base@9/java.lang.Thread.run(Thread.java:844)    9) Thread[id=13357, name=zkCallback-1787-thread-2, state=TIMED_WAITING, group=TGRP-ChaosMonkeyNothingIsSafeTest]         at java.base@9/jdk.internal.misc.Unsafe.park(Native Method)         at java.base@9/java.util.concurrent.locks.LockSupport.parkNanos(LockSupport.java:234)         at java.base@9/java.util.concurrent.SynchronousQueue$TransferStack.awaitFulfill(SynchronousQueue.java:462)         at java.base@9/java.util.concurrent.SynchronousQueue$TransferStack.transfer(SynchronousQueue.java:361)         at java.base@9/java.util.concurrent.SynchronousQueue.poll(SynchronousQueue.java:937)         at java.base@9/java.util.concurrent.ThreadPoolExecutor.getTask(ThreadPoolExecutor.java:1085)         at java.base@9/java.util.concurrent.ThreadPoolExecutor.runWorker(ThreadPoolExecutor.java:1146)         at java.base@9/java.util.concurrent.ThreadPoolExecutor$Worker.run(ThreadPoolExecutor.java:635)         at java.base@9/java.lang.Thread.run(Thread.java:844)

Stack Trace:
com.carrotsearch.randomizedtesting.ThreadLeakError: 9 threads leaked from SUITE scope at org.apache.solr.cloud.ChaosMonkeyNothingIsSafeTest: 
   1) Thread[id=13370, name=zkCallback-1787-thread-4, state=TIMED_WAITING, group=TGRP-ChaosMonkeyNothingIsSafeTest]
        at java.base@9/jdk.internal.misc.Unsafe.park(Native Method)
        at java.base@9/java.util.concurrent.locks.LockSupport.parkNanos(LockSupport.java:234)
        at java.base@9/java.util.concurrent.SynchronousQueue$TransferStack.awaitFulfill(SynchronousQueue.java:462)
        at java.base@9/java.util.concurrent.SynchronousQueue$TransferStack.transfer(SynchronousQueue.java:361)
        at java.base@9/java.util.concurrent.SynchronousQueue.poll(SynchronousQueue.java:937)
        at java.base@9/java.util.concurrent.ThreadPoolExecutor.getTask(ThreadPoolExecutor.java:1085)
        at java.base@9/java.util.concurrent.ThreadPoolExecutor.runWorker(ThreadPoolExecutor.java:1146)
        at java.base@9/java.util.concurrent.ThreadPoolExecutor$Worker.run(ThreadPoolExecutor.java:635)
        at java.base@9/java.lang.Thread.run(Thread.java:844)
   2) Thread[id=13421, name=zkCallback-1787-thread-5, state=TIMED_WAITING, group=TGRP-ChaosMonkeyNothingIsSafeTest]
        at java.base@9/jdk.internal.misc.Unsafe.park(Native Method)
        at java.base@9/java.util.concurrent.locks.LockSupport.parkNanos(LockSupport.java:234)
        at java.base@9/java.util.concurrent.SynchronousQueue$TransferStack.awaitFulfill(SynchronousQueue.java:462)
        at java.base@9/java.util.concurrent.SynchronousQueue$TransferStack.transfer(SynchronousQueue.java:361)
        at java.base@9/java.util.concurrent.SynchronousQueue.poll(SynchronousQueue.java:937)
        at java.base@9/java.util.concurrent.ThreadPoolExecutor.getTask(ThreadPoolExecutor.java:1085)
        at java.base@9/java.util.concurrent.ThreadPoolExecutor.runWorker(ThreadPoolExecutor.java:1146)
        at java.base@9/java.util.concurrent.ThreadPoolExecutor$Worker.run(ThreadPoolExecutor.java:635)
        at java.base@9/java.lang.Thread.run(Thread.java:844)
   3) Thread[id=13230, name=TEST-ChaosMonkeyNothingIsSafeTest.test-seed#[79D73AB6ACDE3985]-EventThread, state=WAITING, group=TGRP-ChaosMonkeyNothingIsSafeTest]
        at java.base@9/jdk.internal.misc.Unsafe.park(Native Method)
        at java.base@9/java.util.concurrent.locks.LockSupport.park(LockSupport.java:194)
        at java.base@9/java.util.concurrent.locks.AbstractQueuedSynchronizer$ConditionObject.await(AbstractQueuedSynchronizer.java:2062)
        at java.base@9/java.util.concurrent.LinkedBlockingQueue.take(LinkedBlockingQueue.java:435)
        at app//org.apache.zookeeper.ClientCnxn$EventThread.run(ClientCnxn.java:501)
   4) Thread[id=13231, name=zkCallback-1787-thread-1, state=TIMED_WAITING, group=TGRP-ChaosMonkeyNothingIsSafeTest]
        at java.base@9/jdk.internal.misc.Unsafe.park(Native Method)
        at java.base@9/java.util.concurrent.locks.LockSupport.parkNanos(LockSupport.java:234)
        at java.base@9/java.util.concurrent.SynchronousQueue$TransferStack.awaitFulfill(SynchronousQueue.java:462)
        at java.base@9/java.util.concurrent.SynchronousQueue$TransferStack.transfer(SynchronousQueue.java:361)
        at java.base@9/java.util.concurrent.SynchronousQueue.poll(SynchronousQueue.java:937)
        at java.base@9/java.util.concurrent.ThreadPoolExecutor.getTask(ThreadPoolExecutor.java:1085)
        at java.base@9/java.util.concurrent.ThreadPoolExecutor.runWorker(ThreadPoolExecutor.java:1146)
        at java.base@9/java.util.concurrent.ThreadPoolExecutor$Worker.run(ThreadPoolExecutor.java:635)
        at java.base@9/java.lang.Thread.run(Thread.java:844)
   5) Thread[id=13422, name=zkCallback-1787-thread-6, state=TIMED_WAITING, group=TGRP-ChaosMonkeyNothingIsSafeTest]
        at java.base@9/jdk.internal.misc.Unsafe.park(Native Method)
        at java.base@9/java.util.concurrent.locks.LockSupport.parkNanos(LockSupport.java:234)
        at java.base@9/java.util.concurrent.SynchronousQueue$TransferStack.awaitFulfill(SynchronousQueue.java:462)
        at java.base@9/java.util.concurrent.SynchronousQueue$TransferStack.transfer(SynchronousQueue.java:361)
        at java.base@9/java.util.concurrent.SynchronousQueue.poll(SynchronousQueue.java:937)
        at java.base@9/java.util.concurrent.ThreadPoolExecutor.getTask(ThreadPoolExecutor.java:1085)
        at java.base@9/java.util.concurrent.ThreadPoolExecutor.runWorker(ThreadPoolExecutor.java:1146)
        at java.base@9/java.util.concurrent.ThreadPoolExecutor$Worker.run(ThreadPoolExecutor.java:635)
        at java.base@9/java.lang.Thread.run(Thread.java:844)
   6) Thread[id=13369, name=zkCallback-1787-thread-3, state=TIMED_WAITING, group=TGRP-ChaosMonkeyNothingIsSafeTest]
        at java.base@9/jdk.internal.misc.Unsafe.park(Native Method)
        at java.base@9/java.util.concurrent.locks.LockSupport.parkNanos(LockSupport.java:234)
        at java.base@9/java.util.concurrent.SynchronousQueue$TransferStack.awaitFulfill(SynchronousQueue.java:462)
        at java.base@9/java.util.concurrent.SynchronousQueue$TransferStack.transfer(SynchronousQueue.java:361)
        at java.base@9/java.util.concurrent.SynchronousQueue.poll(SynchronousQueue.java:937)
        at java.base@9/java.util.concurrent.ThreadPoolExecutor.getTask(ThreadPoolExecutor.java:1085)
        at java.base@9/java.util.concurrent.ThreadPoolExecutor.runWorker(ThreadPoolExecutor.java:1146)
        at java.base@9/java.util.concurrent.ThreadPoolExecutor$Worker.run(ThreadPoolExecutor.java:635)
        at java.base@9/java.lang.Thread.run(Thread.java:844)
   7) Thread[id=13229, name=TEST-ChaosMonkeyNothingIsSafeTest.test-seed#[79D73AB6ACDE3985]-SendThread(127.0.0.1:62724), state=RUNNABLE, group=TGRP-ChaosMonkeyNothingIsSafeTest]
        at java.base@9/sun.nio.ch.WindowsSelectorImpl$SubSelector.poll0(Native Method)
        at java.base@9/sun.nio.ch.WindowsSelectorImpl$SubSelector.poll(WindowsSelectorImpl.java:296)
        at java.base@9/sun.nio.ch.WindowsSelectorImpl$SubSelector.access$400(WindowsSelectorImpl.java:278)
        at java.base@9/sun.nio.ch.WindowsSelectorImpl.doSelect(WindowsSelectorImpl.java:159)
        at java.base@9/sun.nio.ch.SelectorImpl.lockAndDoSelect(SelectorImpl.java:86)
        at java.base@9/sun.nio.ch.SelectorImpl.select(SelectorImpl.java:97)
        at app//org.apache.zookeeper.ClientCnxnSocketNIO.doTransport(ClientCnxnSocketNIO.java:349)
        at app//org.apache.zookeeper.ClientCnxn$SendThread.run(ClientCnxn.java:1141)
   8) Thread[id=13228, name=Connection evictor, state=TIMED_WAITING, group=TGRP-ChaosMonkeyNothingIsSafeTest]
        at java.base@9/java.lang.Thread.sleep(Native Method)
        at app//org.apache.http.impl.client.IdleConnectionEvictor$1.run(IdleConnectionEvictor.java:66)
        at java.base@9/java.lang.Thread.run(Thread.java:844)
   9) Thread[id=13357, name=zkCallback-1787-thread-2, state=TIMED_WAITING, group=TGRP-ChaosMonkeyNothingIsSafeTest]
        at java.base@9/jdk.internal.misc.Unsafe.park(Native Method)
        at java.base@9/java.util.concurrent.locks.LockSupport.parkNanos(LockSupport.java:234)
        at java.base@9/java.util.concurrent.SynchronousQueue$TransferStack.awaitFulfill(SynchronousQueue.java:462)
        at java.base@9/java.util.concurrent.SynchronousQueue$TransferStack.transfer(SynchronousQueue.java:361)
        at java.base@9/java.util.concurrent.SynchronousQueue.poll(SynchronousQueue.java:937)
        at java.base@9/java.util.concurrent.ThreadPoolExecutor.getTask(ThreadPoolExecutor.java:1085)
        at java.base@9/java.util.concurrent.ThreadPoolExecutor.runWorker(ThreadPoolExecutor.java:1146)
        at java.base@9/java.util.concurrent.ThreadPoolExecutor$Worker.run(ThreadPoolExecutor.java:635)
        at java.base@9/java.lang.Thread.run(Thread.java:844)
	at __randomizedtesting.SeedInfo.seed([79D73AB6ACDE3985]:0)


FAILED:  junit.framework.TestSuite.org.apache.solr.cloud.ChaosMonkeyNothingIsSafeTest

Error Message:
There are still zombie threads that couldn't be terminated:    1) Thread[id=13370, name=zkCallback-1787-thread-4, state=TIMED_WAITING, group=TGRP-ChaosMonkeyNothingIsSafeTest]         at java.base@9/jdk.internal.misc.Unsafe.park(Native Method)         at java.base@9/java.util.concurrent.locks.LockSupport.parkNanos(LockSupport.java:234)         at java.base@9/java.util.concurrent.SynchronousQueue$TransferStack.awaitFulfill(SynchronousQueue.java:462)         at java.base@9/java.util.concurrent.SynchronousQueue$TransferStack.transfer(SynchronousQueue.java:361)         at java.base@9/java.util.concurrent.SynchronousQueue.poll(SynchronousQueue.java:937)         at java.base@9/java.util.concurrent.ThreadPoolExecutor.getTask(ThreadPoolExecutor.java:1085)         at java.base@9/java.util.concurrent.ThreadPoolExecutor.runWorker(ThreadPoolExecutor.java:1146)         at java.base@9/java.util.concurrent.ThreadPoolExecutor$Worker.run(ThreadPoolExecutor.java:635)         at java.base@9/java.lang.Thread.run(Thread.java:844)    2) Thread[id=13421, name=zkCallback-1787-thread-5, state=TIMED_WAITING, group=TGRP-ChaosMonkeyNothingIsSafeTest]         at java.base@9/jdk.internal.misc.Unsafe.park(Native Method)         at java.base@9/java.util.concurrent.locks.LockSupport.parkNanos(LockSupport.java:234)         at java.base@9/java.util.concurrent.SynchronousQueue$TransferStack.awaitFulfill(SynchronousQueue.java:462)         at java.base@9/java.util.concurrent.SynchronousQueue$TransferStack.transfer(SynchronousQueue.java:361)         at java.base@9/java.util.concurrent.SynchronousQueue.poll(SynchronousQueue.java:937)         at java.base@9/java.util.concurrent.ThreadPoolExecutor.getTask(ThreadPoolExecutor.java:1085)         at java.base@9/java.util.concurrent.ThreadPoolExecutor.runWorker(ThreadPoolExecutor.java:1146)         at java.base@9/java.util.concurrent.ThreadPoolExecutor$Worker.run(ThreadPoolExecutor.java:635)         at java.base@9/java.lang.Thread.run(Thread.java:844)    3) Thread[id=13231, name=zkCallback-1787-thread-1, state=TIMED_WAITING, group=TGRP-ChaosMonkeyNothingIsSafeTest]         at java.base@9/jdk.internal.misc.Unsafe.park(Native Method)         at java.base@9/java.util.concurrent.locks.LockSupport.parkNanos(LockSupport.java:234)         at java.base@9/java.util.concurrent.SynchronousQueue$TransferStack.awaitFulfill(SynchronousQueue.java:462)         at java.base@9/java.util.concurrent.SynchronousQueue$TransferStack.transfer(SynchronousQueue.java:361)         at java.base@9/java.util.concurrent.SynchronousQueue.poll(SynchronousQueue.java:937)         at java.base@9/java.util.concurrent.ThreadPoolExecutor.getTask(ThreadPoolExecutor.java:1085)         at java.base@9/java.util.concurrent.ThreadPoolExecutor.runWorker(ThreadPoolExecutor.java:1146)         at java.base@9/java.util.concurrent.ThreadPoolExecutor$Worker.run(ThreadPoolExecutor.java:635)         at java.base@9/java.lang.Thread.run(Thread.java:844)    4) Thread[id=13422, name=zkCallback-1787-thread-6, state=TIMED_WAITING, group=TGRP-ChaosMonkeyNothingIsSafeTest]         at java.base@9/jdk.internal.misc.Unsafe.park(Native Method)         at java.base@9/java.util.concurrent.locks.LockSupport.parkNanos(LockSupport.java:234)         at java.base@9/java.util.concurrent.SynchronousQueue$TransferStack.awaitFulfill(SynchronousQueue.java:462)         at java.base@9/java.util.concurrent.SynchronousQueue$TransferStack.transfer(SynchronousQueue.java:361)         at java.base@9/java.util.concurrent.SynchronousQueue.poll(SynchronousQueue.java:937)         at java.base@9/java.util.concurrent.ThreadPoolExecutor.getTask(ThreadPoolExecutor.java:1085)         at java.base@9/java.util.concurrent.ThreadPoolExecutor.runWorker(ThreadPoolExecutor.java:1146)         at java.base@9/java.util.concurrent.ThreadPoolExecutor$Worker.run(ThreadPoolExecutor.java:635)         at java.base@9/java.lang.Thread.run(Thread.java:844)    5) Thread[id=13369, name=zkCallback-1787-thread-3, state=TIMED_WAITING, group=TGRP-ChaosMonkeyNothingIsSafeTest]         at java.base@9/jdk.internal.misc.Unsafe.park(Native Method)         at java.base@9/java.util.concurrent.locks.LockSupport.parkNanos(LockSupport.java:234)         at java.base@9/java.util.concurrent.SynchronousQueue$TransferStack.awaitFulfill(SynchronousQueue.java:462)         at java.base@9/java.util.concurrent.SynchronousQueue$TransferStack.transfer(SynchronousQueue.java:361)         at java.base@9/java.util.concurrent.SynchronousQueue.poll(SynchronousQueue.java:937)         at java.base@9/java.util.concurrent.ThreadPoolExecutor.getTask(ThreadPoolExecutor.java:1085)         at java.base@9/java.util.concurrent.ThreadPoolExecutor.runWorker(ThreadPoolExecutor.java:1146)         at java.base@9/java.util.concurrent.ThreadPoolExecutor$Worker.run(ThreadPoolExecutor.java:635)         at java.base@9/java.lang.Thread.run(Thread.java:844)    6) Thread[id=13229, name=TEST-ChaosMonkeyNothingIsSafeTest.test-seed#[79D73AB6ACDE3985]-SendThread(127.0.0.1:62724), state=RUNNABLE, group=TGRP-ChaosMonkeyNothingIsSafeTest]         at java.base@9/sun.nio.ch.WindowsSelectorImpl$SubSelector.poll0(Native Method)         at java.base@9/sun.nio.ch.WindowsSelectorImpl$SubSelector.poll(WindowsSelectorImpl.java:296)         at java.base@9/sun.nio.ch.WindowsSelectorImpl$SubSelector.access$400(WindowsSelectorImpl.java:278)         at java.base@9/sun.nio.ch.WindowsSelectorImpl.doSelect(WindowsSelectorImpl.java:159)         at java.base@9/sun.nio.ch.SelectorImpl.lockAndDoSelect(SelectorImpl.java:86)         at java.base@9/sun.nio.ch.SelectorImpl.select(SelectorImpl.java:97)         at app//org.apache.zookeeper.ClientCnxnSocketNIO.doTransport(ClientCnxnSocketNIO.java:349)         at app//org.apache.zookeeper.ClientCnxn$SendThread.run(ClientCnxn.java:1141)    7) Thread[id=13357, name=zkCallback-1787-thread-2, state=TIMED_WAITING, group=TGRP-ChaosMonkeyNothingIsSafeTest]         at java.base@9/jdk.internal.misc.Unsafe.park(Native Method)         at java.base@9/java.util.concurrent.locks.LockSupport.parkNanos(LockSupport.java:234)         at java.base@9/java.util.concurrent.SynchronousQueue$TransferStack.awaitFulfill(SynchronousQueue.java:462)         at java.base@9/java.util.concurrent.SynchronousQueue$TransferStack.transfer(SynchronousQueue.java:361)         at java.base@9/java.util.concurrent.SynchronousQueue.poll(SynchronousQueue.java:937)         at java.base@9/java.util.concurrent.ThreadPoolExecutor.getTask(ThreadPoolExecutor.java:1085)         at java.base@9/java.util.concurrent.ThreadPoolExecutor.runWorker(ThreadPoolExecutor.java:1146)         at java.base@9/java.util.concurrent.ThreadPoolExecutor$Worker.run(ThreadPoolExecutor.java:635)         at java.base@9/java.lang.Thread.run(Thread.java:844)

Stack Trace:
com.carrotsearch.randomizedtesting.ThreadLeakError: There are still zombie threads that couldn't be terminated:
   1) Thread[id=13370, name=zkCallback-1787-thread-4, state=TIMED_WAITING, group=TGRP-ChaosMonkeyNothingIsSafeTest]
        at java.base@9/jdk.internal.misc.Unsafe.park(Native Method)
        at java.base@9/java.util.concurrent.locks.LockSupport.parkNanos(LockSupport.java:234)
        at java.base@9/java.util.concurrent.SynchronousQueue$TransferStack.awaitFulfill(SynchronousQueue.java:462)
        at java.base@9/java.util.concurrent.SynchronousQueue$TransferStack.transfer(SynchronousQueue.java:361)
        at java.base@9/java.util.concurrent.SynchronousQueue.poll(SynchronousQueue.java:937)
        at java.base@9/java.util.concurrent.ThreadPoolExecutor.getTask(ThreadPoolExecutor.java:1085)
        at java.base@9/java.util.concurrent.ThreadPoolExecutor.runWorker(ThreadPoolExecutor.java:1146)
        at java.base@9/java.util.concurrent.ThreadPoolExecutor$Worker.run(ThreadPoolExecutor.java:635)
        at java.base@9/java.lang.Thread.run(Thread.java:844)
   2) Thread[id=13421, name=zkCallback-1787-thread-5, state=TIMED_WAITING, group=TGRP-ChaosMonkeyNothingIsSafeTest]
        at java.base@9/jdk.internal.misc.Unsafe.park(Native Method)
        at java.base@9/java.util.concurrent.locks.LockSupport.parkNanos(LockSupport.java:234)
        at java.base@9/java.util.concurrent.SynchronousQueue$TransferStack.awaitFulfill(SynchronousQueue.java:462)
        at java.base@9/java.util.concurrent.SynchronousQueue$TransferStack.transfer(SynchronousQueue.java:361)
        at java.base@9/java.util.concurrent.SynchronousQueue.poll(SynchronousQueue.java:937)
        at java.base@9/java.util.concurrent.ThreadPoolExecutor.getTask(ThreadPoolExecutor.java:1085)
        at java.base@9/java.util.concurrent.ThreadPoolExecutor.runWorker(ThreadPoolExecutor.java:1146)
        at java.base@9/java.util.concurrent.ThreadPoolExecutor$Worker.run(ThreadPoolExecutor.java:635)
        at java.base@9/java.lang.Thread.run(Thread.java:844)
   3) Thread[id=13231, name=zkCallback-1787-thread-1, state=TIMED_WAITING, group=TGRP-ChaosMonkeyNothingIsSafeTest]
        at java.base@9/jdk.internal.misc.Unsafe.park(Native Method)
        at java.base@9/java.util.concurrent.locks.LockSupport.parkNanos(LockSupport.java:234)
        at java.base@9/java.util.concurrent.SynchronousQueue$TransferStack.awaitFulfill(SynchronousQueue.java:462)
        at java.base@9/java.util.concurrent.SynchronousQueue$TransferStack.transfer(SynchronousQueue.java:361)
        at java.base@9/java.util.concurrent.SynchronousQueue.poll(SynchronousQueue.java:937)
        at java.base@9/java.util.concurrent.ThreadPoolExecutor.getTask(ThreadPoolExecutor.java:1085)
        at java.base@9/java.util.concurrent.ThreadPoolExecutor.runWorker(ThreadPoolExecutor.java:1146)
        at java.base@9/java.util.concurrent.ThreadPoolExecutor$Worker.run(ThreadPoolExecutor.java:635)
        at java.base@9/java.lang.Thread.run(Thread.java:844)
   4) Thread[id=13422, name=zkCallback-1787-thread-6, state=TIMED_WAITING, group=TGRP-ChaosMonkeyNothingIsSafeTest]
        at java.base@9/jdk.internal.misc.Unsafe.park(Native Method)
        at java.base@9/java.util.concurrent.locks.LockSupport.parkNanos(LockSupport.java:234)
        at java.base@9/java.util.concurrent.SynchronousQueue$TransferStack.awaitFulfill(SynchronousQueue.java:462)
        at java.base@9/java.util.concurrent.SynchronousQueue$TransferStack.transfer(SynchronousQueue.java:361)
        at java.base@9/java.util.concurrent.SynchronousQueue.poll(SynchronousQueue.java:937)
        at java.base@9/java.util.concurrent.ThreadPoolExecutor.getTask(ThreadPoolExecutor.java:1085)
        at java.base@9/java.util.concurrent.ThreadPoolExecutor.runWorker(ThreadPoolExecutor.java:1146)
        at java.base@9/java.util.concurrent.ThreadPoolExecutor$Worker.run(ThreadPoolExecutor.java:635)
        at java.base@9/java.lang.Thread.run(Thread.java:844)
   5) Thread[id=13369, name=zkCallback-1787-thread-3, state=TIMED_WAITING, group=TGRP-ChaosMonkeyNothingIsSafeTest]
        at java.base@9/jdk.internal.misc.Unsafe.park(Native Method)
        at java.base@9/java.util.concurrent.locks.LockSupport.parkNanos(LockSupport.java:234)
        at java.base@9/java.util.concurrent.SynchronousQueue$TransferStack.awaitFulfill(SynchronousQueue.java:462)
        at java.base@9/java.util.concurrent.SynchronousQueue$TransferStack.transfer(SynchronousQueue.java:361)
        at java.base@9/java.util.concurrent.SynchronousQueue.poll(SynchronousQueue.java:937)
        at java.base@9/java.util.concurrent.ThreadPoolExecutor.getTask(ThreadPoolExecutor.java:1085)
        at java.base@9/java.util.concurrent.ThreadPoolExecutor.runWorker(ThreadPoolExecutor.java:1146)
        at java.base@9/java.util.concurrent.ThreadPoolExecutor$Worker.run(ThreadPoolExecutor.java:635)
        at java.base@9/java.lang.Thread.run(Thread.java:844)
   6) Thread[id=13229, name=TEST-ChaosMonkeyNothingIsSafeTest.test-seed#[79D73AB6ACDE3985]-SendThread(127.0.0.1:62724), state=RUNNABLE, group=TGRP-ChaosMonkeyNothingIsSafeTest]
        at java.base@9/sun.nio.ch.WindowsSelectorImpl$SubSelector.poll0(Native Method)
        at java.base@9/sun.nio.ch.WindowsSelectorImpl$SubSelector.poll(WindowsSelectorImpl.java:296)
        at java.base@9/sun.nio.ch.WindowsSelectorImpl$SubSelector.access$400(WindowsSelectorImpl.java:278)
        at java.base@9/sun.nio.ch.WindowsSelectorImpl.doSelect(WindowsSelectorImpl.java:159)
        at java.base@9/sun.nio.ch.SelectorImpl.lockAndDoSelect(SelectorImpl.java:86)
        at java.base@9/sun.nio.ch.SelectorImpl.select(SelectorImpl.java:97)
        at app//org.apache.zookeeper.ClientCnxnSocketNIO.doTransport(ClientCnxnSocketNIO.java:349)
        at app//org.apache.zookeeper.ClientCnxn$SendThread.run(ClientCnxn.java:1141)
   7) Thread[id=13357, name=zkCallback-1787-thread-2, state=TIMED_WAITING, group=TGRP-ChaosMonkeyNothingIsSafeTest]
        at java.base@9/jdk.internal.misc.Unsafe.park(Native Method)
        at java.base@9/java.util.concurrent.locks.LockSupport.parkNanos(LockSupport.java:234)
        at java.base@9/java.util.concurrent.SynchronousQueue$TransferStack.awaitFulfill(SynchronousQueue.java:462)
        at java.base@9/java.util.concurrent.SynchronousQueue$TransferStack.transfer(SynchronousQueue.java:361)
        at java.base@9/java.util.concurrent.SynchronousQueue.poll(SynchronousQueue.java:937)
        at java.base@9/java.util.concurrent.ThreadPoolExecutor.getTask(ThreadPoolExecutor.java:1085)
        at java.base@9/java.util.concurrent.ThreadPoolExecutor.runWorker(ThreadPoolExecutor.java:1146)
        at java.base@9/java.util.concurrent.ThreadPoolExecutor$Worker.run(ThreadPoolExecutor.java:635)
        at java.base@9/java.lang.Thread.run(Thread.java:844)
	at __randomizedtesting.SeedInfo.seed([79D73AB6ACDE3985]:0)




Build Log:
[...truncated 10990 lines...]
   [junit4] Suite: org.apache.solr.SampleTest
   [junit4]   2> Creating dataDir: C:\Users\jenkins\workspace\Lucene-Solr-master-Windows\solr\build\solr-core\test\J1\temp\solr.SampleTest_79D73AB6ACDE3985-001\init-core-data-001
   [junit4]   2> 171967 WARN  (SUITE-SampleTest-seed#[79D73AB6ACDE3985]-worker) [    ] o.a.s.SolrTestCaseJ4 startTrackingSearchers: numOpens=4 numCloses=4
   [junit4]   2> 171967 INFO  (SUITE-SampleTest-seed#[79D73AB6ACDE3985]-worker) [    ] o.a.s.SolrTestCaseJ4 Using PointFields (NUMERIC_POINTS_SYSPROP=true) w/NUMERIC_DOCVALUES_SYSPROP=false
   [junit4]   2> 171970 INFO  (SUITE-SampleTest-seed#[79D73AB6ACDE3985]-worker) [    ] o.a.s.SolrTestCaseJ4 Randomized ssl (false) and clientAuth (false) via: @org.apache.solr.util.RandomizeSSL(reason="", value=0.0/0.0, ssl=0.0/0.0, clientAuth=0.0/0.0)
   [junit4]   2> 171970 INFO  (SUITE-SampleTest-seed#[79D73AB6ACDE3985]-worker) [    ] o.a.s.SolrTestCaseJ4 SecureRandom sanity checks: test.solr.allowed.securerandom=null & java.security.egd=file:/dev/./urandom
   [junit4]   2> 171971 INFO  (SUITE-SampleTest-seed#[79D73AB6ACDE3985]-worker) [    ] o.a.s.SolrTestCaseJ4 ####initCore
   [junit4]   2> 171974 INFO  (SUITE-SampleTest-seed#[79D73AB6ACDE3985]-worker) [    ] o.a.s.c.SolrResourceLoader [null] Added 2 libs to classloader, from paths: [/C:/Users/jenkins/workspace/Lucene-Solr-master-Windows/solr/core/src/test-files/solr/collection1/lib, /C:/Users/jenkins/workspace/Lucene-Solr-master-Windows/solr/core/src/test-files/solr/collection1/lib/classes]
   [junit4]   2> 172023 INFO  (SUITE-SampleTest-seed#[79D73AB6ACDE3985]-worker) [    ] o.a.s.c.SolrConfig Using Lucene MatchVersion: 8.0.0
   [junit4]   2> 172032 INFO  (SUITE-SampleTest-seed#[79D73AB6ACDE3985]-worker) [    ] o.a.s.s.IndexSchema [null] Schema name=test
   [junit4]   2> 172033 INFO  (SUITE-SampleTest-seed#[79D73AB6ACDE3985]-worker) [    ] o.a.s.s.IndexSchema Loaded schema test/1.0 with uniqueid field id
   [junit4]   2> 172076 INFO  (SUITE-SampleTest-seed#[79D73AB6ACDE3985]-worker) [    ] o.a.s.m.r.SolrJmxReporter JMX monitoring for 'solr.node' (registry 'solr.node') enabled at server: com.sun.jmx.mbeanserver.JmxMBeanServer@810dbc
   [junit4]   2> 172079 INFO  (SUITE-SampleTest-seed#[79D73AB6ACDE3985]-worker) [    ] o.a.s.m.r.SolrJmxReporter JMX monitoring for 'solr.jvm' (registry 'solr.jvm') enabled at server: com.sun.jmx.mbeanserver.JmxMBeanServer@810dbc
   [junit4]   2> 172080 INFO  (SUITE-SampleTest-seed#[79D73AB6ACDE3985]-worker) [    ] o.a.s.m.r.SolrJmxReporter JMX monitoring for 'solr.jetty' (registry 'solr.jetty') enabled at server: com.sun.jmx.mbeanserver.JmxMBeanServer@810dbc
   [junit4]   2> 172081 INFO  (coreLoadExecutor-773-thread-1) [    ] o.a.s.c.SolrResourceLoader [null] Added 2 libs to classloader, from paths: [/C:/Users/jenkins/workspace/Lucene-Solr-master-Windows/solr/core/src/test-files/solr/collection1/lib, /C:/Users/jenkins/workspace/Lucene-Solr-master-Windows/solr/core/src/test-files/solr/collection1/lib/classes]
   [junit4]   2> 172111 INFO  (coreLoadExecutor-773-thread-1) [    ] o.a.s.c.SolrConfig Using Lucene MatchVersion: 8.0.0
   [junit4]   2> 172119 INFO  (coreLoadExecutor-773-thread-1) [    ] o.a.s.s.IndexSchema [collection1] Schema name=test
   [junit4]   2> 172121 INFO  (coreLoadExecutor-773-thread-1) [    ] o.a.s.s.IndexSchema Loaded schema test/1.0 with uniqueid field id
   [junit4]   2> 172121 INFO  (coreLoadExecutor-773-thread-1) [    ] o.a.s.c.CoreContainer Creating SolrCore 'collection1' using configuration from instancedir C:\Users\jenkins\workspace\Lucene-Solr-master-Windows\solr\core\src\test-files\solr\collection1, trusted=true
   [junit4]   2> 172121 INFO  (coreLoadExecutor-773-thread-1) [    ] o.a.s.m.r.SolrJmxReporter JMX monitoring for 'solr.core.collection1' (registry 'solr.core.collection1') enabled at server: com.sun.jmx.mbeanserver.JmxMBeanServer@810dbc
   [junit4]   2> 172121 INFO  (coreLoadExecutor-773-thread-1) [    ] o.a.s.c.SolrCore solr.RecoveryStrategy.Builder
   [junit4]   2> 172121 INFO  (coreLoadExecutor-773-thread-1) [    ] o.a.s.c.SolrCore [[collection1] ] Opening new SolrCore at [C:\Users\jenkins\workspace\Lucene-Solr-master-Windows\solr\core\src\test-files\solr\collection1], dataDir=[C:\Users\jenkins\workspace\Lucene-Solr-master-Windows\solr\build\solr-core\test\J1\temp\solr.SampleTest_79D73AB6ACDE3985-001\init-core-data-001\]
   [junit4]   2> 172126 INFO  (coreLoadExecutor-773-thread-1) [    ] o.a.s.u.RandomMergePolicy RandomMergePolicy wrapping class org.apache.lucene.index.TieredMergePolicy: [TieredMergePolicy: maxMergeAtOnce=10, maxMergeAtOnceExplicit=50, maxMergedSegmentMB=59.126953125, floorSegmentMB=1.55078125, forceMergeDeletesPctAllowed=13.173626189143222, segmentsPerTier=38.0, maxCFSSegmentSizeMB=8.796093022207999E12, noCFSRatio=0.2573581832186653
   [junit4]   2> 172135 INFO  (coreLoadExecutor-773-thread-1) [    ] o.a.s.r.XSLTResponseWriter xsltCacheLifetimeSeconds=60
   [junit4]   2> 172204 INFO  (coreLoadExecutor-773-thread-1) [    ] o.a.s.u.CommitTracker Hard AutoCommit: disabled
   [junit4]   2> 172204 INFO  (coreLoadExecutor-773-thread-1) [    ] o.a.s.u.CommitTracker Soft AutoCommit: disabled
   [junit4]   2> 172205 INFO  (coreLoadExecutor-773-thread-1) [    ] o.a.s.u.RandomMergePolicy RandomMergePolicy wrapping class org.apache.lucene.index.LogByteSizeMergePolicy: [LogByteSizeMergePolicy: minMergeSize=1677721, mergeFactor=18, maxMergeSize=2147483648, maxMergeSizeForForcedMerge=9223372036854775807, calibrateSizeByDeletes=true, maxMergeDocs=2147483647, maxCFSSegmentSizeMB=8.796093022207999E12, noCFSRatio=0.5238418740703218]
   [junit4]   2> 172207 INFO  (coreLoadExecutor-773-thread-1) [    ] o.a.s.s.SolrIndexSearcher Opening [Searcher@6c6fdc[collection1] main]
   [junit4]   2> 172207 WARN  (coreLoadExecutor-773-thread-1) [    ] o.a.s.r.ManagedResourceStorage Cannot write to config directory C:\Users\jenkins\workspace\Lucene-Solr-master-Windows\solr\core\src\test-files\solr\collection1\conf; switching to use InMemory storage instead.
   [junit4]   2> 172208 INFO  (coreLoadExecutor-773-thread-1) [    ] o.a.s.h.ReplicationHandler Commits will be reserved for  10000
   [junit4]   2> 172208 INFO  (searcherExecutor-774-thread-1) [    ] o.a.s.c.SolrCore [collection1] Registered new searcher Searcher@6c6fdc[collection1] main{ExitableDirectoryReader(UninvertingDirectoryReader())}
   [junit4]   2> 172209 INFO  (SUITE-SampleTest-seed#[79D73AB6ACDE3985]-worker) [    ] o.a.s.SolrTestCaseJ4 ####initCore end
   [junit4]   2> 172211 INFO  (TEST-SampleTest.testAdvanced-seed#[79D73AB6ACDE3985]) [    ] o.a.s.SolrTestCaseJ4 ###Starting testAdvanced
   [junit4]   2> 172212 INFO  (TEST-SampleTest.testAdvanced-seed#[79D73AB6ACDE3985]) [    ] o.a.s.u.p.LogUpdateProcessorFactory [collection1]  webapp=null path=null params={}{add=[4059]} 0 1
   [junit4]   2> 172214 INFO  (TEST-SampleTest.testAdvanced-seed#[79D73AB6ACDE3985]) [    ] o.a.s.u.p.LogUpdateProcessorFactory [collection1]  webapp=null path=null params={}{add=[4059]} 0 0
   [junit4]   2> 172215 INFO  (TEST-SampleTest.testAdvanced-seed#[79D73AB6ACDE3985]) [    ] o.a.s.u.p.LogUpdateProcessorFactory [collection1]  webapp=null path=null params={}{add=[4055]} 0 0
   [junit4]   2> 172215 INFO  (TEST-SampleTest.testAdvanced-seed#[79D73AB6ACDE3985]) [    ] o.a.s.u.DirectUpdateHandler2 start commit{,optimize=false,openSearcher=true,waitSearcher=true,expungeDeletes=false,softCommit=false,prepareCommit=false}
   [junit4]   2> 172215 INFO  (TEST-SampleTest.testAdvanced-seed#[79D73AB6ACDE3985]) [    ] o.a.s.u.SolrIndexWriter Calling setCommitData with IW:org.apache.solr.update.SolrIndexWriter@1b245be commitCommandVersion:0
   [junit4]   2> 172225 INFO  (TEST-SampleTest.testAdvanced-seed#[79D73AB6ACDE3985]) [    ] o.a.s.s.SolrIndexSearcher Opening [Searcher@96e12a[collection1] main]
   [junit4]   2> 172227 INFO  (TEST-SampleTest.testAdvanced-seed#[79D73AB6ACDE3985]) [    ] o.a.s.u.DirectUpdateHandler2 end_commit_flush
   [junit4]   2> 172228 INFO  (searcherExecutor-774-thread-1) [    ] o.a.s.c.SolrCore [collection1] Registered new searcher Searcher@96e12a[collection1] main{ExitableDirectoryReader(UninvertingDirectoryReader(Uninverting(_0(8.0.0):c3)))}
   [junit4]   2> 172228 INFO  (TEST-SampleTest.testAdvanced-seed#[79D73AB6ACDE3985]) [    ] o.a.s.u.p.LogUpdateProcessorFactory [collection1]  webapp=null path=null params={}{commit=} 0 13
   [junit4]   2> 172229 INFO  (TEST-SampleTest.testAdvanced-seed#[79D73AB6ACDE3985]) [    ] o.a.s.u.DirectUpdateHandler2 start commit{,optimize=true,openSearcher=true,waitSearcher=true,expungeDeletes=false,softCommit=false,prepareCommit=false}
   [junit4]   2> 172229 WARN  (TEST-SampleTest.testAdvanced-seed#[79D73AB6ACDE3985]) [    ] o.a.s.u.DirectUpdateHandler2 Starting optimize... Reading and rewriting the entire index! Use with care.
   [junit4]   2> 172255 INFO  (TEST-SampleTest.testAdvanced-seed#[79D73AB6ACDE3985]) [    ] o.a.s.u.SolrIndexWriter Calling setCommitData with IW:org.apache.solr.update.SolrIndexWriter@1b245be commitCommandVersion:0
   [junit4]   2> 172270 INFO  (TEST-SampleTest.testAdvanced-seed#[79D73AB6ACDE3985]) [    ] o.a.s.s.SolrIndexSearcher Opening [Searcher@793d32[collection1] main]
   [junit4]   2> 172270 INFO  (TEST-SampleTest.testAdvanced-seed#[79D73AB6ACDE3985]) [    ] o.a.s.u.DirectUpdateHandler2 end_commit_flush
   [junit4]   2> 172272 INFO  (searcherExecutor-774-thread-1) [    ] o.a.s.c.SolrCore [collection1] Registered new searcher Searcher@793d32[collection1] main{ExitableDirectoryReader(UninvertingDirectoryReader(Uninverting(_1(8.0.0):C3)))}
   [junit4]   2> 172273 INFO  (TEST-SampleTest.testAdvanced-seed#[79D73AB6ACDE3985]) [    ] o.a.s.u.p.LogUpdateProcessorFactory [collection1]  webapp=null path=null params={}{optimize=} 0 44
   [junit4]   2> 172274 INFO  (TEST-SampleTest.testAdvanced-seed#[79D73AB6ACDE3985]) [    ] o.a.s.c.S.Request [collection1]  webapp=null path=null params={q=subject:Hoss&qt=&start=0&rows=20&version=2.2} hits=1 status=0 QTime=0
   [junit4]   2> 172275 INFO  (TEST-SampleTest.testAdvanced-seed#[79D73AB6ACDE3985]) [    ] o.a.s.c.S.Request [collection1]  webapp=null path=null params={q=Mack+Daddy&qt=/crazy_custom_qt&start=100&rows=200&version=2.2} hits=0 status=0 QTime=0
   [junit4]   2> 172275 INFO  (TEST-SampleTest.testAdvanced-seed#[79D73AB6ACDE3985]) [    ] o.a.s.c.S.Request [collection1]  webapp=null path=null params={q=Mack+Daddy&qt=/crazy_custom_qt&start=100&rows=200&version=2.2} hits=0 status=0 QTime=0
   [junit4]   2> 172277 INFO  (TEST-SampleTest.testAdvanced-seed#[79D73AB6ACDE3985]) [    ] o.a.s.SolrTestCaseJ4 ###Ending testAdvanced
   [junit4]   2> 172278 INFO  (TEST-SampleTest.testSimple-seed#[79D73AB6ACDE3985]) [    ] o.a.s.SolrTestCaseJ4 ###Starting testSimple
   [junit4]   2> 172278 INFO  (TEST-SampleTest.testSimple-seed#[79D73AB6ACDE3985]) [    ] o.a.s.u.p.LogUpdateProcessorFactory [collection1]  webapp=null path=null params={}{add=[4055]} 0 0
   [junit4]   2> 172279 INFO  (TEST-SampleTest.testSimple-seed#[79D73AB6ACDE3985]) [    ] o.a.s.u.p.LogUpdateProcessorFactory [collection1]  webapp=null path=null params={}{add=[4056]} 0 0
   [junit4]   2> 172279 INFO  (TEST-SampleTest.testSimple-seed#[79D73AB6ACDE3985]) [    ] o.a.s.u.DirectUpdateHandler2 start commit{,optimize=false,openSearcher=true,waitSearcher=true,expungeDeletes=false,softCommit=false,prepareCommit=false}
   [junit4]   2> 172279 INFO  (TEST-SampleTest.testSimple-seed#[79D73AB6ACDE3985]) [    ] o.a.s.u.SolrIndexWriter Calling setCommitData with IW:org.apache.solr.update.SolrIndexWriter@1b245be commitCommandVersion:0
   [junit4]   2> 172296 INFO  (TEST-SampleTest.testSimple-seed#[79D73AB6ACDE3985]) [    ] o.a.s.s.SolrIndexSearcher Opening [Searcher@142f48c[collection1] main]
   [junit4]   2> 172297 INFO  (TEST-SampleTest.testSimple-seed#[79D73AB6ACDE3985]) [    ] o.a.s.u.DirectUpdateHandler2 end_commit_flush
   [junit4]   2> 172298 INFO  (searcherExecutor-774-thread-1) [    ] o.a.s.c.SolrCore [collection1] Registered new searcher Searcher@142f48c[collection1] main{ExitableDirectoryReader(UninvertingDirectoryReader(Uninverting(_1(8.0.0):C3/1:delGen=1) Uninverting(_2(8.0.0):c2)))}
   [junit4]   2> 172298 INFO  (TEST-SampleTest.testSimple-seed#[79D73AB6ACDE3985]) [    ] o.a.s.u.p.LogUpdateProcessorFactory [collection1]  webapp=null path=null params={}{commit=} 0 18
   [junit4]   2> 172299 INFO  (TEST-SampleTest.testSimple-seed#[79D73AB6ACDE3985]) [    ] o.a.s.u.DirectUpdateHandler2 start commit{,optimize=true,openSearcher=true,waitSearcher=true,expungeDeletes=false,softCommit=false,prepareCommit=false}
   [junit4]   2> 172299 WARN  (TEST-SampleTest.testSimple-seed#[79D73AB6ACDE3985]) [    ] o.a.s.u.DirectUpdateHandler2 Starting optimize... Reading and rewriting the entire index! Use with care.
   [junit4]   2> 172301 INFO  (TEST-SampleTest.testSimple-seed#[79D73AB6ACDE3985]) [    ] o.a.s.u.SolrIndexWriter Calling setCommitData with IW:org.apache.solr.update.SolrIndexWriter@1b245be commitCommandVersion:0
   [junit4]   2> 172308 INFO  (TEST-SampleTest.testSimple-seed#[79D73AB6ACDE3985]) [    ] o.a.s.s.SolrIndexSearcher Opening [Searcher@1a05944[collection1] main]
   [junit4]   2> 172309 INFO  (TEST-SampleTest.testSimple-seed#[79D73AB6ACDE3985]) [    ] o.a.s.u.DirectUpdateHandler2 end_commit_flush
   [junit4]   2> 172310 INFO  (searcherExecutor-774-thread-1) [    ] o.a.s.c.SolrCore [collection1] Registered new searcher Searcher@1a05944[collection1] main{ExitableDirectoryReader(UninvertingDirectoryReader(Uninverting(_3(8.0.0):c4)))}
   [junit4]   2> 172312 INFO  (TEST-SampleTest.testSimple-seed#[79D73AB6ACDE3985]) [    ] o.a.s.u.p.LogUpdateProcessorFactory [collection1]  webapp=null path=null params={}{optimize=} 0 14
   [junit4]   2> 172314 INFO  (TEST-SampleTest.testSimple-seed#[79D73AB6ACDE3985]) [    ] o.a.s.c.S.Request [collection1]  webapp=null path=null params={q=subject:Hoss&qt=&start=0&rows=20&version=2.2} hits=1 status=0 QTime=0
   [junit4]   2> 172314 INFO  (TEST-SampleTest.testSimple-seed#[79D73AB6ACDE3985]) [    ] o.a.s.SolrTestCaseJ4 ###Ending testSimple
   [junit4]   2> 172315 INFO  (SUITE-SampleTest-seed#[79D73AB6ACDE3985]-worker) [    ] o.a.s.SolrTestCaseJ4 ###deleteCore
   [junit4]   2> 172315 INFO  (SUITE-SampleTest-seed#[79D73AB6ACDE3985]-worker) [    ] o.a.s.c.CoreContainer Shutting down CoreContainer instance=9024866
   [junit4]   2> 172315 INFO  (SUITE-SampleTest-seed#[79D73AB6ACDE3985]-worker) [    ] o.a.s.m.SolrMetricManager Closing metric reporters for registry=solr.node, tag=null
   [junit4]   2> 172316 INFO  (SUITE-SampleTest-seed#[79D73AB6ACDE3985]-worker) [    ] o.a.s.m.SolrMetricManager Closing metric reporters for registry=solr.jvm, tag=null
   [junit4]   2> 172317 INFO  (SUITE-SampleTest-seed#[79D73AB6ACDE3985]-worker) [    ] o.a.s.m.SolrMetricManager Closing metric reporters for registry=solr.jetty, tag=null
   [junit4]   2> 172317 INFO  (SUITE-SampleTest-seed#[79D73AB6ACDE3985]-worker) [    ] o.a.s.c.TransientSolrCoreCacheDefault Allocating transient cache for 2147483647 transient cores
   [junit4]   2> 172318 INFO  (coreCloseExecutor-778-thread-1) [    ] o.a.s.c.SolrCore [collection1]  CLOSING SolrCore org.apache.solr.core.SolrCore@14a21ab
   [junit4]   2> 172319 INFO  (coreCloseExecutor-778-thread-1) [    ] o.a.s.m.SolrMetricManager Closing metric reporters for registry=solr.core.collection1, tag=21635499
   [junit4]   2> 172322 INFO  (SUITE-SampleTest-seed#[79D73AB6ACDE3985]-worker) [    ] o.a.s.SolrTestCaseJ4 ------------------------------------------------------- Done waiting for tracked resources to be released
   [junit4]   2> Jul 24, 2017 2:26:44 AM com.carrotsearch.randomizedtesting.ThreadLeakControl checkThreadLeaks
   [junit4]   2> WARNING: Will linger awaiting termination of 1 leaked thread(s).
   [junit4]   2> NOTE: test params are: codec=CheapBastard, sim=RandomSimilarity(queryNorm=false): {}, locale=ca-ES-VALENCIA, timezone=Europe/Amsterdam
   [junit4]   2> NOTE: Windows 10 10.0 x86/Oracle Corporation 9 (32-bit)/cpus=3,threads=1,free=195471288,total=510656512
   [junit4]   2> NOTE: All tests run in this JVM: [MoreLikeThisHandlerTest, TestStressCloudBlindAtomicUpdates, TestSolrCloudSnapshots, SmileWriterTest, TestRecoveryHdfs, TestElisionMultitermQuery, HdfsRecoveryZkTest, SolrGraphiteReporterTest, TestQueryUtils, TestExceedMaxTermLength, SharedFSAutoReplicaFailoverTest, MetricsConfigTest, HdfsTlogReplayBufferedWhileIndexingTest, ConjunctionSolrSpellCheckerTest, TestDistribIDF, HdfsSyncSliceTest, DataDrivenBlockJoinTest, TestLocalFSCloudBackupRestore, TestFileDictionaryLookup, MBeansHandlerTest, DistributedDebugComponentTest, TemplateUpdateProcessorTest, SolrCoreCheckLockOnStartupTest, TestCloudSchemaless, TestSubQueryTransformerDistrib, TestCopyFieldCollectionResource, TestHdfsBackupRestoreCore, TestManagedResourceStorage, TestAddFieldRealTimeGet, SampleTest]
   [junit4]   2> NOTE: reproduce with: ant test  -Dtestcase=SampleTest -Dtests.seed=79D73AB6ACDE3985 -Dtests.slow=true -Dtests.locale=ca-ES-VALENCIA -Dtests.timezone=Europe/Amsterdam -Dtests.asserts=true -Dtests.file.encoding=ISO-8859-1
   [junit4] ERROR   0.00s J1 | SampleTest (suite) <<<
   [junit4]    > Throwable #1: java.io.IOException: Could not remove the following files (in the order of attempts):
   [junit4]    >    C:\Users\jenkins\workspace\Lucene-Solr-master-Windows\solr\build\solr-core\test\J1\temp\solr.SampleTest_79D73AB6ACDE3985-001\init-core-data-001: java.nio.file.AccessDeniedException: C:\Users\jenkins\workspace\Lucene-Solr-master-Windows\solr\build\solr-core\test\J1\temp\solr.SampleTest_79D73AB6ACDE3985-001\init-core-data-001
   [junit4]    >    C:\Users\jenkins\workspace\Lucene-Solr-master-Windows\solr\build\solr-core\test\J1\temp\solr.SampleTest_79D73AB6ACDE3985-001: java.nio.file.DirectoryNotEmptyException: C:\Users\jenkins\workspace\Lucene-Solr-master-Windows\solr\build\solr-core\test\J1\temp\solr.SampleTest_79D73AB6ACDE3985-001
   [junit4]    > 	at __randomizedtesting.SeedInfo.seed([79D73AB6ACDE3985]:0)
   [junit4]    > 	at org.apache.lucene.util.IOUtils.rm(IOUtils.java:329)
   [junit4]    > 	at java.base/java.lang.Thread.run(Thread.java:844)
   [junit4] Completed [57/727 (1!)] on J1 in 0.66s, 2 tests, 1 error <<< FAILURES!

[...truncated 974 lines...]
   [junit4] Suite: org.apache.solr.cloud.ChaosMonkeyNothingIsSafeTest
   [junit4]   2> 1566842 INFO  (SUITE-ChaosMonkeyNothingIsSafeTest-seed#[79D73AB6ACDE3985]-worker) [    ] o.a.s.SolrTestCaseJ4 SecureRandom sanity checks: test.solr.allowed.securerandom=null & java.security.egd=file:/dev/./urandom
   [junit4]   2> Creating dataDir: C:\Users\jenkins\workspace\Lucene-Solr-master-Windows\solr\build\solr-core\test\J0\temp\solr.cloud.ChaosMonkeyNothingIsSafeTest_79D73AB6ACDE3985-001\init-core-data-001
   [junit4]   2> 1566843 INFO  (SUITE-ChaosMonkeyNothingIsSafeTest-seed#[79D73AB6ACDE3985]-worker) [    ] o.a.s.SolrTestCaseJ4 Using PointFields (NUMERIC_POINTS_SYSPROP=true) w/NUMERIC_DOCVALUES_SYSPROP=true
   [junit4]   2> 1566846 INFO  (SUITE-ChaosMonkeyNothingIsSafeTest-seed#[79D73AB6ACDE3985]-worker) [    ] o.a.s.SolrTestCaseJ4 Randomized ssl (false) and clientAuth (false) via: @org.apache.solr.SolrTestCaseJ4$SuppressSSL(bugUrl="https://issues.apache.org/jira/browse/SOLR-5776")
   [junit4]   2> 1566846 INFO  (SUITE-ChaosMonkeyNothingIsSafeTest-seed#[79D73AB6ACDE3985]-worker) [    ] o.a.s.BaseDistributedSearchTestCase Setting hostContext system property: /o_yga/wh
   [junit4]   2> 1566848 INFO  (TEST-ChaosMonkeyNothingIsSafeTest.test-seed#[79D73AB6ACDE3985]) [    ] o.a.s.c.ZkTestServer STARTING ZK TEST SERVER
   [junit4]   2> 1566849 INFO  (Thread-2510) [    ] o.a.s.c.ZkTestServer client port:0.0.0.0/0.0.0.0:0
   [junit4]   2> 1566849 INFO  (Thread-2510) [    ] o.a.s.c.ZkTestServer Starting server
   [junit4]   2> 1566854 ERROR (Thread-2510) [    ] o.a.z.s.ZooKeeperServer ZKShutdownHandler is not registered, so ZooKeeper server won't take any action on ERROR or SHUTDOWN server state changes
   [junit4]   2> 1566949 INFO  (TEST-ChaosMonkeyNothingIsSafeTest.test-seed#[79D73AB6ACDE3985]) [    ] o.a.s.c.ZkTestServer start zk server on port:62724
   [junit4]   2> 1566955 WARN  (NIOServerCxn.Factory:0.0.0.0/0.0.0.0:0) [    ] o.a.z.s.NIOServerCnxn caught end of stream exception
   [junit4]   2> EndOfStreamException: Unable to read additional data from client sessionid 0x15d728052a50000, likely client has closed socket
   [junit4]   2> 	at org.apache.zookeeper.server.NIOServerCnxn.doIO(NIOServerCnxn.java:239)
   [junit4]   2> 	at org.apache.zookeeper.server.NIOServerCnxnFactory.run(NIOServerCnxnFactory.java:203)
   [junit4]   2> 	at java.base/java.lang.Thread.run(Thread.java:844)
   [junit4]   2> 1566967 INFO  (TEST-ChaosMonkeyNothingIsSafeTest.test-seed#[79D73AB6ACDE3985]) [    ] o.a.s.c.AbstractZkTestCase put C:\Users\jenkins\workspace\Lucene-Solr-master-Windows\solr\core\src\test-files\solr\collection1\conf\solrconfig-tlog.xml to /configs/conf1/solrconfig.xml
   [junit4]   2> 1566971 INFO  (TEST-ChaosMonkeyNothingIsSafeTest.test-seed#[79D73AB6ACDE3985]) [    ] o.a.s.c.AbstractZkTestCase put C:\Users\jenkins\workspace\Lucene-Solr-master-Windows\solr\core\src\test-files\solr\collection1\conf\schema15.xml to /configs/conf1/schema.xml
   [junit4]   2> 1566975 INFO  (TEST-ChaosMonkeyNothingIsSafeTest.test-seed#[79D73AB6ACDE3985]) [    ] o.a.s.c.AbstractZkTestCase put C:\Users\jenkins\workspace\Lucene-Solr-master-Windows\solr\core\src\test-files\solr\collection1\conf\solrconfig.snippet.randomindexconfig.xml to /configs/conf1/solrconfig.snippet.randomindexconfig.xml
   [junit4]   2> 1566977 INFO  (TEST-ChaosMonkeyNothingIsSafeTest.test-seed#[79D73AB6ACDE3985]) [    ] o.a.s.c.AbstractZkTestCase put C:\Users\jenkins\workspace\Lucene-Solr-master-Windows\solr\core\src\test-files\solr\collection1\conf\stopwords.txt to /configs/conf1/stopwords.txt
   [junit4]   2> 1566980 INFO  (TEST-ChaosMonkeyNothingIsSafeTest.test-seed#[79D73AB6ACDE3985]) [    ] o.a.s.c.AbstractZkTestCase put C:\Users\jenkins\workspace\Lucene-Solr-master-Windows\solr\core\src\test-files\solr\collection1\conf\protwords.txt to /configs/conf1/protwords.txt
   [junit4]   2> 1566982 INFO  (TEST-ChaosMonkeyNothingIsSafeTest.test-seed#[79D73AB6ACDE3985]) [    ] o.a.s.c.AbstractZkTestCase put C:\Users\jenkins\workspace\Lucene-Solr-master-Windows\solr\core\src\test-files\solr\collection1\conf\currency.xml to /configs/conf1/currency.xml
   [junit4]   2> 1566985 INFO  (TEST-ChaosMonkeyNothingIsSafeTest.test-seed#[79D73AB6ACDE3985]) [    ] o.a.s.c.AbstractZkTestCase put C:\Users\jenkins\workspace\Lucene-Solr-master-Windows\solr\core\src\test-files\solr\collection1\conf\enumsConfig.xml to /configs/conf1/enumsConfig.xml
   [junit4]   2> 1566988 INFO  (TEST-ChaosMonkeyNothingIsSafeTest.test-seed#[79D73AB6ACDE3985]) [    ] o.a.s.c.AbstractZkTestCase put C:\Users\jenkins\workspace\Lucene-Solr-master-Windows\solr\core\src\test-files\solr\collection1\conf\open-exchange-rates.json to /configs/conf1/open-exchange-rates.json
   [junit4]   2> 1566990 INFO  (TEST-ChaosMonkeyNothingIsSafeTest.test-seed#[79D73AB6ACDE3985]) [    ] o.a.s.c.AbstractZkTestCase put C:\Users\jenkins\workspace\Lucene-Solr-master-Windows\solr\core\src\test-files\solr\collection1\conf\mapping-ISOLatin1Accent.txt to /configs/conf1/mapping-ISOLatin1Accent.txt
   [junit4]   2> 1566993 INFO  (TEST-ChaosMonkeyNothingIsSafeTest.test-seed#[79D73AB6ACDE3985]) [    ] o.a.s.c.AbstractZkTestCase put C:\Users\jenkins\workspace\Lucene-Solr-master-Windows\solr\core\src\test-files\solr\collection1\conf\old_synonyms.txt to /configs/conf1/old_synonyms.txt
   [junit4]   2> 1566995 INFO  (TEST-ChaosMonkeyNothingIsSafeTest.test-seed#[79D73AB6ACDE3985]) [    ] o.a.s.c.AbstractZkTestCase put C:\Users\jenkins\workspace\Lucene-Solr-master-Windows\solr\core\src\test-files\solr\collection1\conf\synonyms.txt to /configs/conf1/synonyms.txt
   [junit4]   2> 1566999 INFO  (TEST-ChaosMonkeyNothingIsSafeTest.test-seed#[79D73AB6ACDE3985]) [    ] o.a.s.c.AbstractFullDistribZkTestBase Will use TLOG replicas unless explicitly asked otherwise
   [junit4]   2> 1567642 INFO  (TEST-ChaosMonkeyNothingIsSafeTest.test-seed#[79D73AB6ACDE3985]) [    ] o.e.j.s.Server jetty-9.3.14.v20161028
   [junit4]   2> 1567643 INFO  (TEST-ChaosMonkeyNothingIsSafeTest.test-seed#[79D73AB6ACDE3985]) [    ] o.e.j.s.h.ContextHandler Started o.e.j.s.ServletContextHandler@1ca50d3{/o_yga/wh,null,AVAILABLE}
   [junit4]   2> 1567648 INFO  (TEST-ChaosMonkeyNothingIsSafeTest.test-seed#[79D73AB6ACDE3985]) [    ] o.e.j.s.AbstractConnector Started ServerConnector@19021c1{HTTP/1.1,[http/1.1]}{127.0.0.1:62731}
   [junit4]   2> 1567648 INFO  (TEST-ChaosMonkeyNothingIsSafeTest.test-seed#[79D73AB6ACDE3985]) [    ] o.e.j.s.Server Started @1568470ms
   [junit4]   2> 1567648 INFO  (TEST-ChaosMonkeyNothingIsSafeTest.test-seed#[79D73AB6ACDE3985]) [    ] o.a.s.c.s.e.JettySolrRunner Jetty properties: {hostContext=/o_yga/wh, solr.data.dir=C:\Users\jenkins\workspace\Lucene-Solr-master-Windows\solr\build\solr-core\test\J0\temp\solr.cloud.ChaosMonkeyNothingIsSafeTest_79D73AB6ACDE3985-001\tempDir-001/control/data, hostPort=62731, coreRootDirectory=C:\Users\jenkins\workspace\Lucene-Solr-master-Windows\solr\build\solr-core\test\J0\temp\solr.cloud.ChaosMonkeyNothingIsSafeTest_79D73AB6ACDE3985-001\control-001\cores}
   [junit4]   2> 1567649 ERROR (TEST-ChaosMonkeyNothingIsSafeTest.test-seed#[79D73AB6ACDE3985]) [    ] o.a.s.s.StartupLoggingUtils Missing Java Option solr.log.dir. Logging may be missing or incomplete.
   [junit4]   2> 1567649 INFO  (TEST-ChaosMonkeyNothingIsSafeTest.test-seed#[79D73AB6ACDE3985]) [    ] o.a.s.s.SolrDispatchFilter  ___      _       Welcome to Apache Solr? version 8.0.0
   [junit4]   2> 1567649 INFO  (TEST-ChaosMonkeyNothingIsSafeTest.test-seed#[79D73AB6ACDE3985]) [    ] o.a.s.s.SolrDispatchFilter / __| ___| |_ _   Starting in cloud mode on port null
   [junit4]   2> 1567649 INFO  (TEST-ChaosMonkeyNothingIsSafeTest.test-seed#[79D73AB6ACDE3985]) [    ] o.a.s.s.SolrDispatchFilter \__ \/ _ \ | '_|  Install dir: null, Default config dir: null
   [junit4]   2> 1567649 INFO  (TEST-ChaosMonkeyNothingIsSafeTest.test-seed#[79D73AB6ACDE3985]) [    ] o.a.s.s.SolrDispatchFilter |___/\___/_|_|    Start time: 2017-07-24T02:49:59.489655200Z
   [junit4]   2> 1567656 WARN  (NIOServerCxn.Factory:0.0.0.0/0.0.0.0:0) [    ] o.a.z.s.NIOServerCnxn caught end of stream exception
   [junit4]   2> EndOfStreamException: Unable to read additional data from client sessionid 0x15d728052a50002, likely client has closed socket
   [junit4]   2> 	at org.apache.zookeeper.server.NIOServerCnxn.doIO(NIOServerCnxn.java:239)
   [junit4]   2> 	at org.apache.zookeeper.server.NIOServerCnxnFactory.run(NIOServerCnxnFactory.java:203)
   [junit4]   2> 	at java.base/java.lang.Thread.run(Thread.java:844)
   [junit4]   2> 1567657 INFO  (TEST-ChaosMonkeyNothingIsSafeTest.test-seed#[79D73AB6ACDE3985]) [    ] o.a.s.s.SolrDispatchFilter Loading solr.xml from SolrHome (not found in ZooKeeper)
   [junit4]   2> 1567657 INFO  (TEST-ChaosMonkeyNothingIsSafeTest.test-seed#[79D73AB6ACDE3985]) [    ] o.a.s.c.SolrXmlConfig Loading container configuration from C:\Users\jenkins\workspace\Lucene-Solr-master-Windows\solr\build\solr-core\test\J0\temp\solr.cloud.ChaosMonkeyNothingIsSafeTest_79D73AB6ACDE3985-001\control-001\solr.xml
   [junit4]   2> 1567667 INFO  (TEST-ChaosMonkeyNothingIsSafeTest.test-seed#[79D73AB6ACDE3985]) [    ] o.a.s.c.SolrXmlConfig MBean server found: com.sun.jmx.mbeanserver.JmxMBeanServer@c033e2, but no JMX reporters were configured - adding default JMX reporter.
   [junit4]   2> 1567674 INFO  (TEST-ChaosMonkeyNothingIsSafeTest.test-seed#[79D73AB6ACDE3985]) [    ] o.a.s.c.ZkContainer Zookeeper client=127.0.0.1:62724/solr
   [junit4]   2> 1567869 INFO  (TEST-ChaosMonkeyNothingIsSafeTest.test-seed#[79D73AB6ACDE3985]) [    ] o.a.s.c.Overseer Overseer (id=null) closing
   [junit4]   2> 1567870 INFO  (TEST-ChaosMonkeyNothingIsSafeTest.test-seed#[79D73AB6ACDE3985]) [    ] o.a.s.c.OverseerElectionContext I am going to be the leader 127.0.0.1:62731_o_yga%2Fwh
   [junit4]   2> 1567872 INFO  (TEST-ChaosMonkeyNothingIsSafeTest.test-seed#[79D73AB6ACDE3985]) [    ] o.a.s.c.Overseer Overseer (id=98360662339944452-127.0.0.1:62731_o_yga%2Fwh-n_0000000000) starting
   [junit4]   2> 1567880 INFO  (TEST-ChaosMonkeyNothingIsSafeTest.test-seed#[79D73AB6ACDE3985]) [    ] o.a.s.c.ZkController Register node as live in ZooKeeper:/live_nodes/127.0.0.1:62731_o_yga%2Fwh
   [junit4]   2> 1567883 INFO  (OverseerStateUpdate-98360662339944452-127.0.0.1:62731_o_yga%2Fwh-n_0000000000) [    ] o.a.s.c.c.ZkStateReader Updated live nodes from ZooKeeper... (0) -> (1)
   [junit4]   2> 1567997 INFO  (TEST-ChaosMonkeyNothingIsSafeTest.test-seed#[79D73AB6ACDE3985]) [    ] o.a.s.m.r.SolrJmxReporter JMX monitoring for 'solr.node' (registry 'solr.node') enabled at server: com.sun.jmx.mbeanserver.JmxMBeanServer@c033e2
   [junit4]   2> 1568005 INFO  (TEST-ChaosMonkeyNothingIsSafeTest.test-seed#[79D73AB6ACDE3985]) [    ] o.a.s.m.r.SolrJmxReporter JMX monitoring for 'solr.jvm' (registry 'solr.jvm') enabled at server: com.sun.jmx.mbeanserver.JmxMBeanServer@c033e2
   [junit4]   2> 1568005 INFO  (TEST-ChaosMonkeyNothingIsSafeTest.test-seed#[79D73AB6ACDE3985]) [    ] o.a.s.m.r.SolrJmxReporter JMX monitoring for 'solr.jetty' (registry 'solr.jetty') enabled at server: com.sun.jmx.mbeanserver.JmxMBeanServer@c033e2
   [junit4]   2> 1568008 INFO  (TEST-ChaosMonkeyNothingIsSafeTest.test-seed#[79D73AB6ACDE3985]) [    ] o.a.s.c.CorePropertiesLocator Found 0 core definitions underneath C:\Users\jenkins\workspace\Lucene-Solr-master-Windows\solr\build\solr-core\test\J0\temp\solr.cloud.ChaosMonkeyNothingIsSafeTest_79D73AB6ACDE3985-001\control-001\cores
   [junit4]   2> 1568036 INFO  (TEST-ChaosMonkeyNothingIsSafeTest.test-seed#[79D73AB6ACDE3985]) [    ] o.a.s.c.c.ZkStateReader Updated live nodes from ZooKeeper... (0) -> (1)
   [junit4]   2> 1568037 INFO  (TEST-ChaosMonkeyNothingIsSafeTest.test-seed#[79D73AB6ACDE3985]) [    ] o.a.s.c.s.i.ZkClientClusterStateProvider Cluster at 127.0.0.1:62724/solr ready
   [junit4]   2> 1568040 INFO  (qtp9029627-13194) [    ] o.a.s.h.a.CollectionsHandler Invoked Collection Action :create with params replicationFactor=1&collection.configName=conf1&name=control_collection&nrtReplicas=1&action=CREATE&numShards=1&createNodeSet=127.0.0.1:62731_o_yga%252Fwh&wt=javabin&version=2 and sendToOCPQueue=true
   [junit4]   2> 1568043 INFO  (OverseerThreadFactory-4564-thread-1) [    ] o.a.s.c.CreateCollectionCmd Create collection control_collection
   [junit4]   2> 1568150 INFO  (qtp9029627-13195) [    ] o.a.s.h.a.CoreAdminOperation core create command qt=/admin/cores&collection.configName=conf1&newCollection=true&name=control_collection_shard1_replica_n1&action=CREATE&numShards=1&collection=control_collection&shard=shard1&wt=javabin&version=2&replicaType=NRT
   [junit4]   2> 1568151 INFO  (qtp9029627-13195) [    ] o.a.s.c.TransientSolrCoreCacheDefault Allocating transient cache for 4 transient cores
   [junit4]   2> 1568264 INFO  (zkCallback-1780-thread-1) [    ] o.a.s.c.c.ZkStateReader A cluster state change: [WatchedEvent state:SyncConnected type:NodeDataChanged path:/collections/control_collection/state.json] for collection [control_collection] has occurred - updating... (live nodes size: [1])
   [junit4]   2> 1569175 INFO  (qtp9029627-13195) [    ] o.a.s.c.SolrConfig Using Lucene MatchVersion: 8.0.0
   [junit4]   2> 1569205 INFO  (qtp9029627-13195) [    ] o.a.s.s.IndexSchema [control_collection_shard1_replica_n1] Schema name=test
   [junit4]   2> 1569292 INFO  (qtp9029627-13195) [    ] o.a.s.s.IndexSchema Loaded schema test/1.6 with uniqueid field id
   [junit4]   2> 1569322 INFO  (qtp9029627-13195) [    ] o.a.s.c.CoreContainer Creating SolrCore 'control_collection_shard1_replica_n1' using configuration from collection control_collection, trusted=true
   [junit4]   2> 1569324 INFO  (qtp9029627-13195) [    ] o.a.s.m.r.SolrJmxReporter JMX monitoring for 'solr.core.control_collection.shard1.replica_n1' (registry 'solr.core.control_collection.shard1.replica_n1') enabled at server: com.sun.jmx.mbeanserver.JmxMBeanServer@c033e2
   [junit4]   2> 1569325 INFO  (qtp9029627-13195) [    ] o.a.s.c.SolrCore solr.RecoveryStrategy.Builder
   [junit4]   2> 1569325 INFO  (qtp9029627-13195) [    ] o.a.s.c.SolrCore [[control_collection_shard1_replica_n1] ] Opening new SolrCore at [C:\Users\jenkins\workspace\Lucene-Solr-master-Windows\solr\build\solr-core\test\J0\temp\solr.cloud.ChaosMonkeyNothingIsSafeTest_79D73AB6ACDE3985-001\control-001\cores\control_collection_shard1_replica_n1], dataDir=[C:\Users\jenkins\workspace\Lucene-Solr-master-Windows\solr\build\solr-core\test\J0\temp\solr.cloud.ChaosMonkeyNothingIsSafeTest_79D73AB6ACDE3985-001\control-001\cores\control_collection_shard1_replica_n1\data\]
   [junit4]   2> 1569340 INFO  (qtp9029627-13195) [    ] o.a.s.u.RandomMergePolicy RandomMergePolicy wrapping class org.apache.lucene.index.LogByteSizeMergePolicy: [LogByteSizeMergePolicy: minMergeSize=1677721, mergeFactor=30, maxMergeSize=2147483648, maxMergeSizeForForcedMerge=9223372036854775807, calibrateSizeByDeletes=true, maxMergeDocs=2147483647, maxCFSSegmentSizeMB=8.796093022207999E12, noCFSRatio=1.0]
   [junit4]   2> 1569348 WARN  (qtp9029627-13195) [    ] o.a.s.c.RequestHandlers INVALID paramSet a in requestHandler {type = requestHandler,name = /dump,class = DumpRequestHandler,attributes = {initParams=a, name=/dump, class=DumpRequestHandler},args = {defaults={a=A,b=B}}}
   [junit4]   2> 1569474 INFO  (qtp9029627-13195) [    ] o.a.s.u.UpdateHandler Using UpdateLog implementation: org.apache.solr.update.UpdateLog
   [junit4]   2> 1569474 INFO  (qtp9029627-13195) [    ] o.a.s.u.UpdateLog Initializing UpdateLog: dataDir= defaultSyncLevel=FLUSH numRecordsToKeep=100 maxNumLogsToKeep=10 numVersionBuckets=65536
   [junit4]   2> 1569476 INFO  (qtp9029627-13195) [    ] o.a.s.u.CommitTracker Hard AutoCommit: if uncommited for 15000ms; 
   [junit4]   2> 1569476 INFO  (qtp9029627-13195) [    ] o.a.s.u.CommitTracker Soft AutoCommit: disabled
   [junit4]   2> 1569477 INFO  (qtp9029627-13195) [    ] o.a.s.u.RandomMergePolicy RandomMergePolicy wrapping class org.apache.lucene.index.TieredMergePolicy: [TieredMergePolicy: maxMergeAtOnce=22, maxMergeAtOnceExplicit=15, maxMergedSegmentMB=95.4296875, floorSegmentMB=0.96484375, forceMergeDeletesPctAllowed=23.51653576691995, segmentsPerTier=13.0, maxCFSSegmentSizeMB=8.796093022207999E12, noCFSRatio=1.0
   [junit4]   2> 1569478 INFO  (qtp9029627-13195) [    ] o.a.s.s.SolrIndexSearcher Opening [Searcher@23b0aa[control_collection_shard1_replica_n1] main]
   [junit4]   2> 1569480 INFO  (qtp9029627-13195) [    ] o.a.s.r.ManagedResourceStorage Configured ZooKeeperStorageIO with znodeBase: /configs/conf1
   [junit4]   2> 1569481 INFO  (qtp9029627-13195) [    ] o.a.s.r.ManagedResourceStorage Loaded null at path _rest_managed.json using ZooKeeperStorageIO:path=/configs/conf1
   [junit4]   2> 1569481 INFO  (qtp9029627-13195) [    ] o.a.s.h.ReplicationHandler Commits will be reserved for  10000
   [junit4]   2> 1569483 INFO  (searcherExecutor-4567-thread-1) [    ] o.a.s.c.SolrCore [control_collection_shard1_replica_n1] Registered new searcher Searcher@23b0aa[control_collection_shard1_replica_n1] main{ExitableDirectoryReader(UninvertingDirectoryReader())}
   [junit4]   2> 1569484 INFO  (qtp9029627-13195) [    ] o.a.s.u.UpdateLog Could not find max version in index or recent updates, using new clock 1573770600197914624
   [junit4]   2> 1569492 INFO  (qtp9029627-13195) [    ] o.a.s.c.ShardLeaderElectionContext Enough replicas found to continue.
   [junit4]   2> 1569492 INFO  (qtp9029627-13195) [    ] o.a.s.c.ShardLeaderElectionContext I may be the new leader - try and sync
   [junit4]   2> 1569492 INFO  (qtp9029627-13195) [    ] o.a.s.c.SyncStrategy Sync replicas to http://127.0.0.1:62731/o_yga/wh/control_collection_shard1_replica_n1/
   [junit4]   2> 1569492 INFO  (qtp9029627-13195) [    ] o.a.s.c.SyncStrategy Sync Success - now sync replicas to me
   [junit4]   2> 1569493 INFO  (qtp9029627-13195) [    ] o.a.s.c.SyncStrategy http://127.0.0.1:62731/o_yga/wh/control_collection_shard1_replica_n1/ has no replicas
   [junit4]   2> 1569493 INFO  (qtp9029627-13195) [    ] o.a.s.c.ShardLeaderElectionContext Found all replicas participating in election, clear LIR
   [junit4]   2> 1569500 INFO  (qtp9029627-13195) [    ] o.a.s.c.ShardLeaderElectionContext I am the new leader: http://127.0.0.1:62731/o_yga/wh/control_collection_shard1_replica_n1/ shard1
   [junit4]   2> 1569605 INFO  (zkCallback-1780-thread-1) [    ] o.a.s.c.c.ZkStateReader A cluster state change: [WatchedEvent state:SyncConnected type:NodeDataChanged path:/collections/control_collection/state.json] for collection [control_collection] has occurred - updating... (live nodes size: [1])
   [junit4]   2> 1569655 INFO  (qtp9029627-13195) [    ] o.a.s.c.ZkController I am the leader, no recovery necessary
   [junit4]   2> 1569657 INFO  (qtp9029627-13195) [    ] o.a.s.s.HttpSolrCall [admin] webapp=null path=/admin/cores params={qt=/admin/cores&collection.configName=conf1&newCollection=true&name=control_collection_shard1_replica_n1&action=CREATE&numShards=1&collection=control_collection&shard=shard1&wt=javabin&version=2&replicaType=NRT} status=0 QTime=1506
   [junit4]   2> 1569660 INFO  (qtp9029627-13194) [    ] o.a.s.h.a.CollectionsHandler Wait for new collection to be active for at most 30 seconds. Check all shard replicas
   [junit4]   2> 1569762 INFO  (zkCallback-1780-thread-1) [    ] o.a.s.c.c.ZkStateReader A cluster state change: [WatchedEvent state:SyncConnected type:NodeDataChanged path:/collections/control_collection/state.json] for collection [control_collection] has occurred - updating... (live nodes size: [1])
   [junit4]   2> 1570045 INFO  (OverseerCollectionConfigSetProcessor-98360662339944452-127.0.0.1:62731_o_yga%2Fwh-n_0000000000) [    ] o.a.s.c.OverseerTaskQueue Response ZK path: /overseer/collection-queue-work/qnr-0000000000 doesn't exist.  Requestor may have disconnected from ZooKeeper
   [junit4]   2> 1570661 INFO  (qtp9029627-13194) [    ] o.a.s.s.HttpSolrCall [admin] webapp=null path=/admin/collections params={replicationFactor=1&collection.configName=conf1&name=control_collection&nrtReplicas=1&action=CREATE&numShards=1&createNodeSet=127.0.0.1:62731_o_yga%252Fwh&wt=javabin&version=2} status=0 QTime=2620
   [junit4]   2> 1570669 INFO  (TEST-ChaosMonkeyNothingIsSafeTest.test-seed#[79D73AB6ACDE3985]) [    ] o.a.s.c.c.ZkStateReader Updated live nodes from ZooKeeper... (0) -> (1)
   [junit4]   2> 1570670 INFO  (TEST-ChaosMonkeyNothingIsSafeTest.test-seed#[79D73AB6ACDE3985]) [    ] o.a.s.c.s.i.ZkClientClusterStateProvider Cluster at 127.0.0.1:62724/solr ready
   [junit4]   2> 1570670 INFO  (TEST-ChaosMonkeyNothingIsSafeTest.test-seed#[79D73AB6ACDE3985]) [    ] o.a.s.c.ChaosMonkey monkey: init - expire sessions:false cause connection loss:false
   [junit4]   2> 1570671 INFO  (qtp9029627-13198) [    ] o.a.s.h.a.CollectionsHandler Invoked Collection Action :create with params replicationFactor=1&collection.configName=conf1&name=collection1&nrtReplicas=1&action=CREATE&numShards=1&createNodeSet=&stateFormat=2&wt=javabin&version=2 and sendToOCPQueue=true
   [junit4]   2> 1570675 INFO  (OverseerThreadFactory-4564-thread-2) [    ] o.a.s.c.CreateCollectionCmd Create collection collection1
   [junit4]   2> 1570676 WARN  (OverseerThreadFactory-4564-thread-2) [    ] o.a.s.c.CreateCollectionCmd It is unusual to create a collection (collection1) without cores.
   [junit4]   2> 1570883 INFO  (qtp9029627-13198) [    ] o.a.s.h.a.CollectionsHandler Wait for new collection to be active for at most 30 seconds. Check all shard replicas
   [junit4]   2> 1570884 INFO  (qtp9029627-13198) [    ] o.a.s.s.HttpSolrCall [admin] webapp=null path=/admin/collections params={replicationFactor=1&collection.configName=conf1&name=collection1&nrtReplicas=1&action=CREATE&numShards=1&createNodeSet=&stateFormat=2&wt=javabin&version=2} status=0 QTime=212
   [junit4]   2> 1571472 INFO  (TEST-ChaosMonkeyNothingIsSafeTest.test-seed#[79D73AB6ACDE3985]) [    ] o.a.s.c.AbstractFullDistribZkTestBase create jetty 1 in directory C:\Users\jenkins\workspace\Lucene-Solr-master-Windows\solr\build\solr-core\test\J0\temp\solr.cloud.ChaosMonkeyNothingIsSafeTest_79D73AB6ACDE3985-001\shard-1-001 of type TLOG
   [junit4]   2> 1571473 INFO  (TEST-ChaosMonkeyNothingIsSafeTest.test-seed#[79D73AB6ACDE3985]) [    ] o.e.j.s.Server jetty-9.3.14.v20161028
   [junit4]   2> 1571475 INFO  (TEST-ChaosMonkeyNothingIsSafeTest.test-seed#[79D73AB6ACDE3985]) [    ] o.e.j.s.h.ContextHandler Started o.e.j.s.ServletContextHandler@306e32{/o_yga/wh,null,AVAILABLE}
   [junit4]   2> 1571478 INFO  (TEST-ChaosMonkeyNothingIsSafeTest.test-seed#[79D73AB6ACDE3985]) [    ] o.e.j.s.AbstractConnector Started ServerConnector@1b7a50f{HTTP/1.1,[http/1.1]}{127.0.0.1:62782}
   [junit4]   2> 1571478 INFO  (TEST-ChaosMonkeyNothingIsSafeTest.test-seed#[79D73AB6ACDE3985]) [    ] o.e.j.s.Server Started @1572299ms
   [junit4]   2> 1571478 INFO  (TEST-ChaosMonkeyNothingIsSafeTest.test-seed#[79D73AB6ACDE3985]) [    ] o.a.s.c.s.e.JettySolrRunner Jetty properties: {hostContext=/o_yga/wh, solrconfig=solrconfig.xml, solr.data.dir=C:\Users\jenkins\workspace\Lucene-Solr-master-Windows\solr\build\solr-core\test\J0\temp\solr.cloud.ChaosMonkeyNothingIsSafeTest_79D73AB6ACDE3985-001\tempDir-001/jetty1, hostPort=62782, coreRootDirectory=C:\Users\jenkins\workspace\Lucene-Solr-master-Windows\solr\build\solr-core\test\J0\..\..\..\..\..\..\..\..\..\Users\jenkins\workspace\Lucene-Solr-master-Windows\solr\build\solr-core\test\J0\temp\solr.cloud.ChaosMonkeyNothingIsSafeTest_79D73AB6ACDE3985-001\shard-1-001\cores, replicaType=TLOG}
   [junit4]   2> 1571478 ERROR (TEST-ChaosMonkeyNothingIsSafeTest.test-seed#[79D73AB6ACDE3985]) [    ] o.a.s.s.StartupLoggingUtils Missing Java Option solr.log.dir. Logging may be missing or incomplete.
   [junit4]   2> 1571479 INFO  (TEST-ChaosMonkeyNothingIsSafeTest.test-seed#[79D73AB6ACDE3985]) [    ] o.a.s.s.SolrDispatchFilter  ___      _       Welcome to Apache Solr? version 8.0.0
   [junit4]   2> 1571479 INFO  (TEST-ChaosMonkeyNothingIsSafeTest.test-seed#[79D73AB6ACDE3985]) [    ] o.a.s.s.SolrDispatchFilter / __| ___| |_ _   Starting in cloud mode on port null
   [junit4]   2> 1571479 INFO  (TEST-ChaosMonkeyNothingIsSafeTest.test-seed#[79D73AB6ACDE3985]) [    ] o.a.s.s.SolrDispatchFilter \__ \/ _ \ | '_|  Install dir: null, Default config dir: null
   [junit4]   2> 1571479 INFO  (TEST-ChaosMonkeyNothingIsSafeTest.test-seed#[79D73AB6ACDE3985]) [    ] o.a.s.s.SolrDispatchFilter |___/\___/_|_|    Start time: 2017-07-24T02:50:03.319582900Z
   [junit4]   2> 1571486 INFO  (TEST-ChaosMonkeyNothingIsSafeTest.test-seed#[79D73AB6ACDE3985]) [    ] o.a.s.s.SolrDispatchFilter Loading solr.xml from SolrHome (not found in ZooKeeper)
   [junit4]   2> 1571486 INFO  (TEST-ChaosMonkeyNothingIsSafeTest.test-seed#[79D73AB6ACDE3985]) [    ] o.a.s.c.SolrXmlConfig Loading container configuration from C:\Users\jenkins\workspace\Lucene-Solr-master-Windows\solr\build\solr-core\test\J0\temp\solr.cloud.ChaosMonkeyNothingIsSafeTest_79D73AB6ACDE3985-001\shard-1-001\solr.xml
   [junit4]   2> 1571494 INFO  (TEST-ChaosMonkeyNothingIsSafeTest.test-seed#[79D73AB6ACDE3985]) [    ] o.a.s.c.SolrXmlConfig MBean server found: com.sun.jmx.mbeanserver.JmxMBeanServer@c033e2, but no JMX reporters were configured - adding default JMX reporter.
   [junit4]   2> 1571500 INFO  (TEST-ChaosMonkeyNothingIsSafeTest.test-seed#[79D73AB6ACDE3985]) [    ] o.a.s.c.ZkContainer Zookeeper client=127.0.0.1:62724/solr
   [junit4]   2> 1571526 INFO  (TEST-ChaosMonkeyNothingIsSafeTest.test-seed#[79D73AB6ACDE3985]) [    ] o.a.s.c.c.ZkStateReader Updated live nodes from ZooKeeper... (0) -> (1)
   [junit4]   2> 1571529 INFO  (TEST-ChaosMonkeyNothingIsSafeTest.test-seed#[79D73AB6ACDE3985]) [    ] o.a.s.c.Overseer Overseer (id=null) closing
   [junit4]   2> 1571534 INFO  (TEST-ChaosMonkeyNothingIsSafeTest.test-seed#[79D73AB6ACDE3985]) [    ] o.a.s.c.ZkController Register node as live in ZooKeeper:/live_nodes/127.0.0.1:62782_o_yga%2Fwh
   [junit4]   2> 1571538 INFO  (zkCallback-1787-thread-1) [    ] o.a.s.c.c.ZkStateReader Updated live nodes from ZooKeeper... (1) -> (2)
   [junit4]   2> 1571539 INFO  (zkCallback-1792-thread-1) [    ] o.a.s.c.c.ZkStateReader Updated live nodes from ZooKeeper... (1) -> (2)
   [junit4]   2> 1571539 INFO  (zkCallback-1780-thread-1) [    ] o.a.s.c.c.ZkStateReader Updated live nodes from ZooKeeper... (1) -> (2)
   [junit4]   2> 1571708 INFO  (TEST-ChaosMonkeyNothingIsSafeTest.test-seed#[79D73AB6ACDE3985]) [    ] o.a.s.m.r.SolrJmxReporter JMX monitoring for 'solr.node' (registry 'solr.node') enabled at server: com.sun.jmx.mbeanserver.JmxMBeanServer@c033e2
   [junit4]   2> 1571718 INFO  (TEST-ChaosMonkeyNothingIsSafeTest.test-seed#[79D73AB6ACDE3985]) [    ] o.a.s.m.r.SolrJmxReporter JMX monitoring for 'solr.jvm' (registry 'solr.jvm') enabled at server: com.sun.jmx.mbeanserver.JmxMBeanServer@c033e2
   [junit4]   2> 1571718 INFO  (TEST-ChaosMonkeyNothingIsSafeTest.test-seed#[79D73AB6ACDE3985]) [    ] o.a.s.m.r.SolrJmxReporter JMX monitoring for 'solr.jetty' (registry 'solr.jetty') enabled at server: com.sun.jmx.mbeanserver.JmxMBeanServer@c033e2
   [junit4]   2> 1571722 INFO  (TEST-ChaosMonkeyNothingIsSafeTest.test-seed#[79D73AB6ACDE3985]) [    ] o.a.s.c.CorePropertiesLocator Found 0 core definitions underneath C:\Users\jenkins\workspace\Lucene-Solr-master-Windows\solr\build\solr-core\test\J0\..\..\..\..\..\..\..\..\..\Users\jenkins\workspace\Lucene-Solr-master-Windows\solr\build\solr-core\test\J0\temp\solr.cloud.ChaosMonkeyNothingIsSafeTest_79D73AB6ACDE3985-001\shard-1-001\cores
   [junit4]   2> 1571748 INFO  (qtp9029627-13192) [    ] o.a.s.h.a.CollectionsHandler Invoked Collection Action :addreplica with params node=127.0.0.1:62782_o_yga%252Fwh&action=ADDREPLICA&collection=collection1&shard=shard1&type=TLOG&wt=javabin&version=2 and sendToOCPQueue=true
   [junit4]   2> 1571751 INFO  (OverseerCollectionConfigSetProcessor-98360662339944452-127.0.0.1:62731_o_yga%2Fwh-n_0000000000) [    ] o.a.s.c.OverseerTaskQueue Response ZK path: /overseer/collection-queue-work/qnr-0000000002 doesn't exist.  Requestor may have disconnected from ZooKeeper
   [junit4]   2> 1571752 INFO  (OverseerThreadFactory-4564-thread-3) [    ] o.a.s.c.AddReplicaCmd Node Identified 127.0.0.1:62782_o_yga%2Fwh for creating new replica
   [junit4]   2> 1571756 INFO  (qtp30944285-13236) [    ] o.a.s.h.a.CoreAdminOperation core create command qt=/admin/cores&collection.configName=conf1&name=collection1_shard1_replica_t1&action=CREATE&collection=collection1&shard=shard1&wt=javabin&version=2&replicaType=TLOG
   [junit4]   2> 1571756 INFO  (qtp30944285-13236) [    ] o.a.s.c.TransientSolrCoreCacheDefault Allocating transient cache for 4 transient cores
   [junit4]   2> 1571865 INFO  (zkCallback-1792-thread-1) [    ] o.a.s.c.c.ZkStateReader A cluster state change: [WatchedEvent state:SyncConnected type:NodeDataChanged path:/collections/collection1/state.json] for collection [collection1] has occurred - updating... (live nodes size: [2])
   [junit4]   2> 1572774 INFO  (qtp30944285-13236) [    ] o.a.s.c.SolrConfig Using Lucene MatchVersion: 8.0.0
   [junit4]   2> 1572787 INFO  (qtp30944285-13236) [    ] o.a.s.s.IndexSchema [collection1_shard1_replica_t1] Schema name=test
   [junit4]   2> 1572849 INFO  (qtp30944285-13236) [    ] o.a.s.s.IndexSchema Loaded schema test/1.6 with uniqueid field id
   [junit4]   2> 1572873 INFO  (qtp30944285-13236) [    ] o.a.s.c.CoreContainer Creating SolrCore 'collection1_shard1_replica_t1' using configuration from collection collection1, trusted=true
   [junit4]   2> 1572874 INFO  (qtp30944285-13236) [    ] o.a.s.m.r.SolrJmxReporter JMX monitoring for 'solr.core.collection1.shard1.replica_t1' (registry 'solr.core.collection1.shard1.replica_t1') enabled at server: com.sun.jmx.mbeanserver.JmxMBeanServer@c033e2
   [junit4]   2> 1572874 INFO  (qtp30944285-13236) [    ] o.a.s.c.SolrCore solr.RecoveryStrategy.Builder
   [junit4]   2> 1572874 INFO  (qtp30944285-13236) [    ] o.a.s.c.SolrCore [[collection1_shard1_replica_t1] ] Opening new SolrCore at [C:\Users\jenkins\workspace\Lucene-Solr-master-Windows\solr\build\solr-core\test\J0\temp\solr.cloud.ChaosMonkeyNothingIsSafeTest_79D73AB6ACDE3985-001\shard-1-001\cores\collection1_shard1_replica_t1], dataDir=[C:\Users\jenkins\workspace\Lucene-Solr-master-Windows\solr\build\solr-core\test\J0\..\..\..\..\..\..\..\..\..\Users\jenkins\workspace\Lucene-Solr-master-Windows\solr\build\solr-core\test\J0\temp\solr.cloud.ChaosMonkeyNothingIsSafeTest_79D73AB6ACDE3985-001\shard-1-001\cores\collection1_shard1_replica_t1\data\]
   [junit4]   2> 1572884 INFO  (qtp30944285-13236) [    ] o.a.s.u.RandomMergePolicy RandomMergePolicy wrapping class org.apache.lucene.index.LogByteSizeMergePolicy: [LogByteSizeMergePolicy: minMergeSize=1677721, mergeFactor=30, maxMergeSize=2147483648, maxMergeSizeForForcedMerge=9223372036854775807, calibrateSizeByDeletes=true, maxMergeDocs=2147483647, maxCFSSegmentSizeMB=8.796093022207999E12, noCFSRatio=1.0]
   [junit4]   2> 1572891 WARN  (qtp30944285-13236) [    ] o.a.s.c.RequestHandlers INVALID paramSet a in requestHandler {type = requestHandler,name = /dump,class = DumpRequestHandler,attributes = {initParams=a, name=/dump, class=DumpRequestHandler},args = {defaults={a=A,b=B}}}
   [junit4]   2> 1572998 INFO  (qtp30944285-13236) [    ] o.a.s.u.UpdateHandler Using UpdateLog implementation: org.apache.solr.update.UpdateLog
   [junit4]   2> 1572999 INFO  (qtp30944285-1

[...truncated too long message...]

349)
   [junit4]    >         at app//org.apache.zookeeper.ClientCnxn$SendThread.run(ClientCnxn.java:1141)
   [junit4]    >    8) Thread[id=13228, name=Connection evictor, state=TIMED_WAITING, group=TGRP-ChaosMonkeyNothingIsSafeTest]
   [junit4]    >         at java.base@9/java.lang.Thread.sleep(Native Method)
   [junit4]    >         at app//org.apache.http.impl.client.IdleConnectionEvictor$1.run(IdleConnectionEvictor.java:66)
   [junit4]    >         at java.base@9/java.lang.Thread.run(Thread.java:844)
   [junit4]    >    9) Thread[id=13357, name=zkCallback-1787-thread-2, state=TIMED_WAITING, group=TGRP-ChaosMonkeyNothingIsSafeTest]
   [junit4]    >         at java.base@9/jdk.internal.misc.Unsafe.park(Native Method)
   [junit4]    >         at java.base@9/java.util.concurrent.locks.LockSupport.parkNanos(LockSupport.java:234)
   [junit4]    >         at java.base@9/java.util.concurrent.SynchronousQueue$TransferStack.awaitFulfill(SynchronousQueue.java:462)
   [junit4]    >         at java.base@9/java.util.concurrent.SynchronousQueue$TransferStack.transfer(SynchronousQueue.java:361)
   [junit4]    >         at java.base@9/java.util.concurrent.SynchronousQueue.poll(SynchronousQueue.java:937)
   [junit4]    >         at java.base@9/java.util.concurrent.ThreadPoolExecutor.getTask(ThreadPoolExecutor.java:1085)
   [junit4]    >         at java.base@9/java.util.concurrent.ThreadPoolExecutor.runWorker(ThreadPoolExecutor.java:1146)
   [junit4]    >         at java.base@9/java.util.concurrent.ThreadPoolExecutor$Worker.run(ThreadPoolExecutor.java:635)
   [junit4]    >         at java.base@9/java.lang.Thread.run(Thread.java:844)
   [junit4]    > 	at __randomizedtesting.SeedInfo.seed([79D73AB6ACDE3985]:0)Throwable #2: com.carrotsearch.randomizedtesting.ThreadLeakError: There are still zombie threads that couldn't be terminated:
   [junit4]    >    1) Thread[id=13370, name=zkCallback-1787-thread-4, state=TIMED_WAITING, group=TGRP-ChaosMonkeyNothingIsSafeTest]
   [junit4]    >         at java.base@9/jdk.internal.misc.Unsafe.park(Native Method)
   [junit4]    >         at java.base@9/java.util.concurrent.locks.LockSupport.parkNanos(LockSupport.java:234)
   [junit4]    >         at java.base@9/java.util.concurrent.SynchronousQueue$TransferStack.awaitFulfill(SynchronousQueue.java:462)
   [junit4]    >         at java.base@9/java.util.concurrent.SynchronousQueue$TransferStack.transfer(SynchronousQueue.java:361)
   [junit4]    >         at java.base@9/java.util.concurrent.SynchronousQueue.poll(SynchronousQueue.java:937)
   [junit4]    >         at java.base@9/java.util.concurrent.ThreadPoolExecutor.getTask(ThreadPoolExecutor.java:1085)
   [junit4]    >         at java.base@9/java.util.concurrent.ThreadPoolExecutor.runWorker(ThreadPoolExecutor.java:1146)
   [junit4]    >         at java.base@9/java.util.concurrent.ThreadPoolExecutor$Worker.run(ThreadPoolExecutor.java:635)
   [junit4]    >         at java.base@9/java.lang.Thread.run(Thread.java:844)
   [junit4]    >    2) Thread[id=13421, name=zkCallback-1787-thread-5, state=TIMED_WAITING, group=TGRP-ChaosMonkeyNothingIsSafeTest]
   [junit4]    >         at java.base@9/jdk.internal.misc.Unsafe.park(Native Method)
   [junit4]    >         at java.base@9/java.util.concurrent.locks.LockSupport.parkNanos(LockSupport.java:234)
   [junit4]    >         at java.base@9/java.util.concurrent.SynchronousQueue$TransferStack.awaitFulfill(SynchronousQueue.java:462)
   [junit4]    >         at java.base@9/java.util.concurrent.SynchronousQueue$TransferStack.transfer(SynchronousQueue.java:361)
   [junit4]    >         at java.base@9/java.util.concurrent.SynchronousQueue.poll(SynchronousQueue.java:937)
   [junit4]    >         at java.base@9/java.util.concurrent.ThreadPoolExecutor.getTask(ThreadPoolExecutor.java:1085)
   [junit4]    >         at java.base@9/java.util.concurrent.ThreadPoolExecutor.runWorker(ThreadPoolExecutor.java:1146)
   [junit4]    >         at java.base@9/java.util.concurrent.ThreadPoolExecutor$Worker.run(ThreadPoolExecutor.java:635)
   [junit4]    >         at java.base@9/java.lang.Thread.run(Thread.java:844)
   [junit4]    >    3) Thread[id=13231, name=zkCallback-1787-thread-1, state=TIMED_WAITING, group=TGRP-ChaosMonkeyNothingIsSafeTest]
   [junit4]    >         at java.base@9/jdk.internal.misc.Unsafe.park(Native Method)
   [junit4]    >         at java.base@9/java.util.concurrent.locks.LockSupport.parkNanos(LockSupport.java:234)
   [junit4]    >         at java.base@9/java.util.concurrent.SynchronousQueue$TransferStack.awaitFulfill(SynchronousQueue.java:462)
   [junit4]    >         at java.base@9/java.util.concurrent.SynchronousQueue$TransferStack.transfer(SynchronousQueue.java:361)
   [junit4]    >         at java.base@9/java.util.concurrent.SynchronousQueue.poll(SynchronousQueue.java:937)
   [junit4]    >         at java.base@9/java.util.concurrent.ThreadPoolExecutor.getTask(ThreadPoolExecutor.java:1085)
   [junit4]    >         at java.base@9/java.util.concurrent.ThreadPoolExecutor.runWorker(ThreadPoolExecutor.java:1146)
   [junit4]    >         at java.base@9/java.util.concurrent.ThreadPoolExecutor$Worker.run(ThreadPoolExecutor.java:635)
   [junit4]    >         at java.base@9/java.lang.Thread.run(Thread.java:844)
   [junit4]    >    4) Thread[id=13422, name=zkCallback-1787-thread-6, state=TIMED_WAITING, group=TGRP-ChaosMonkeyNothingIsSafeTest]
   [junit4]    >         at java.base@9/jdk.internal.misc.Unsafe.park(Native Method)
   [junit4]    >         at java.base@9/java.util.concurrent.locks.LockSupport.parkNanos(LockSupport.java:234)
   [junit4]    >         at java.base@9/java.util.concurrent.SynchronousQueue$TransferStack.awaitFulfill(SynchronousQueue.java:462)
   [junit4]    >         at java.base@9/java.util.concurrent.SynchronousQueue$TransferStack.transfer(SynchronousQueue.java:361)
   [junit4]    >         at java.base@9/java.util.concurrent.SynchronousQueue.poll(SynchronousQueue.java:937)
   [junit4]    >         at java.base@9/java.util.concurrent.ThreadPoolExecutor.getTask(ThreadPoolExecutor.java:1085)
   [junit4]    >         at java.base@9/java.util.concurrent.ThreadPoolExecutor.runWorker(ThreadPoolExecutor.java:1146)
   [junit4]    >         at java.base@9/java.util.concurrent.ThreadPoolExecutor$Worker.run(ThreadPoolExecutor.java:635)
   [junit4]    >         at java.base@9/java.lang.Thread.run(Thread.java:844)
   [junit4]    >    5) Thread[id=13369, name=zkCallback-1787-thread-3, state=TIMED_WAITING, group=TGRP-ChaosMonkeyNothingIsSafeTest]
   [junit4]    >         at java.base@9/jdk.internal.misc.Unsafe.park(Native Method)
   [junit4]    >         at java.base@9/java.util.concurrent.locks.LockSupport.parkNanos(LockSupport.java:234)
   [junit4]    >         at java.base@9/java.util.concurrent.SynchronousQueue$TransferStack.awaitFulfill(SynchronousQueue.java:462)
   [junit4]    >         at java.base@9/java.util.concurrent.SynchronousQueue$TransferStack.transfer(SynchronousQueue.java:361)
   [junit4]    >         at java.base@9/java.util.concurrent.SynchronousQueue.poll(SynchronousQueue.java:937)
   [junit4]    >         at java.base@9/java.util.concurrent.ThreadPoolExecutor.getTask(ThreadPoolExecutor.java:1085)
   [junit4]    >         at java.base@9/java.util.concurrent.ThreadPoolExecutor.runWorker(ThreadPoolExecutor.java:1146)
   [junit4]    >         at java.base@9/java.util.concurrent.ThreadPoolExecutor$Worker.run(ThreadPoolExecutor.java:635)
   [junit4]    >         at java.base@9/java.lang.Thread.run(Thread.java:844)
   [junit4]    >    6) Thread[id=13229, name=TEST-ChaosMonkeyNothingIsSafeTest.test-seed#[79D73AB6ACDE3985]-SendThread(127.0.0.1:62724), state=RUNNABLE, group=TGRP-ChaosMonkeyNothingIsSafeTest]
   [junit4]    >         at java.base@9/sun.nio.ch.WindowsSelectorImpl$SubSelector.poll0(Native Method)
   [junit4]    >         at java.base@9/sun.nio.ch.WindowsSelectorImpl$SubSelector.poll(WindowsSelectorImpl.java:296)
   [junit4]    >         at java.base@9/sun.nio.ch.WindowsSelectorImpl$SubSelector.access$400(WindowsSelectorImpl.java:278)
   [junit4]    >         at java.base@9/sun.nio.ch.WindowsSelectorImpl.doSelect(WindowsSelectorImpl.java:159)
   [junit4]    >         at java.base@9/sun.nio.ch.SelectorImpl.lockAndDoSelect(SelectorImpl.java:86)
   [junit4]    >         at java.base@9/sun.nio.ch.SelectorImpl.select(SelectorImpl.java:97)
   [junit4]    >         at app//org.apache.zookeeper.ClientCnxnSocketNIO.doTransport(ClientCnxnSocketNIO.java:349)
   [junit4]    >         at app//org.apache.zookeeper.ClientCnxn$SendThread.run(ClientCnxn.java:1141)
   [junit4]    >    7) Thread[id=13357, name=zkCallback-1787-thread-2, state=TIMED_WAITING, group=TGRP-ChaosMonkeyNothingIsSafeTest]
   [junit4]    >         at java.base@9/jdk.internal.misc.Unsafe.park(Native Method)
   [junit4]    >         at java.base@9/java.util.concurrent.locks.LockSupport.parkNanos(LockSupport.java:234)
   [junit4]    >         at java.base@9/java.util.concurrent.SynchronousQueue$TransferStack.awaitFulfill(SynchronousQueue.java:462)
   [junit4]    >         at java.base@9/java.util.concurrent.SynchronousQueue$TransferStack.transfer(SynchronousQueue.java:361)
   [junit4]    >         at java.base@9/java.util.concurrent.SynchronousQueue.poll(SynchronousQueue.java:937)
   [junit4]    >         at java.base@9/java.util.concurrent.ThreadPoolExecutor.getTask(ThreadPoolExecutor.java:1085)
   [junit4]    >         at java.base@9/java.util.concurrent.ThreadPoolExecutor.runWorker(ThreadPoolExecutor.java:1146)
   [junit4]    >         at java.base@9/java.util.concurrent.ThreadPoolExecutor$Worker.run(ThreadPoolExecutor.java:635)
   [junit4]    >         at java.base@9/java.lang.Thread.run(Thread.java:844)
   [junit4]    > 	at __randomizedtesting.SeedInfo.seed([79D73AB6ACDE3985]:0)
   [junit4] Completed [324/727 (2!)] on J0 in 77.71s, 1 test, 3 errors <<< FAILURES!

[...truncated 37670 lines...]