You are viewing a plain text version of this content. The canonical link for it is here.
Posted to builds@mesos.apache.org by Apache Jenkins Server <je...@builds.apache.org> on 2017/08/25 23:17:19 UTC

Build failed in Jenkins: Mesos-Buildbot » cmake,gcc,--verbose --enable-libevent --enable-ssl,GLOG_v=1 MESOS_VERBOSE=1,ubuntu:14.04,(ubuntu)&&(!ubuntu-us1)&&(!ubuntu-eu2) #4159

See <https://builds.apache.org/job/Mesos-Buildbot/BUILDTOOL=cmake,COMPILER=gcc,CONFIGURATION=--verbose%20--enable-libevent%20--enable-ssl,ENVIRONMENT=GLOG_v=1%20MESOS_VERBOSE=1,OS=ubuntu%3A14.04,label_exp=(ubuntu)&&(!ubuntu-us1)&&(!ubuntu-eu2)/4159/display/redirect?page=changes>

Changes:

[mpark] Added port mappings in `NetworkInfo` as part of `state` endpoints.

------------------------------------------
[...truncated 30.17 MB...]
I0825 23:17:12.598975 10795 slave.cpp:6264] Finished recovery
I0825 23:17:12.599539 10795 slave.cpp:6446] Querying resource estimator for oversubscribable resources
I0825 23:17:12.599745 10799 slave.cpp:6460] Received oversubscribable resources {} from the resource estimator
I0825 23:17:12.602077 10794 process.cpp:3933] Handling HTTP event for process 'slave(806)' with path: '/slave(806)/containers'
I0825 23:17:12.603642 10781 http.cpp:1185] HTTP GET for /slave(806)/containers from 172.17.0.8:59382
I0825 23:17:12.603729 10781 http.cpp:976] Authorizing principal 'test-principal' to GET the '/containers' endpoint
I0825 23:17:12.606866 10792 slave.cpp:859] Agent terminating
[       OK ] Endpoint/SlaveEndpointTest.AuthorizedRequest/2 (28 ms)
[ RUN      ] Endpoint/SlaveEndpointTest.UnauthorizedRequest/0
I0825 23:17:12.617568  2766 containerizer.cpp:288] Using isolation { environment_secret, posix/cpu, posix/mem, filesystem/posix, network/cni }
W0825 23:17:12.618028  2766 backend.cpp:76] Failed to create 'aufs' backend: AufsBackend requires root privileges
W0825 23:17:12.618129  2766 backend.cpp:76] Failed to create 'bind' backend: BindBackend requires root privileges
I0825 23:17:12.618157  2766 provisioner.cpp:255] Using default backend 'copy'
I0825 23:17:12.621547 10785 slave.cpp:252] Mesos agent started on (807)@172.17.0.8:45365
I0825 23:17:12.621564 10785 slave.cpp:253] Flags at startup: --acls="" --appc_simple_discovery_uri_prefix="http://" --appc_store_dir="/tmp/Endpoint_SlaveEndpointTest_UnauthorizedRequest_0_aLueKi/store/appc" --authenticate_http_executors="true" --authenticate_http_readonly="true" --authenticate_http_readwrite="true" --authenticatee="crammd5" --authentication_backoff_factor="1secs" --authorizer="local" --cgroups_cpu_enable_pids_and_tids_count="false" --cgroups_enable_cfs="false" --cgroups_hierarchy="/sys/fs/cgroup" --cgroups_limit_swap="false" --cgroups_root="mesos" --container_disk_watch_interval="15secs" --containerizers="mesos" --credential="/tmp/Endpoint_SlaveEndpointTest_UnauthorizedRequest_0_aLueKi/credential" --default_role="*" --disallow_sharing_agent_pid_namespace="false" --disk_watch_interval="1mins" --docker="docker" --docker_kill_orphans="true" --docker_registry="https://registry-1.docker.io" --docker_remove_delay="6hrs" --docker_socket="/var/run/docker.sock" --docker_stop_timeout="0ns" --docker_store_dir="/tmp/Endpoint_SlaveEndpointTest_UnauthorizedRequest_0_aLueKi/store/docker" --docker_volume_checkpoint_dir="/var/run/mesos/isolators/docker/volume" --enforce_container_disk_quota="false" --executor_registration_timeout="1mins" --executor_reregistration_timeout="2secs" --executor_secret_key="/tmp/Endpoint_SlaveEndpointTest_UnauthorizedRequest_0_aLueKi/executor_secret_key" --executor_shutdown_grace_period="5secs" --fetcher_cache_dir="/tmp/Endpoint_SlaveEndpointTest_UnauthorizedRequest_0_aLueKi/fetch" --fetcher_cache_size="2GB" --frameworks_home="" --gc_delay="1weeks" --gc_disk_headroom="0.1" --hadoop_home="" --help="false" --hostname_lookup="true" --http_command_executor="false" --http_credentials="/tmp/Endpoint_SlaveEndpointTest_UnauthorizedRequest_0_aLueKi/http_credentials" --http_heartbeat_interval="30secs" --initialize_driver_logging="true" --isolation="posix/cpu,posix/mem" --launcher="posix" --launcher_dir="/mesos/build/src" --logbufsecs="0" --logging_level="INFO" --max_completed_executors_per_framework="150" --oversubscribed_resources_interval="15secs" --perf_duration="10secs" --perf_interval="1mins" --port="5051" --qos_correction_interval_min="0ns" --quiet="false" --recover="reconnect" --recovery_timeout="15mins" --registration_backoff_factor="10ms" --resources="cpus:2;gpus:0;mem:1024;disk:1024;ports:[31000-32000]" --revocable_cpu_low_priority="true" --runtime_dir="/tmp/Endpoint_SlaveEndpointTest_UnauthorizedRequest_0_aLueKi" --sandbox_directory="/mnt/mesos/sandbox" --strict="true" --switch_user="true" --systemd_enable_support="true" --systemd_runtime_directory="/run/systemd/system" --version="false" --work_dir="/tmp/Endpoint_SlaveEndpointTest_UnauthorizedRequest_0_3JBxzd"
I0825 23:17:12.621906 10785 credentials.hpp:86] Loading credential for authentication from '/tmp/Endpoint_SlaveEndpointTest_UnauthorizedRequest_0_aLueKi/credential'
I0825 23:17:12.622032 10785 slave.cpp:285] Agent using credential for: test-principal
I0825 23:17:12.622053 10785 credentials.hpp:37] Loading credentials for authentication from '/tmp/Endpoint_SlaveEndpointTest_UnauthorizedRequest_0_aLueKi/http_credentials'
I0825 23:17:12.622339 10785 http.cpp:1045] Creating default 'basic' HTTP authenticator for realm 'mesos-agent-executor'
I0825 23:17:12.622453 10785 http.cpp:1066] Creating default 'jwt' HTTP authenticator for realm 'mesos-agent-executor'
I0825 23:17:12.622648 10785 http.cpp:1045] Creating default 'basic' HTTP authenticator for realm 'mesos-agent-readonly'
I0825 23:17:12.622735 10785 http.cpp:1066] Creating default 'jwt' HTTP authenticator for realm 'mesos-agent-readonly'
I0825 23:17:12.622902 10785 http.cpp:1045] Creating default 'basic' HTTP authenticator for realm 'mesos-agent-readwrite'
I0825 23:17:12.622992 10785 http.cpp:1066] Creating default 'jwt' HTTP authenticator for realm 'mesos-agent-readwrite'
I0825 23:17:12.624282 10785 slave.cpp:581] Agent resources: [{"name":"cpus","scalar":{"value":2.0},"type":"SCALAR"},{"name":"mem","scalar":{"value":1024.0},"type":"SCALAR"},{"name":"disk","scalar":{"value":1024.0},"type":"SCALAR"},{"name":"ports","ranges":{"range":[{"begin":31000,"end":32000}]},"type":"RANGES"}]
I0825 23:17:12.624452 10785 slave.cpp:589] Agent attributes: [  ]
I0825 23:17:12.624461 10785 slave.cpp:598] Agent hostname: bda2f98b0a60
I0825 23:17:12.624600 10783 status_update_manager.cpp:177] Pausing sending status updates
I0825 23:17:12.626098 10802 state.cpp:64] Recovering state from '/tmp/Endpoint_SlaveEndpointTest_UnauthorizedRequest_0_3JBxzd/meta'
I0825 23:17:12.626384 10798 status_update_manager.cpp:203] Recovering status update manager
I0825 23:17:12.626565 10803 containerizer.cpp:643] Recovering containerizer
I0825 23:17:12.627787 10793 provisioner.cpp:416] Provisioner recovery complete
I0825 23:17:12.628113 10785 slave.cpp:6264] Finished recovery
I0825 23:17:12.628581 10785 slave.cpp:6446] Querying resource estimator for oversubscribable resources
I0825 23:17:12.628805 10791 slave.cpp:6460] Received oversubscribable resources {} from the resource estimator
I0825 23:17:12.630820 10788 process.cpp:3933] Handling HTTP event for process 'slave(807)' with path: '/slave(807)/monitor/statistics'
I0825 23:17:12.632374 10798 http.cpp:1185] HTTP GET for /slave(807)/monitor/statistics from 172.17.0.8:59384
I0825 23:17:12.632459 10798 http.cpp:976] Authorizing principal 'test-principal' to GET the '/monitor/statistics' endpoint
I0825 23:17:12.633920 10801 slave.cpp:859] Agent terminating
[       OK ] Endpoint/SlaveEndpointTest.UnauthorizedRequest/0 (27 ms)
[ RUN      ] Endpoint/SlaveEndpointTest.UnauthorizedRequest/1
I0825 23:17:12.644527  2766 containerizer.cpp:288] Using isolation { environment_secret, posix/cpu, posix/mem, filesystem/posix, network/cni }
W0825 23:17:12.644971  2766 backend.cpp:76] Failed to create 'aufs' backend: AufsBackend requires root privileges
W0825 23:17:12.645067  2766 backend.cpp:76] Failed to create 'bind' backend: BindBackend requires root privileges
I0825 23:17:12.645094  2766 provisioner.cpp:255] Using default backend 'copy'
I0825 23:17:12.648370 10800 slave.cpp:252] Mesos agent started on (808)@172.17.0.8:45365
I0825 23:17:12.648393 10800 slave.cpp:253] Flags at startup: --acls="" --appc_simple_discovery_uri_prefix="http://" --appc_store_dir="/tmp/Endpoint_SlaveEndpointTest_UnauthorizedRequest_1_w0vMED/store/appc" --authenticate_http_executors="true" --authenticate_http_readonly="true" --authenticate_http_readwrite="true" --authenticatee="crammd5" --authentication_backoff_factor="1secs" --authorizer="local" --cgroups_cpu_enable_pids_and_tids_count="false" --cgroups_enable_cfs="false" --cgroups_hierarchy="/sys/fs/cgroup" --cgroups_limit_swap="false" --cgroups_root="mesos" --container_disk_watch_interval="15secs" --containerizers="mesos" --credential="/tmp/Endpoint_SlaveEndpointTest_UnauthorizedRequest_1_w0vMED/credential" --default_role="*" --disallow_sharing_agent_pid_namespace="false" --disk_watch_interval="1mins" --docker="docker" --docker_kill_orphans="true" --docker_registry="https://registry-1.docker.io" --docker_remove_delay="6hrs" --docker_socket="/var/run/docker.sock" --docker_stop_timeout="0ns" --docker_store_dir="/tmp/Endpoint_SlaveEndpointTest_UnauthorizedRequest_1_w0vMED/store/docker" --docker_volume_checkpoint_dir="/var/run/mesos/isolators/docker/volume" --enforce_container_disk_quota="false" --executor_registration_timeout="1mins" --executor_reregistration_timeout="2secs" --executor_secret_key="/tmp/Endpoint_SlaveEndpointTest_UnauthorizedRequest_1_w0vMED/executor_secret_key" --executor_shutdown_grace_period="5secs" --fetcher_cache_dir="/tmp/Endpoint_SlaveEndpointTest_UnauthorizedRequest_1_w0vMED/fetch" --fetcher_cache_size="2GB" --frameworks_home="" --gc_delay="1weeks" --gc_disk_headroom="0.1" --hadoop_home="" --help="false" --hostname_lookup="true" --http_command_executor="false" --http_credentials="/tmp/Endpoint_SlaveEndpointTest_UnauthorizedRequest_1_w0vMED/http_credentials" --http_heartbeat_interval="30secs" --initialize_driver_logging="true" --isolation="posix/cpu,posix/mem" --launcher="posix" --launcher_dir="/mesos/build/src" --logbufsecs="0" --logging_level="INFO" --max_completed_executors_per_framework="150" --oversubscribed_resources_interval="15secs" --perf_duration="10secs" --perf_interval="1mins" --port="5051" --qos_correction_interval_min="0ns" --quiet="false" --recover="reconnect" --recovery_timeout="15mins" --registration_backoff_factor="10ms" --resources="cpus:2;gpus:0;mem:1024;disk:1024;ports:[31000-32000]" --revocable_cpu_low_priority="true" --runtime_dir="/tmp/Endpoint_SlaveEndpointTest_UnauthorizedRequest_1_w0vMED" --sandbox_directory="/mnt/mesos/sandbox" --strict="true" --switch_user="true" --systemd_enable_support="true" --systemd_runtime_directory="/run/systemd/system" --version="false" --work_dir="/tmp/Endpoint_SlaveEndpointTest_UnauthorizedRequest_1_JBF3py"
I0825 23:17:12.648799 10800 credentials.hpp:86] Loading credential for authentication from '/tmp/Endpoint_SlaveEndpointTest_UnauthorizedRequest_1_w0vMED/credential'
I0825 23:17:12.648948 10800 slave.cpp:285] Agent using credential for: test-principal
I0825 23:17:12.648965 10800 credentials.hpp:37] Loading credentials for authentication from '/tmp/Endpoint_SlaveEndpointTest_UnauthorizedRequest_1_w0vMED/http_credentials'
I0825 23:17:12.649210 10800 http.cpp:1045] Creating default 'basic' HTTP authenticator for realm 'mesos-agent-executor'
I0825 23:17:12.649324 10800 http.cpp:1066] Creating default 'jwt' HTTP authenticator for realm 'mesos-agent-executor'
I0825 23:17:12.649497 10800 http.cpp:1045] Creating default 'basic' HTTP authenticator for realm 'mesos-agent-readonly'
I0825 23:17:12.649586 10800 http.cpp:1066] Creating default 'jwt' HTTP authenticator for realm 'mesos-agent-readonly'
I0825 23:17:12.649766 10800 http.cpp:1045] Creating default 'basic' HTTP authenticator for realm 'mesos-agent-readwrite'
I0825 23:17:12.649855 10800 http.cpp:1066] Creating default 'jwt' HTTP authenticator for realm 'mesos-agent-readwrite'
I0825 23:17:12.651178 10800 slave.cpp:581] Agent resources: [{"name":"cpus","scalar":{"value":2.0},"type":"SCALAR"},{"name":"mem","scalar":{"value":1024.0},"type":"SCALAR"},{"name":"disk","scalar":{"value":1024.0},"type":"SCALAR"},{"name":"ports","ranges":{"range":[{"begin":31000,"end":32000}]},"type":"RANGES"}]
I0825 23:17:12.651355 10800 slave.cpp:589] Agent attributes: [  ]
I0825 23:17:12.651368 10800 slave.cpp:598] Agent hostname: bda2f98b0a60
I0825 23:17:12.651512 10785 status_update_manager.cpp:177] Pausing sending status updates
I0825 23:17:12.652833 10791 state.cpp:64] Recovering state from '/tmp/Endpoint_SlaveEndpointTest_UnauthorizedRequest_1_JBF3py/meta'
I0825 23:17:12.653091 10794 status_update_manager.cpp:203] Recovering status update manager
I0825 23:17:12.653250 10799 containerizer.cpp:643] Recovering containerizer
I0825 23:17:12.654507 10801 provisioner.cpp:416] Provisioner recovery complete
I0825 23:17:12.654825 10786 slave.cpp:6264] Finished recovery
I0825 23:17:12.655299 10786 slave.cpp:6446] Querying resource estimator for oversubscribable resources
I0825 23:17:12.655530 10790 slave.cpp:6460] Received oversubscribable resources {} from the resource estimator
I0825 23:17:12.657871 10780 process.cpp:3933] Handling HTTP event for process 'slave(808)' with path: '/slave(808)/monitor/statistics.json'
I0825 23:17:12.659358 10791 http.cpp:1185] HTTP GET for /slave(808)/monitor/statistics.json from 172.17.0.8:59386
I0825 23:17:12.659425 10791 http.cpp:976] Authorizing principal 'test-principal' to GET the '/monitor/statistics.json' endpoint
I0825 23:17:12.660953  2766 slave.cpp:859] Agent terminating
[       OK ] Endpoint/SlaveEndpointTest.UnauthorizedRequest/1 (27 ms)
[ RUN      ] Endpoint/SlaveEndpointTest.UnauthorizedRequest/2
I0825 23:17:12.671511  2766 containerizer.cpp:288] Using isolation { environment_secret, posix/cpu, posix/mem, filesystem/posix, network/cni }
W0825 23:17:12.671972  2766 backend.cpp:76] Failed to create 'aufs' backend: AufsBackend requires root privileges
W0825 23:17:12.672070  2766 backend.cpp:76] Failed to create 'bind' backend: BindBackend requires root privileges
I0825 23:17:12.672096  2766 provisioner.cpp:255] Using default backend 'copy'
I0825 23:17:12.675453 10789 slave.cpp:252] Mesos agent started on (809)@172.17.0.8:45365
I0825 23:17:12.675475 10789 slave.cpp:253] Flags at startup: --acls="" --appc_simple_discovery_uri_prefix="http://" --appc_store_dir="/tmp/Endpoint_SlaveEndpointTest_UnauthorizedRequest_2_BNqjPY/store/appc" --authenticate_http_executors="true" --authenticate_http_readonly="true" --authenticate_http_readwrite="true" --authenticatee="crammd5" --authentication_backoff_factor="1secs" --authorizer="local" --cgroups_cpu_enable_pids_and_tids_count="false" --cgroups_enable_cfs="false" --cgroups_hierarchy="/sys/fs/cgroup" --cgroups_limit_swap="false" --cgroups_root="mesos" --container_disk_watch_interval="15secs" --containerizers="mesos" --credential="/tmp/Endpoint_SlaveEndpointTest_UnauthorizedRequest_2_BNqjPY/credential" --default_role="*" --disallow_sharing_agent_pid_namespace="false" --disk_watch_interval="1mins" --docker="docker" --docker_kill_orphans="true" --docker_registry="https://registry-1.docker.io" --docker_remove_delay="6hrs" --docker_socket="/var/run/docker.sock" --docker_stop_timeout="0ns" --docker_store_dir="/tmp/Endpoint_SlaveEndpointTest_UnauthorizedRequest_2_BNqjPY/store/docker" --docker_volume_checkpoint_dir="/var/run/mesos/isolators/docker/volume" --enforce_container_disk_quota="false" --executor_registration_timeout="1mins" --executor_reregistration_timeout="2secs" --executor_secret_key="/tmp/Endpoint_SlaveEndpointTest_UnauthorizedRequest_2_BNqjPY/executor_secret_key" --executor_shutdown_grace_period="5secs" --fetcher_cache_dir="/tmp/Endpoint_SlaveEndpointTest_UnauthorizedRequest_2_BNqjPY/fetch" --fetcher_cache_size="2GB" --frameworks_home="" --gc_delay="1weeks" --gc_disk_headroom="0.1" --hadoop_home="" --help="false" --hostname_lookup="true" --http_command_executor="false" --http_credentials="/tmp/Endpoint_SlaveEndpointTest_UnauthorizedRequest_2_BNqjPY/http_credentials" --http_heartbeat_interval="30secs" --initialize_driver_logging="true" --isolation="posix/cpu,posix/mem" --launcher="posix" --launcher_dir="/mesos/build/src" --logbufsecs="0" --logging_level="INFO" --max_completed_executors_per_framework="150" --oversubscribed_resources_interval="15secs" --perf_duration="10secs" --perf_interval="1mins" --port="5051" --qos_correction_interval_min="0ns" --quiet="false" --recover="reconnect" --recovery_timeout="15mins" --registration_backoff_factor="10ms" --resources="cpus:2;gpus:0;mem:1024;disk:1024;ports:[31000-32000]" --revocable_cpu_low_priority="true" --runtime_dir="/tmp/Endpoint_SlaveEndpointTest_UnauthorizedRequest_2_BNqjPY" --sandbox_directory="/mnt/mesos/sandbox" --strict="true" --switch_user="true" --systemd_enable_support="true" --systemd_runtime_directory="/run/systemd/system" --version="false" --work_dir="/tmp/Endpoint_SlaveEndpointTest_UnauthorizedRequest_2_9kaAwT"
I0825 23:17:12.675917 10789 credentials.hpp:86] Loading credential for authentication from '/tmp/Endpoint_SlaveEndpointTest_UnauthorizedRequest_2_BNqjPY/credential'
I0825 23:17:12.676092 10789 slave.cpp:285] Agent using credential for: test-principal
I0825 23:17:12.676107 10789 credentials.hpp:37] Loading credentials for authentication from '/tmp/Endpoint_SlaveEndpointTest_UnauthorizedRequest_2_BNqjPY/http_credentials'
I0825 23:17:12.676370 10789 http.cpp:1045] Creating default 'basic' HTTP authenticator for realm 'mesos-agent-executor'
I0825 23:17:12.676507 10789 http.cpp:1066] Creating default 'jwt' HTTP authenticator for realm 'mesos-agent-executor'
I0825 23:17:12.676702 10789 http.cpp:1045] Creating default 'basic' HTTP authenticator for realm 'mesos-agent-readonly'
I0825 23:17:12.676787 10789 http.cpp:1066] Creating default 'jwt' HTTP authenticator for realm 'mesos-agent-readonly'
I0825 23:17:12.676952 10789 http.cpp:1045] Creating default 'basic' HTTP authenticator for realm 'mesos-agent-readwrite'
I0825 23:17:12.677042 10789 http.cpp:1066] Creating default 'jwt' HTTP authenticator for realm 'mesos-agent-readwrite'
I0825 23:17:12.678480 10789 slave.cpp:581] Agent resources: [{"name":"cpus","scalar":{"value":2.0},"type":"SCALAR"},{"name":"mem","scalar":{"value":1024.0},"type":"SCALAR"},{"name":"disk","scalar":{"value":1024.0},"type":"SCALAR"},{"name":"ports","ranges":{"range":[{"begin":31000,"end":32000}]},"type":"RANGES"}]
I0825 23:17:12.678660 10789 slave.cpp:589] Agent attributes: [  ]
I0825 23:17:12.678671 10789 slave.cpp:598] Agent hostname: bda2f98b0a60
I0825 23:17:12.678828 10782 status_update_manager.cpp:177] Pausing sending status updates
I0825 23:17:12.680428 10783 state.cpp:64] Recovering state from '/tmp/Endpoint_SlaveEndpointTest_UnauthorizedRequest_2_9kaAwT/meta'
I0825 23:17:12.680721 10793 status_update_manager.cpp:203] Recovering status update manager
I0825 23:17:12.680908 10784 containerizer.cpp:643] Recovering containerizer
I0825 23:17:12.682422 10803 provisioner.cpp:416] Provisioner recovery complete
I0825 23:17:12.682696 10786 slave.cpp:6264] Finished recovery
I0825 23:17:12.683087 10786 slave.cpp:6446] Querying resource estimator for oversubscribable resources
I0825 23:17:12.683324 10797 slave.cpp:6460] Received oversubscribable resources {} from the resource estimator
I0825 23:17:12.685039 10782 process.cpp:3933] Handling HTTP event for process 'slave(809)' with path: '/slave(809)/containers'
I0825 23:17:12.686345 10793 http.cpp:1185] HTTP GET for /slave(809)/containers from 172.17.0.8:59392
I0825 23:17:12.686408 10793 http.cpp:976] Authorizing principal 'test-principal' to GET the '/containers' endpoint
I0825 23:17:12.688105 10785 slave.cpp:859] Agent terminating
[       OK ] Endpoint/SlaveEndpointTest.UnauthorizedRequest/2 (28 ms)
[ RUN      ] Endpoint/SlaveEndpointTest.NoAuthorizer/0
I0825 23:17:12.699502  2766 containerizer.cpp:288] Using isolation { environment_secret, posix/cpu, posix/mem, filesystem/posix, network/cni }
W0825 23:17:12.699923  2766 backend.cpp:76] Failed to create 'aufs' backend: AufsBackend requires root privileges
W0825 23:17:12.700011  2766 backend.cpp:76] Failed to create 'bind' backend: BindBackend requires root privileges
I0825 23:17:12.700034  2766 provisioner.cpp:255] Using default backend 'copy'
I0825 23:17:12.701493  2766 cluster.cpp:448] Creating default 'local' authorizer
I0825 23:17:12.703302 10784 slave.cpp:252] Mesos agent started on (810)@172.17.0.8:45365
I0825 23:17:12.703331 10784 slave.cpp:253] Flags at startup: --acls="" --appc_simple_discovery_uri_prefix="http://" --appc_store_dir="/tmp/Endpoint_SlaveEndpointTest_NoAuthorizer_0_nuYxgk/store/appc" --authenticate_http_executors="true" --authenticate_http_readonly="true" --authenticate_http_readwrite="true" --authenticatee="crammd5" --authentication_backoff_factor="1secs" --authorizer="local" --cgroups_cpu_enable_pids_and_tids_count="false" --cgroups_enable_cfs="false" --cgroups_hierarchy="/sys/fs/cgroup" --cgroups_limit_swap="false" --cgroups_root="mesos" --container_disk_watch_interval="15secs" --containerizers="mesos" --credential="/tmp/Endpoint_SlaveEndpointTest_NoAuthorizer_0_nuYxgk/credential" --default_role="*" --disallow_sharing_agent_pid_namespace="false" --disk_watch_interval="1mins" --docker="docker" --docker_kill_orphans="true" --docker_registry="https://registry-1.docker.io" --docker_remove_delay="6hrs" --docker_socket="/var/run/docker.sock" --docker_stop_timeout="0ns" --docker_store_dir="/tmp/Endpoint_SlaveEndpointTest_NoAuthorizer_0_nuYxgk/store/docker" --docker_volume_checkpoint_dir="/var/run/mesos/isolators/docker/volume" --enforce_container_disk_quota="false" --executor_registration_timeout="1mins" --executor_reregistration_timeout="2secs" --executor_secret_key="/tmp/Endpoint_SlaveEndpointTest_NoAuthorizer_0_nuYxgk/executor_secret_key" --executor_shutdown_grace_period="5secs" --fetcher_cache_dir="/tmp/Endpoint_SlaveEndpointTest_NoAuthorizer_0_nuYxgk/fetch" --fetcher_cache_size="2GB" --frameworks_home="" --gc_delay="1weeks" --gc_disk_headroom="0.1" --hadoop_home="" --help="false" --hostname_lookup="true" --http_command_executor="false" --http_credentials="/tmp/Endpoint_SlaveEndpointTest_NoAuthorizer_0_nuYxgk/http_credentials" --http_heartbeat_interval="30secs" --initialize_driver_logging="true" --isolation="posix/cpu,posix/mem" --launcher="posix" --launcher_dir="/mesos/build/src" --logbufsecs="0" --logging_level="INFO" --max_completed_executors_per_framework="150" --oversubscribed_resources_interval="15secs" --perf_duration="10secs" --perf_interval="1mins" --port="5051" --qos_correction_interval_min="0ns" --quiet="false" --recover="reconnect" --recovery_timeout="15mins" --registration_backoff_factor="10ms" --resources="cpus:2;gpus:0;mem:1024;disk:1024;ports:[31000-32000]" --revocable_cpu_low_priority="true" --runtime_dir="/tmp/Endpoint_SlaveEndpointTest_NoAuthorizer_0_nuYxgk" --sandbox_directory="/mnt/mesos/sandbox" --strict="true" --switch_user="true" --systemd_enable_support="true" --systemd_runtime_directory="/run/systemd/system" --version="false" --work_dir="/tmp/Endpoint_SlaveEndpointTest_NoAuthorizer_0_oeLETe"
I0825 23:17:12.704023 10784 credentials.hpp:86] Loading credential for authentication from '/tmp/Endpoint_SlaveEndpointTest_NoAuthorizer_0_nuYxgk/credential'
I0825 23:17:12.704260 10784 slave.cpp:285] Agent using credential for: test-principal
I0825 23:17:12.704282 10784 credentials.hpp:37] Loading credentials for authentication from '/tmp/Endpoint_SlaveEndpointTest_NoAuthorizer_0_nuYxgk/http_credentials'
I0825 23:17:12.704648 10784 http.cpp:1045] Creating default 'basic' HTTP authenticator for realm 'mesos-agent-executor'
I0825 23:17:12.704787 10784 http.cpp:1066] Creating default 'jwt' HTTP authenticator for realm 'mesos-agent-executor'
I0825 23:17:12.705057 10784 http.cpp:1045] Creating default 'basic' HTTP authenticator for realm 'mesos-agent-readonly'
I0825 23:17:12.705163 10784 http.cpp:1066] Creating default 'jwt' HTTP authenticator for realm 'mesos-agent-readonly'
I0825 23:17:12.705410 10784 http.cpp:1045] Creating default 'basic' HTTP authenticator for realm 'mesos-agent-readwrite'
I0825 23:17:12.705530 10784 http.cpp:1066] Creating default 'jwt' HTTP authenticator for realm 'mesos-agent-readwrite'
I0825 23:17:12.707656 10784 slave.cpp:581] Agent resources: [{"name":"cpus","scalar":{"value":2.0},"type":"SCALAR"},{"name":"mem","scalar":{"value":1024.0},"type":"SCALAR"},{"name":"disk","scalar":{"value":1024.0},"type":"SCALAR"},{"name":"ports","ranges":{"range":[{"begin":31000,"end":32000}]},"type":"RANGES"}]
I0825 23:17:12.707942 10784 slave.cpp:589] Agent attributes: [  ]
I0825 23:17:12.707960 10784 slave.cpp:598] Agent hostname: bda2f98b0a60
I0825 23:17:12.708159 10787 status_update_manager.cpp:177] Pausing sending status updates
I0825 23:17:12.709805 10797 state.cpp:64] Recovering state from '/tmp/Endpoint_SlaveEndpointTest_NoAuthorizer_0_oeLETe/meta'
I0825 23:17:12.710103 10788 status_update_manager.cpp:203] Recovering status update manager
I0825 23:17:12.710264 10795 containerizer.cpp:643] Recovering containerizer
I0825 23:17:12.711380 10786 provisioner.cpp:416] Provisioner recovery complete
I0825 23:17:12.711680 10784 slave.cpp:6264] Finished recovery
I0825 23:17:12.712127 10784 slave.cpp:6446] Querying resource estimator for oversubscribable resources
I0825 23:17:12.712345 10801 slave.cpp:6460] Received oversubscribable resources {} from the resource estimator
I0825 23:17:12.713896 10791 process.cpp:3933] Handling HTTP event for process 'slave(810)' with path: '/slave(810)/monitor/statistics'
I0825 23:17:12.715458 10788 http.cpp:1185] HTTP GET for /slave(810)/monitor/statistics from 172.17.0.8:59394
I0825 23:17:12.715528 10788 http.cpp:976] Authorizing principal 'test-principal' to GET the '/monitor/statistics' endpoint
I0825 23:17:12.718219  2766 slave.cpp:859] Agent terminating
[       OK ] Endpoint/SlaveEndpointTest.NoAuthorizer/0 (28 ms)
[ RUN      ] Endpoint/SlaveEndpointTest.NoAuthorizer/1
I0825 23:17:12.728700  2766 containerizer.cpp:288] Using isolation { environment_secret, posix/cpu, posix/mem, filesystem/posix, network/cni }
W0825 23:17:12.729146  2766 backend.cpp:76] Failed to create 'aufs' backend: AufsBackend requires root privileges
W0825 23:17:12.729243  2766 backend.cpp:76] Failed to create 'bind' backend: BindBackend requires root privileges
I0825 23:17:12.729269  2766 provisioner.cpp:255] Using default backend 'copy'
I0825 23:17:12.730978  2766 cluster.cpp:448] Creating default 'local' authorizer
I0825 23:17:12.732933 10800 slave.cpp:252] Mesos agent started on (811)@172.17.0.8:45365
I0825 23:17:12.732946 10800 slave.cpp:253] Flags at startup: --acls="" --appc_simple_discovery_uri_prefix="http://" --appc_store_dir="/tmp/Endpoint_SlaveEndpointTest_NoAuthorizer_1_mlFYYF/store/appc" --authenticate_http_executors="true" --authenticate_http_readonly="true" --authenticate_http_readwrite="true" --authenticatee="crammd5" --authentication_backoff_factor="1secs" --authorizer="local" --cgroups_cpu_enable_pids_and_tids_count="false" --cgroups_enable_cfs="false" --cgroups_hierarchy="/sys/fs/cgroup" --cgroups_limit_swap="false" --cgroups_root="mesos" --container_disk_watch_interval="15secs" --containerizers="mesos" --credential="/tmp/Endpoint_SlaveEndpointTest_NoAuthorizer_1_mlFYYF/credential" --default_role="*" --disallow_sharing_agent_pid_namespace="false" --disk_watch_interval="1mins" --docker="docker" --docker_kill_orphans="true" --docker_registry="https://registry-1.docker.io" --docker_remove_delay="6hrs" --docker_socket="/var/run/docker.sock" --docker_stop_timeout="0ns" --docker_store_dir="/tmp/Endpoint_SlaveEndpointTest_NoAuthorizer_1_mlFYYF/store/docker" --docker_volume_checkpoint_dir="/var/run/mesos/isolators/docker/volume" --enforce_container_disk_quota="false" --executor_registration_timeout="1mins" --executor_reregistration_timeout="2secs" --executor_secret_key="/tmp/Endpoint_SlaveEndpointTest_NoAuthorizer_1_mlFYYF/executor_secret_key" --executor_shutdown_grace_period="5secs" --fetcher_cache_dir="/tmp/Endpoint_SlaveEndpointTest_NoAuthorizer_1_mlFYYF/fetch" --fetcher_cache_size="2GB" --frameworks_home="" --gc_delay="1weeks" --gc_disk_headroom="0.1" --hadoop_home="" --help="false" --hostname_lookup="true" --http_command_executor="false" --http_credentials="/tmp/Endpoint_SlaveEndpointTest_NoAuthorizer_1_mlFYYF/http_credentials" --http_heartbeat_interval="30secs" --initialize_driver_logging="true" --isolation="posix/cpu,posix/mem" --launcher="posix" --launcher_dir="/mesos/build/src" --logbufsecs="0" --logging_level="INFO" --max_completed_executors_per_framework="150" --oversubscribed_resources_interval="15secs" --perf_duration="10secs" --perf_interval="1mins" --port="5051" --qos_correction_interval_min="0ns" --quiet="false" --recover="reconnect" --recovery_timeout="15mins" --registration_backoff_factor="10ms" --resources="cpus:2;gpus:0;mem:1024;disk:1024;ports:[31000-32000]" --revocable_cpu_low_priority="true" --runtime_dir="/tmp/Endpoint_SlaveEndpointTest_NoAuthorizer_1_mlFYYF" --sandbox_directory="/mnt/mesos/sandbox" --strict="true" --switch_user="true" --systemd_enable_support="true" --systemd_runtime_directory="/run/systemd/system" --version="false" --work_dir="/tmp/Endpoint_SlaveEndpointTest_NoAuthorizer_1_eAzMxA"
I0825 23:17:12.733261 10800 credentials.hpp:86] Loading credential for authentication from '/tmp/Endpoint_SlaveEndpointTest_NoAuthorizer_1_mlFYYF/credential'
I0825 23:17:12.733422 10800 slave.cpp:285] Agent using credential for: test-principal
I0825 23:17:12.733438 10800 credentials.hpp:37] Loading credentials for authentication from '/tmp/Endpoint_SlaveEndpointTest_NoAuthorizer_1_mlFYYF/http_credentials'
I0825 23:17:12.733706 10800 http.cpp:1045] Creating default 'basic' HTTP authenticator for realm 'mesos-agent-executor'
I0825 23:17:12.733839 10800 http.cpp:1066] Creating default 'jwt' HTTP authenticator for realm 'mesos-agent-executor'
I0825 23:17:12.734066 10800 http.cpp:1045] Creating default 'basic' HTTP authenticator for realm 'mesos-agent-readonly'
I0825 23:17:12.734171 10800 http.cpp:1066] Creating default 'jwt' HTTP authenticator for realm 'mesos-agent-readonly'
I0825 23:17:12.734387 10800 http.cpp:1045] Creating default 'basic' HTTP authenticator for realm 'mesos-agent-readwrite'
I0825 23:17:12.734491 10800 http.cpp:1066] Creating default 'jwt' HTTP authenticator for realm 'mesos-agent-readwrite'
I0825 23:17:12.735782 10800 slave.cpp:581] Agent resources: [{"name":"cpus","scalar":{"value":2.0},"type":"SCALAR"},{"name":"mem","scalar":{"value":1024.0},"type":"SCALAR"},{"name":"disk","scalar":{"value":1024.0},"type":"SCALAR"},{"name":"ports","ranges":{"range":[{"begin":31000,"end":32000}]},"type":"RANGES"}]
I0825 23:17:12.735954 10800 slave.cpp:589] Agent attributes: [  ]
I0825 23:17:12.735965 10800 slave.cpp:598] Agent hostname: bda2f98b0a60
I0825 23:17:12.736078 10782 status_update_manager.cpp:177] Pausing sending status updates
I0825 23:17:12.737437 10790 state.cpp:64] Recovering state from '/tmp/Endpoint_SlaveEndpointTest_NoAuthorizer_1_eAzMxA/meta'
I0825 23:17:12.737713 10787 status_update_manager.cpp:203] Recovering status update manager
I0825 23:17:12.737872 10795 containerizer.cpp:643] Recovering containerizer
I0825 23:17:12.738978 10783 provisioner.cpp:416] Provisioner recovery complete
I0825 23:17:12.739346 10803 slave.cpp:6264] Finished recovery
I0825 23:17:12.740099 10803 slave.cpp:6446] Querying resource estimator for oversubscribable resources
I0825 23:17:12.740466 10801 slave.cpp:6460] Received oversubscribable resources {} from the resource estimator
I0825 23:17:12.742466 10794 process.cpp:3933] Handling HTTP event for process 'slave(811)' with path: '/slave(811)/monitor/statistics.json'
I0825 23:17:12.743860 10791 http.cpp:1185] HTTP GET for /slave(811)/monitor/statistics.json from 172.17.0.8:59396
I0825 23:17:12.743927 10791 http.cpp:976] Authorizing principal 'test-principal' to GET the '/monitor/statistics.json' endpoint
I0825 23:17:12.746059 10781 slave.cpp:859] Agent terminating
[       OK ] Endpoint/SlaveEndpointTest.NoAuthorizer/1 (28 ms)
[ RUN      ] Endpoint/SlaveEndpointTest.NoAuthorizer/2
I0825 23:17:12.760082  2766 containerizer.cpp:288] Using isolation { environment_secret, posix/cpu, posix/mem, filesystem/posix, network/cni }
W0825 23:17:12.760682  2766 backend.cpp:76] Failed to create 'aufs' backend: AufsBackend requires root privileges
W0825 23:17:12.760807  2766 backend.cpp:76] Failed to create 'bind' backend: BindBackend requires root privileges
I0825 23:17:12.760850  2766 provisioner.cpp:255] Using default backend 'copy'
I0825 23:17:12.762958  2766 cluster.cpp:448] Creating default 'local' authorizer
I0825 23:17:12.765269 10788 slave.cpp:252] Mesos agent started on (812)@172.17.0.8:45365
I0825 23:17:12.765285 10788 slave.cpp:253] Flags at startup: --acls="" --appc_simple_discovery_uri_prefix="http://" --appc_store_dir="/tmp/Endpoint_SlaveEndpointTest_NoAuthorizer_2_8IfwY1/store/appc" --authenticate_http_executors="true" --authenticate_http_readonly="true" --authenticate_http_readwrite="true" --authenticatee="crammd5" --authentication_backoff_factor="1secs" --authorizer="local" --cgroups_cpu_enable_pids_and_tids_count="false" --cgroups_enable_cfs="false" --cgroups_hierarchy="/sys/fs/cgroup" --cgroups_limit_swap="false" --cgroups_root="mesos" --container_disk_watch_interval="15secs" --containerizers="mesos" --credential="/tmp/Endpoint_SlaveEndpointTest_NoAuthorizer_2_8IfwY1/credential" --default_role="*" --disallow_sharing_agent_pid_namespace="false" --disk_watch_interval="1mins" --docker="docker" --docker_kill_orphans="true" --docker_registry="https://registry-1.docker.io" --docker_remove_delay="6hrs" --docker_socket="/var/run/docker.sock" --docker_stop_timeout="0ns" --docker_store_dir="/tmp/Endpoint_SlaveEndpointTest_NoAuthorizer_2_8IfwY1/store/docker" --docker_volume_checkpoint_dir="/var/run/mesos/isolators/docker/volume" --enforce_container_disk_quota="false" --executor_registration_timeout="1mins" --executor_reregistration_timeout="2secs" --executor_secret_key="/tmp/Endpoint_SlaveEndpointTest_NoAuthorizer_2_8IfwY1/executor_secret_key" --executor_shutdown_grace_period="5secs" --fetcher_cache_dir="/tmp/Endpoint_SlaveEndpointTest_NoAuthorizer_2_8IfwY1/fetch" --fetcher_cache_size="2GB" --frameworks_home="" --gc_delay="1weeks" --gc_disk_headroom="0.1" --hadoop_home="" --help="false" --hostname_lookup="true" --http_command_executor="false" --http_credentials="/tmp/Endpoint_SlaveEndpointTest_NoAuthorizer_2_8IfwY1/http_credentials" --http_heartbeat_interval="30secs" --initialize_driver_logging="true" --isolation="posix/cpu,posix/mem" --launcher="posix" --launcher_dir="/mesos/build/src" --logbufsecs="0" --logging_level="INFO" --max_completed_executors_per_framework="150" --oversubscribed_resources_interval="15secs" --perf_duration="10secs" --perf_interval="1mins" --port="5051" --qos_correction_interval_min="0ns" --quiet="false" --recover="reconnect" --recovery_timeout="15mins" --registration_backoff_factor="10ms" --resources="cpus:2;gpus:0;mem:1024;disk:1024;ports:[31000-32000]" --revocable_cpu_low_priority="true" --runtime_dir="/tmp/Endpoint_SlaveEndpointTest_NoAuthorizer_2_8IfwY1" --sandbox_directory="/mnt/mesos/sandbox" --strict="true" --switch_user="true" --systemd_enable_support="true" --systemd_runtime_directory="/run/systemd/system" --version="false" --work_dir="/tmp/Endpoint_SlaveEndpointTest_NoAuthorizer_2_o78UsW"
I0825 23:17:12.765723 10788 credentials.hpp:86] Loading credential for authentication from '/tmp/Endpoint_SlaveEndpointTest_NoAuthorizer_2_8IfwY1/credential'
I0825 23:17:12.765892 10788 slave.cpp:285] Agent using credential for: test-principal
I0825 23:17:12.765915 10788 credentials.hpp:37] Loading credentials for authentication from '/tmp/Endpoint_SlaveEndpointTest_NoAuthorizer_2_8IfwY1/http_credentials'
I0825 23:17:12.766193 10788 http.cpp:1045] Creating default 'basic' HTTP authenticator for realm 'mesos-agent-executor'
I0825 23:17:12.766346 10788 http.cpp:1066] Creating default 'jwt' HTTP authenticator for realm 'mesos-agent-executor'
I0825 23:17:12.766564 10788 http.cpp:1045] Creating default 'basic' HTTP authenticator for realm 'mesos-agent-readonly'
I0825 23:17:12.766646 10788 http.cpp:1066] Creating default 'jwt' HTTP authenticator for realm 'mesos-agent-readonly'
I0825 23:17:12.766955 10788 http.cpp:1045] Creating default 'basic' HTTP authenticator for realm 'mesos-agent-readwrite'
I0825 23:17:12.767066 10788 http.cpp:1066] Creating default 'jwt' HTTP authenticator for realm 'mesos-agent-readwrite'
I0825 23:17:12.768362 10788 slave.cpp:581] Agent resources: [{"name":"cpus","scalar":{"value":2.0},"type":"SCALAR"},{"name":"mem","scalar":{"value":1024.0},"type":"SCALAR"},{"name":"disk","scalar":{"value":1024.0},"type":"SCALAR"},{"name":"ports","ranges":{"range":[{"begin":31000,"end":32000}]},"type":"RANGES"}]
I0825 23:17:12.768548 10788 slave.cpp:589] Agent attributes: [  ]
I0825 23:17:12.768559 10788 slave.cpp:598] Agent hostname: bda2f98b0a60
I0825 23:17:12.768735 10791 status_update_manager.cpp:177] Pausing sending status updates
I0825 23:17:12.770460 10795 state.cpp:64] Recovering state from '/tmp/Endpoint_SlaveEndpointTest_NoAuthorizer_2_o78UsW/meta'
I0825 23:17:12.770747 10782 status_update_manager.cpp:203] Recovering status update manager
I0825 23:17:12.770952 10793 containerizer.cpp:643] Recovering containerizer
I0825 23:17:12.772333 10796 provisioner.cpp:416] Provisioner recovery complete
I0825 23:17:12.772663 10792 slave.cpp:6264] Finished recovery
I0825 23:17:12.773161 10792 slave.cpp:6446] Querying resource estimator for oversubscribable resources
I0825 23:17:12.773388 10783 slave.cpp:6460] Received oversubscribable resources {} from the resource estimator
I0825 23:17:12.775837 10791 process.cpp:3933] Handling HTTP event for process 'slave(812)' with path: '/slave(812)/containers'
I0825 23:17:12.777470 10782 http.cpp:1185] HTTP GET for /slave(812)/containers from 172.17.0.8:59402
I0825 23:17:12.777541 10782 http.cpp:976] Authorizing principal 'test-principal' to GET the '/containers' endpoint
I0825 23:17:12.780609 10794 slave.cpp:859] Agent terminating
[       OK ] Endpoint/SlaveEndpointTest.NoAuthorizer/2 (35 ms)
[----------] 9 tests from Endpoint/SlaveEndpointTest (263 ms total)

[----------] Global test environment tear-down
[==========] 1622 tests from 177 test cases ran. (289330 ms total)
[  PASSED  ] 1621 tests.
[  FAILED  ] 1 test, listed below:
[  FAILED  ] HealthCheckTest.HealthyTaskViaHTTPWithoutType

 1 FAILED TEST
  YOU HAVE 20 DISABLED TESTS

I0825 23:17:12.844844 10804 process.cpp:1072] Failed to accept socket: future discarded
make[3]: *** [CMakeFiles/check] Error 1
make[3]: Leaving directory `/mesos/build'
make[2]: *** [CMakeFiles/check.dir/all] Error 2
make[2]: Leaving directory `/mesos/build'
make[1]: *** [CMakeFiles/check.dir/rule] Error 2
make[1]: Leaving directory `/mesos/build'
make: *** [check] Error 2
+ docker rmi mesos-1503700143-29880
Untagged: mesos-1503700143-29880:latest
Deleted: sha256:c03113a24731c507fb92d5dac24e06b49ece3980192bc10ccd80c3da03ff6303
Deleted: sha256:910832f2a3a7e4eec1a97cb5ab89ab1b5e1d683c7f84b0f3db43b4925206b06b
Deleted: sha256:7993dbc33c19f0992052fe6ceb404b8d6b1e10a0438ac04df2f97361bbb4beca
Deleted: sha256:cca2aa796c6be52d08cedc39d87d7bd502309a44fd2a519384b72c2d1f08781e
Deleted: sha256:4dc860a989603677458593aad7bba2afcf83d973b71b23c1a126dee824cf7a45
Deleted: sha256:1db39fae4f828ecb551089248ef14cabd9d911ad85d0a6b2df03458e1a5ab385
Deleted: sha256:09d2bfd74f945d559214d7be48cd789bacc549423e22ace46dec37a2c876e00d
Deleted: sha256:5c8fc1fccf9f2813d84fdb7a55eeb4e34ef428e6c7eeac364513d84ba50ae3fe
Deleted: sha256:f4fa7cbcaeeaa0b83cd9fca3eecb14bf782be1ebd75f7e3cedb3ae2b6cf331f1
Deleted: sha256:aba0dce4e97a243cd7904501a310f2c2a36ec9abe94b8542b77b4df6de8f9e40
Deleted: sha256:ceea5b9560347e7b6d46d63dc44e9290efe72f627d3987f59b5e1ccbf1482fed
Deleted: sha256:e833d5233a46033abd28a6f7569c2300742409656927c1e6683da6c9ba6b5ee1
Deleted: sha256:04aec24f1166726a8ec109c4c4c46f54f660782ae7ab3d60b4acd0305aff9171
Deleted: sha256:61d62c5cc8aae7276b09c7453b63e6e5401d8a611d07d90c0d75718cecd9f1bf
Deleted: sha256:7fbb034662bf95bca01314673e75b6b9f9e461c7da71b8ee59f3708864198250
Deleted: sha256:98422703db2ea95ec9e8dd249fe7d472dadcf2c12a3d18da5f8ea65f0641fe07
Deleted: sha256:2c850de1bb7a776be12991a0db46fb6f140d6586ef98b2e60d4a55f94c6b615c
Deleted: sha256:2b1a3f48d2193b89e8a641dcfa23c71dfa948c36aaef7651a980bea7ecbe48bf
Deleted: sha256:910dfc4d74468ed15bb1dd52197772504fab8f41c23293634dc53f660e7ca5d4
Deleted: sha256:dd834bf2a06241a5af616916b50ca15b10f6f9433e0d7067163f7e698b7e2b33
Deleted: sha256:663b7a739cc7788c02102997140f5051c1c615ddac354bb40e5063d6b23da33b
Deleted: sha256:257e7fe92e5950de044bc9fc2609b5772aec0063ca358fbccb0ac8a3b052591f
Deleted: sha256:a3a5d0349aaf0abe9fabb29d51b1c5406014bf3882b30f0380bb885133fc892d
Deleted: sha256:700204f8a031d194a97d1e8d735e0c40b92d76fa6822c8f86d9fce97d13c62a6
Build step 'Execute shell' marked build as failure

Jenkins build is back to normal : Mesos-Buildbot » cmake,gcc,--verbose --enable-libevent --enable-ssl,GLOG_v=1 MESOS_VERBOSE=1,ubuntu:14.04,(ubuntu)&&(!ubuntu-us1)&&(!ubuntu-eu2) #4160

Posted by Apache Jenkins Server <je...@builds.apache.org>.
See <https://builds.apache.org/job/Mesos-Buildbot/BUILDTOOL=cmake,COMPILER=gcc,CONFIGURATION=--verbose%20--enable-libevent%20--enable-ssl,ENVIRONMENT=GLOG_v=1%20MESOS_VERBOSE=1,OS=ubuntu%3A14.04,label_exp=(ubuntu)&&(!ubuntu-us1)&&(!ubuntu-eu2)/4160/display/redirect>