You are viewing a plain text version of this content. The canonical link for it is here.
Posted to commits@flex.apache.org by fl...@gmail.com on 2016/07/15 09:19:06 UTC
Build failed in Jenkins: flex-asjs #1245
See <http://apacheflexbuild.cloudapp.net:8080/job/flex-asjs/1245/changes>
Changes:
[harbs] Added optional parameters to SolidColor constructor
------------------------------------------
[...truncated 404 lines...]
[echo] flexlib = <http://apacheflexbuild.cloudapp.net:8080/job/flex-asjs/ws/frameworks>
[echo] doc_output = <http://apacheflexbuild.cloudapp.net:8080/job/flex-asjs/ws/asdoc-output>
[echo] compiler.source-path = <http://apacheflexbuild.cloudapp.net:8080/job/flex-asjs/ws/frameworks/projects/*/src/main/flex>
clean:
super-clean:
create-description:
[echo] build.number is 20160715
create-config:
playerglobal-setswfversion:
flex-config:
[copy] Copying 1 file to <http://apacheflexbuild.cloudapp.net:8080/job/flex-asjs/ws/frameworks>
playerglobal-setswfversion:
air-config:
[copy] Copying 1 file to <http://apacheflexbuild.cloudapp.net:8080/job/flex-asjs/ws/frameworks>
playerglobal-setswfversion:
js-config:
[copy] Copying 1 file to <http://apacheflexbuild.cloudapp.net:8080/job/flex-asjs/ws/frameworks>
playerglobal-setswfversion:
jquery-config:
[copy] Copying 1 file to <http://apacheflexbuild.cloudapp.net:8080/job/flex-asjs/ws/frameworks>
playerglobal-setswfversion:
createjs-config:
[copy] Copying 1 file to <http://apacheflexbuild.cloudapp.net:8080/job/flex-asjs/ws/frameworks>
playerglobal-setswfversion:
node-config:
[copy] Copying 1 file to <http://apacheflexbuild.cloudapp.net:8080/job/flex-asjs/ws/frameworks>
check-flex-home:
[echo] FLEX_HOME is C:\Jenkins\workspace\flex-sdk
[available] DEPRECATED - <available> used to override an existing property.
[available] Build file should not reuse the same property name for different values.
stage-source-no-scripts:
clean-temp:
[copy] Copying 18 files to <http://apacheflexbuild.cloudapp.net:8080/job/flex-asjs/ws/temp>
stage-framework-as:
[copy] Copying 912 files to <http://apacheflexbuild.cloudapp.net:8080/job/flex-asjs/ws/temp/frameworks>
[echo] Updating config file air-config.xml with version 0.7.0.20160715
[echo] Updating config file flex-config.xml with version 0.7.0.20160715
[echo] Updating config file js-config.xml with version 0.7.0.20160715
[echo] Updating config file jquery-config.xml with version 0.7.0.20160715
[echo] Updating config file createjs-config.xml with version 0.7.0.20160715
[echo] Updating config file node-config.xml with version 0.7.0.20160715
[copy] Copying 1 file to <http://apacheflexbuild.cloudapp.net:8080/job/flex-asjs/ws/temp/asdoc>
[copy] Copying 3 files to <http://apacheflexbuild.cloudapp.net:8080/job/flex-asjs/ws/temp>
[copy] Copying 11 files to <http://apacheflexbuild.cloudapp.net:8080/job/flex-asjs/ws/temp/ide>
[copy] Copying 14 files to <http://apacheflexbuild.cloudapp.net:8080/job/flex-asjs/ws/temp/js/bin>
[copy] Copying 298 files to <http://apacheflexbuild.cloudapp.net:8080/job/flex-asjs/ws/temp/examples>
[copy] Copying 1 file to <http://apacheflexbuild.cloudapp.net:8080/job/flex-asjs/ws/temp/templates>
stage-source:
stage-scripts:
[copy] Copying 4 files to <http://apacheflexbuild.cloudapp.net:8080/job/flex-asjs/ws/temp/scripts>
source-package-zip:
[mkdir] Created dir: <http://apacheflexbuild.cloudapp.net:8080/job/flex-asjs/ws/out>
[zip] Building zip: <http://apacheflexbuild.cloudapp.net:8080/job/flex-asjs/1245/artifact/out/apache-flex-flexjs-0.7.0-src.zip>
source-package-tgz:
[tar] Building tar: <http://apacheflexbuild.cloudapp.net:8080/job/flex-asjs/1245/artifact/out/apache-flex-flexjs-0.7.0-src.tar.gz>
source-package:
source-release:
setup-binary-release:
check-for-airsdk:
ask-or-fail:
check-git:
[echo] Checking for Git...
[exec] git version 1.9.0.msysgit.0
get-download-folder:
download-all:
ask-about-downloading-repos:
block-main:
check-if-ide:
thirdparty-downloads:
thirdparty-downloads:
swfobject-check:
swfobject-download:
[mkdir] Created dir: <http://apacheflexbuild.cloudapp.net:8080/job/flex-asjs/ws/in>
[get] Getting: https://codeload.github.com/swfobject/swfobject/zip/2.2
[get] To: <http://apacheflexbuild.cloudapp.net:8080/job/flex-asjs/ws/in/swfobject_2_2.zip>
[unzip] Expanding: <http://apacheflexbuild.cloudapp.net:8080/job/flex-asjs/ws/in/swfobject_2_2.zip> into <http://apacheflexbuild.cloudapp.net:8080/job/flex-asjs/ws/templates/swfobject>
flat-ui-check:
ask-flat:
get-flat-fonts:
[get] Getting: https://github.com/designmodo/Flat-UI/archive/2.2.2.zip
[get] To: <http://apacheflexbuild.cloudapp.net:8080/job/flex-asjs/ws/in/flat-ui_2_2.zip>
[get] https://github.com/designmodo/Flat-UI/archive/2.2.2.zip moved to https://codeload.github.com/designmodo/Flat-UI/zip/2.2.2
[unzip] Expanding: <http://apacheflexbuild.cloudapp.net:8080/job/flex-asjs/ws/in/flat-ui_2_2.zip> into <http://apacheflexbuild.cloudapp.net:8080/job/flex-asjs/ws/frameworks/fonts>
[unzip] Expanding: <http://apacheflexbuild.cloudapp.net:8080/job/flex-asjs/ws/in/flat-ui_2_2.zip> into <http://apacheflexbuild.cloudapp.net:8080/job/flex-asjs/ws/frameworks/fonts>
flat-ui-download:
check-goog-home:
[echo] GOOG_HOME is C:\google\closure\Library
gcl-download:
main:
[echo] Use thirdparty-clean or super-clean to remove these.
copy-externs:
[mkdir] Created dir: <http://apacheflexbuild.cloudapp.net:8080/job/flex-asjs/ws/js/libs>
[copy] Copying 8 files to <http://apacheflexbuild.cloudapp.net:8080/job/flex-asjs/ws/js/libs>
check_jquery:
rename_jquery:
[move] Moving 1 file to <http://apacheflexbuild.cloudapp.net:8080/job/flex-asjs/ws/js/libs>
prebuild:
frameworks:
check-compile-env:
check-playerglobal-home:
check-air-home:
check-falcon-home:
check-falconjx-home:
check-compile-env:
[echo] OS: Windows Server 2008 R2 / 6.1 / amd64
[echo] VM: Java HotSpot(TM) 64-Bit Server VM / 24.55-b03
[echo] Java: 1.7.0_55
[echo] Ant: Apache Ant(TM) version 1.9.3 compiled on December 23 2013 Ant Java Version: 1.7
clean:
clean:
clean:
clean:
clean:
clean:
clean:
clean:
clean:
clean:
clean:
clean:
clean:
clean:
clean:
clean:
clean:
clean:
clean:
clean:
thirdparty-downloads:
prepare:
compile:
Core:
clean:
check-falcon-home:
check-falconjx-home:
check-compiler:
compile-js-swc:
[echo] Compiling target/CoreJS.swc
[echo] FLEX_HOME: <http://apacheflexbuild.cloudapp.net:8080/job/flex-asjs/ws/>
[echo] FALCON_HOME: <http://apacheflexbuild.cloudapp.net:8080/job/flex-asjs/ws/../flex-falcon/compiler>
[mkdir] Created dir: <http://apacheflexbuild.cloudapp.net:8080/job/flex-asjs/ws/frameworks/js/FlexJS/libs>
[mkdir] Created dir: <http://apacheflexbuild.cloudapp.net:8080/job/flex-asjs/ws/frameworks/js/FlexJS/projects/CoreJS/target>
[compc] Loading configuration: <http://apacheflexbuild.cloudapp.net:8080/job/flex-asjs/ws/frameworks/js-config.xml>
[compc] Loading configuration: <http://apacheflexbuild.cloudapp.net:8080/job/flex-asjs/ws/frameworks/js/FlexJS/projects/CoreJS/src/main/config/compile-js-config.xml>
[compc]
[compc] <http://apacheflexbuild.cloudapp.net:8080/job/flex-asjs/ws/frameworks/js-config.xml>:75
[compc] Error: unable to open '<http://apacheflexbuild.cloudapp.net:8080/job/flex-asjs/ws/frameworks/libs/Core.swc'.>
[compc] <http://apacheflexbuild.cloudapp.net:8080/job/flex-asjs/ws/frameworks/js-config.xml> (line: 75)
[compc] </library-path>
[compc]
[compc]
[compc] Picked up JAVA_TOOL_OPTIONS: -Dfile.encoding=UTF8
BUILD FAILED
<http://apacheflexbuild.cloudapp.net:8080/job/flex-asjs/ws/build.xml>:469: The following error occurred while executing this line:
<http://apacheflexbuild.cloudapp.net:8080/job/flex-asjs/ws/frameworks/js/FlexJS/build.xml>:78: The following error occurred while executing this line:
<http://apacheflexbuild.cloudapp.net:8080/job/flex-asjs/ws/frameworks/js/FlexJS/build.xml>:152: The following error occurred while executing this line:
<http://apacheflexbuild.cloudapp.net:8080/job/flex-asjs/ws/frameworks/js/FlexJS/projects/CoreJS/build.xml>:75: compc task failed.
Total time: 1 minute 31 seconds
Picked up JAVA_TOOL_OPTIONS: -Dfile.encoding=UTF8
Build step 'Invoke Ant' marked build as failure
Skipped archiving because build is not successful
Jenkins build is back to normal : flex-asjs #1249
Posted by fl...@gmail.com.
See <http://apacheflexbuild.cloudapp.net:8080/job/flex-asjs/1249/changes>
Build failed in Jenkins: flex-asjs #1248
Posted by fl...@gmail.com.
See <http://apacheflexbuild.cloudapp.net:8080/job/flex-asjs/1248/changes>
Changes:
[joshtynjala] Language: new project that pulls out Namespace, QName, and org.apache.flex.utils.Language into a separate SWC that doesn't have framework stuff; swapped Core.swc for Language.swc in js/node/jquery-config.xml; fixed builds of JS projects that didn't like a SWC being referenced in js-config.xml (thanks to Greg Dove)
[christofer.dutz] Split up Core into a Core and Languages module:
------------------------------------------
[...truncated 2980 lines...]
[java] Dependencies calculated for '<http://apacheflexbuild.cloudapp.net:8080/job/flex-asjs/ws/mustella/tests/bin/js-debug/org/apache/flex/core/IParentIUIBase.js'>
[java] Dependencies calculated for '<http://apacheflexbuild.cloudapp.net:8080/job/flex-asjs/ws/mustella/tests/bin/js-debug/org/apache/flex/core/IStrandWithModel.js'>
[java] Dependencies calculated for '<http://apacheflexbuild.cloudapp.net:8080/job/flex-asjs/ws/mustella/tests/bin/js-debug/org/apache/flex/core/IStyleableObject.js'>
[java] Dependencies calculated for '<http://apacheflexbuild.cloudapp.net:8080/job/flex-asjs/ws/mustella/tests/bin/js-debug/org/apache/flex/core/IContentView.js'>
[java] Dependencies calculated for '<http://apacheflexbuild.cloudapp.net:8080/job/flex-asjs/ws/mustella/tests/bin/js-debug/org/apache/flex/html/beads/layouts/BasicLayout.js'>
[java] Dependencies calculated for '<http://apacheflexbuild.cloudapp.net:8080/job/flex-asjs/ws/mustella/tests/bin/js-debug/org/apache/flex/core/IBeadLayout.js'>
[java] Dependencies calculated for '<http://apacheflexbuild.cloudapp.net:8080/job/flex-asjs/ws/mustella/tests/bin/js-debug/org/apache/flex/core/ILayoutHost.js'>
[java] Dependencies calculated for '<http://apacheflexbuild.cloudapp.net:8080/job/flex-asjs/ws/mustella/tests/bin/js-debug/org/apache/flex/html/supportClasses/Viewport.js'>
[java] Dependencies calculated for '<http://apacheflexbuild.cloudapp.net:8080/job/flex-asjs/ws/mustella/tests/bin/js-debug/org/apache/flex/geom/Size.js'>
[java] Dependencies calculated for '<http://apacheflexbuild.cloudapp.net:8080/job/flex-asjs/ws/mustella/tests/bin/js-debug/org/apache/flex/utils/CSSContainerUtils.js'>
[java] Dependencies calculated for '<http://apacheflexbuild.cloudapp.net:8080/job/flex-asjs/ws/mustella/tests/bin/js-debug/org/apache/flex/geom/Rectangle.js'>
[java] Dependencies calculated for '<http://apacheflexbuild.cloudapp.net:8080/job/flex-asjs/ws/mustella/tests/bin/js-debug/org/apache/flex/geom/Point.js'>
[java] Dependencies calculated for '<http://apacheflexbuild.cloudapp.net:8080/job/flex-asjs/ws/mustella/tests/bin/js-debug/org/apache/flex/utils/CSSUtils.js'>
[java] Dependencies calculated for '<http://apacheflexbuild.cloudapp.net:8080/job/flex-asjs/ws/mustella/tests/bin/js-debug/org/apache/flex/core/IViewport.js'>
[java] Dependencies calculated for '<http://apacheflexbuild.cloudapp.net:8080/job/flex-asjs/ws/mustella/tests/bin/js-debug/org/apache/flex/html/beads/ContainerView.js'>
[java] Dependencies calculated for '<http://apacheflexbuild.cloudapp.net:8080/job/flex-asjs/ws/mustella/tests/bin/js-debug/org/apache/flex/core/BeadViewBase.js'>
[java] Dependencies calculated for '<http://apacheflexbuild.cloudapp.net:8080/job/flex-asjs/ws/mustella/tests/bin/js-debug/org/apache/flex/core/IContainerView.js'>
[java] Dependencies calculated for '<http://apacheflexbuild.cloudapp.net:8080/job/flex-asjs/ws/mustella/tests/bin/js-debug/org/apache/flex/core/IContentViewHost.js'>
[java] Dependencies calculated for '<http://apacheflexbuild.cloudapp.net:8080/job/flex-asjs/ws/mustella/tests/bin/js-debug/org/apache/flex/core/IViewportModel.js'>
[java] Dependencies calculated for '<http://apacheflexbuild.cloudapp.net:8080/job/flex-asjs/ws/mustella/tests/bin/js-debug/org/apache/flex/html/beads/IBackgroundBead.js'>
[java] Dependencies calculated for '<http://apacheflexbuild.cloudapp.net:8080/job/flex-asjs/ws/mustella/tests/bin/js-debug/org/apache/flex/html/beads/IBorderBead.js'>
[java] Dependencies calculated for '<http://apacheflexbuild.cloudapp.net:8080/job/flex-asjs/ws/mustella/tests/bin/js-debug/org/apache/flex/html/beads/models/ViewportModel.js'>
[java] Dependencies calculated for '<http://apacheflexbuild.cloudapp.net:8080/job/flex-asjs/ws/mustella/tests/bin/js-debug/org/apache/flex/html/beads/DataItemRendererFactoryForArrayList.js'>
[java] Dependencies calculated for '<http://apacheflexbuild.cloudapp.net:8080/job/flex-asjs/ws/mustella/tests/bin/js-debug/org/apache/flex/core/SimpleCSSStyles.js'>
[java] Dependencies calculated for '<http://apacheflexbuild.cloudapp.net:8080/job/flex-asjs/ws/mustella/tests/bin/js-debug/org/apache/flex/html/List.js'>
[java] Dependencies calculated for '<http://apacheflexbuild.cloudapp.net:8080/job/flex-asjs/ws/mustella/tests/bin/js-debug/org/apache/flex/core/ListBase.js'>
[java] Dependencies calculated for '<http://apacheflexbuild.cloudapp.net:8080/job/flex-asjs/ws/mustella/tests/bin/js-debug/org/apache/flex/core/ListBaseStrandChildren.js'>
[java] Dependencies calculated for '<http://apacheflexbuild.cloudapp.net:8080/job/flex-asjs/ws/mustella/tests/bin/js-debug/org/apache/flex/html/beads/ListView.js'>
[java] Dependencies calculated for '<http://apacheflexbuild.cloudapp.net:8080/job/flex-asjs/ws/mustella/tests/bin/js-debug/org/apache/flex/core/IItemRendererParent.js'>
[java] Dependencies calculated for '<http://apacheflexbuild.cloudapp.net:8080/job/flex-asjs/ws/mustella/tests/bin/js-debug/org/apache/flex/core/IRollOverModel.js'>
[java] Dependencies calculated for '<http://apacheflexbuild.cloudapp.net:8080/job/flex-asjs/ws/mustella/tests/bin/js-debug/org/apache/flex/core/ISelectableItemRenderer.js'>
[java] Dependencies calculated for '<http://apacheflexbuild.cloudapp.net:8080/job/flex-asjs/ws/mustella/tests/bin/js-debug/org/apache/flex/core/IItemRenderer.js'>
[java] Dependencies calculated for '<http://apacheflexbuild.cloudapp.net:8080/job/flex-asjs/ws/mustella/tests/bin/js-debug/org/apache/flex/core/ISelectionModel.js'>
[java] Dependencies calculated for '<http://apacheflexbuild.cloudapp.net:8080/job/flex-asjs/ws/mustella/tests/bin/js-debug/org/apache/flex/html/beads/IListView.js'>
[java] Dependencies calculated for '<http://apacheflexbuild.cloudapp.net:8080/job/flex-asjs/ws/mustella/tests/bin/js-debug/org/apache/flex/html/beads/models/ListPresentationModel.js'>
[java] Dependencies calculated for '<http://apacheflexbuild.cloudapp.net:8080/job/flex-asjs/ws/mustella/tests/bin/js-debug/org/apache/flex/core/IListPresentationModel.js'>
[java] Dependencies calculated for '<http://apacheflexbuild.cloudapp.net:8080/job/flex-asjs/ws/mustella/tests/bin/js-debug/org/apache/flex/core/IDataProviderItemRendererMapper.js'>
[java] Dependencies calculated for '<http://apacheflexbuild.cloudapp.net:8080/job/flex-asjs/ws/mustella/tests/bin/js-debug/org/apache/flex/core/IItemRendererClassFactory.js'>
[java] Dependencies calculated for '<http://apacheflexbuild.cloudapp.net:8080/job/flex-asjs/ws/mustella/tests/bin/js-debug/org/apache/flex/core/IItemRendererProvider.js'>
[java] Dependencies calculated for '<http://apacheflexbuild.cloudapp.net:8080/job/flex-asjs/ws/mustella/tests/bin/js-debug/org/apache/flex/collections/IArrayList.js'>
[java] Dependencies calculated for '<http://apacheflexbuild.cloudapp.net:8080/job/flex-asjs/ws/mustella/tests/bin/js-debug/org/apache/flex/html/supportClasses/DataGroup.js'>
[java] Dependencies calculated for '<http://apacheflexbuild.cloudapp.net:8080/job/flex-asjs/ws/mustella/tests/bin/js-debug/org/apache/flex/events/ItemAddedEvent.js'>
[java] Dependencies calculated for '<http://apacheflexbuild.cloudapp.net:8080/job/flex-asjs/ws/mustella/tests/bin/js-debug/org/apache/flex/events/CustomEvent.js'>
[java] Dependencies calculated for '<http://apacheflexbuild.cloudapp.net:8080/job/flex-asjs/ws/mustella/tests/bin/js-debug/org/apache/flex/events/ItemRemovedEvent.js'>
[java] Dependencies calculated for '<http://apacheflexbuild.cloudapp.net:8080/job/flex-asjs/ws/mustella/tests/bin/js-debug/org/apache/flex/html/supportClasses/DataItemRenderer.js'>
[java] Dependencies calculated for '<http://apacheflexbuild.cloudapp.net:8080/job/flex-asjs/ws/mustella/tests/bin/js-debug/org/apache/flex/html/beads/controllers/ItemRendererMouseController.js'>
[java] Dependencies calculated for '<http://apacheflexbuild.cloudapp.net:8080/job/flex-asjs/ws/mustella/tests/bin/js-debug/org/apache/flex/events/ItemClickedEvent.js'>
[java] Dependencies calculated for '<http://apacheflexbuild.cloudapp.net:8080/job/flex-asjs/ws/mustella/tests/bin/js-debug/org/apache/flex/html/supportClasses/UIItemRendererBase.js'>
[java] Dependencies calculated for '<http://apacheflexbuild.cloudapp.net:8080/job/flex-asjs/ws/mustella/tests/bin/js-debug/org/apache/flex/html/beads/layouts/VerticalLayout.js'>
[java] Dependencies calculated for '<http://apacheflexbuild.cloudapp.net:8080/job/flex-asjs/ws/mustella/tests/bin/js-debug/org/apache/flex/html/beads/controllers/ListSingleSelectionMouseController.js'>
[java] Dependencies calculated for '<http://apacheflexbuild.cloudapp.net:8080/job/flex-asjs/ws/mustella/tests/bin/js-debug/org/apache/flex/core/ItemRendererClassFactory.js'>
[java] Dependencies calculated for '<http://apacheflexbuild.cloudapp.net:8080/job/flex-asjs/ws/mustella/tests/bin/js-debug/org/apache/flex/core/ClassFactory.js'>
[java] Dependencies calculated for '<http://apacheflexbuild.cloudapp.net:8080/job/flex-asjs/ws/mustella/tests/bin/js-debug/org/apache/flex/core/IFactory.js'>
[java] Dependencies calculated for '<http://apacheflexbuild.cloudapp.net:8080/job/flex-asjs/ws/mustella/tests/bin/js-debug/org/apache/flex/core/Strand.js'>
[java] Dependencies calculated for '<http://apacheflexbuild.cloudapp.net:8080/job/flex-asjs/ws/mustella/tests/bin/js-debug/org/apache/flex/html/supportClasses/StringItemRenderer.js'>
[java] Dependencies calculated for '<http://apacheflexbuild.cloudapp.net:8080/job/flex-asjs/ws/mustella/tests/bin/js-debug/org/apache/flex/html/beads/ITextItemRenderer.js'>
[java] Dependencies calculated for '<http://apacheflexbuild.cloudapp.net:8080/job/flex-asjs/ws/mustella/tests/bin/js-debug/org/apache/flex/html/beads/models/DataGridModel.js'>
[java] Dependencies calculated for '<http://apacheflexbuild.cloudapp.net:8080/job/flex-asjs/ws/mustella/tests/bin/js-debug/org/apache/flex/html/beads/models/ArrayListSelectionModel.js'>
[java] Dependencies calculated for '<http://apacheflexbuild.cloudapp.net:8080/job/flex-asjs/ws/mustella/tests/bin/js-debug/org/apache/flex/core/IDataGridModel.js'>
[java] Dependencies calculated for '<http://apacheflexbuild.cloudapp.net:8080/job/flex-asjs/ws/mustella/tests/bin/js-debug/org/apache/flex/html/beads/DataItemRendererFactoryForArrayData.js'>
[java] Dependencies calculated for '<http://apacheflexbuild.cloudapp.net:8080/job/flex-asjs/ws/mustella/tests/bin/js-debug/org/apache/flex/html/supportClasses/ScrollingViewport.js'>
[java] Dependencies calculated for '<http://apacheflexbuild.cloudapp.net:8080/job/flex-asjs/ws/mustella/tests/bin/js-debug/org/apache/flex/html/beads/models/ArraySelectionModel.js'>
[java] Dependencies calculated for '<http://apacheflexbuild.cloudapp.net:8080/job/flex-asjs/ws/mustella/tests/bin/js-debug/org/apache/flex/core/Application.js'>
[java] Dependencies calculated for '<http://apacheflexbuild.cloudapp.net:8080/job/flex-asjs/ws/mustella/tests/bin/js-debug/org/apache/flex/core/ApplicationBase.js'>
[java] Dependencies calculated for '<http://apacheflexbuild.cloudapp.net:8080/job/flex-asjs/ws/mustella/tests/bin/js-debug/org/apache/flex/core/IFlexInfo.js'>
[java] Dependencies calculated for '<http://apacheflexbuild.cloudapp.net:8080/job/flex-asjs/ws/mustella/tests/bin/js-debug/org/apache/flex/utils/Timer.js'>
[java] Dependencies calculated for '<http://apacheflexbuild.cloudapp.net:8080/job/flex-asjs/ws/mustella/tests/bin/js-debug/org/apache/flex/core/SimpleCSSValuesImpl.js'>
[java] Dependencies calculated for '<http://apacheflexbuild.cloudapp.net:8080/job/flex-asjs/ws/mustella/tests/bin/js-debug/org/apache/flex/core/IValuesImpl.js'>
[java] Dependencies calculated for '<http://apacheflexbuild.cloudapp.net:8080/job/flex-asjs/ws/mustella/tests/bin/js-debug/BasicTests.js'>
[java] Dependencies calculated for '<http://apacheflexbuild.cloudapp.net:8080/job/flex-asjs/ws/mustella/tests/bin/js-debug/org/apache/flex/core/View.js'>
[java] Dependencies calculated for '<http://apacheflexbuild.cloudapp.net:8080/job/flex-asjs/ws/mustella/tests/bin/js-debug/org/apache/flex/core/ViewBase.js'>
[java] Dependencies calculated for '<http://apacheflexbuild.cloudapp.net:8080/job/flex-asjs/ws/mustella/tests/bin/js-debug/org/apache/flex/core/ContainerBase.js'>
[java] Dependencies calculated for '<http://apacheflexbuild.cloudapp.net:8080/job/flex-asjs/ws/mustella/tests/bin/js-debug/org/apache/flex/core/ContainerBaseStrandChildren.js'>
[java] Dependencies calculated for '<http://apacheflexbuild.cloudapp.net:8080/job/flex-asjs/ws/mustella/tests/bin/js-debug/org/apache/flex/core/IApplicationView.js'>
[java] Dependencies calculated for '<http://apacheflexbuild.cloudapp.net:8080/job/flex-asjs/ws/mustella/tests/bin/js-debug/org/apache/flex/core/IPopUpHost.js'>
[java] Dependencies calculated for '<http://apacheflexbuild.cloudapp.net:8080/job/flex-asjs/ws/mustella/tests/bin/js-debug/org/apache/flex/states/State.js'>
[java] Dependencies calculated for '<http://apacheflexbuild.cloudapp.net:8080/job/flex-asjs/ws/mustella/tests/bin/js-debug/halo/views/ButtonTests.js'>
[java] Dependencies calculated for '<http://apacheflexbuild.cloudapp.net:8080/job/flex-asjs/ws/mustella/tests/bin/js-debug/shim/VBox.js'>
[java] Dependencies calculated for '<http://apacheflexbuild.cloudapp.net:8080/job/flex-asjs/ws/mustella/tests/bin/js-debug/org/apache/flex/html/Container.js'>
[java] Dependencies calculated for '<http://apacheflexbuild.cloudapp.net:8080/job/flex-asjs/ws/mustella/tests/bin/js-debug/org/apache/flex/html/TextButton.js'>
[java] Dependencies calculated for '<http://apacheflexbuild.cloudapp.net:8080/job/flex-asjs/ws/mustella/tests/bin/js-debug/org/apache/flex/html/Button.js'>
[java] Dependencies calculated for '<http://apacheflexbuild.cloudapp.net:8080/job/flex-asjs/ws/mustella/tests/bin/js-debug/org/apache/flex/html/Label.js'>
[java] Dependencies calculated for '<http://apacheflexbuild.cloudapp.net:8080/job/flex-asjs/ws/mustella/tests/bin/js-debug/org/apache/flex/events/MouseEvent.js'>
[java] Dependencies calculated for '<http://apacheflexbuild.cloudapp.net:8080/job/flex-asjs/ws/mustella/tests/bin/js-debug/org/apache/flex/utils/PointUtils.js'>
[java] Dependencies calculated for '<http://apacheflexbuild.cloudapp.net:8080/job/flex-asjs/ws/mustella/tests/bin/js-debug/halo/views/CheckBoxTests.js'>
[java] Dependencies calculated for '<http://apacheflexbuild.cloudapp.net:8080/job/flex-asjs/ws/mustella/tests/bin/js-debug/org/apache/flex/html/CheckBox.js'>
[java] Dependencies calculated for '<http://apacheflexbuild.cloudapp.net:8080/job/flex-asjs/ws/mustella/tests/bin/js-debug/org/apache/flex/html/supportClasses/CheckBoxIcon.js'>
[java] Dependencies calculated for '<http://apacheflexbuild.cloudapp.net:8080/job/flex-asjs/ws/mustella/tests/bin/js-debug/org/apache/flex/utils/MixinManager.js'>
[java] Dependencies calculated for '<http://apacheflexbuild.cloudapp.net:8080/job/flex-asjs/ws/mustella/tests/bin/js-debug/org/apache/flex/core/CSSFontFaceBead.js'>
[java] Dependencies calculated for '<http://apacheflexbuild.cloudapp.net:8080/job/flex-asjs/ws/mustella/tests/bin/js-debug/FlexJSContext.js'>
[java] Dependencies calculated for '<http://apacheflexbuild.cloudapp.net:8080/job/flex-asjs/ws/mustella/tests/bin/js-debug/SendFormattedResultsToLog.js'>
[java] Dependencies calculated for '<http://apacheflexbuild.cloudapp.net:8080/job/flex-asjs/ws/mustella/tests/bin/js-debug/SetShowRTE.js'>
[java] Dependencies calculated for '<http://apacheflexbuild.cloudapp.net:8080/job/flex-asjs/ws/mustella/tests/bin/js-debug/ExitWhenDone.js'>
[java] Dependencies calculated for '<http://apacheflexbuild.cloudapp.net:8080/job/flex-asjs/ws/mustella/tests/bin/js-debug/halo/scripts/CheckBoxTestScript.js'>
[java] Dependencies calculated for '<http://apacheflexbuild.cloudapp.net:8080/job/flex-asjs/ws/mustella/tests/bin/js-debug/UnitTester.js'>
[java] Dependencies calculated for '<http://apacheflexbuild.cloudapp.net:8080/job/flex-asjs/ws/mustella/tests/bin/js-debug/TestCase.js'>
[java] Dependencies calculated for '<http://apacheflexbuild.cloudapp.net:8080/job/flex-asjs/ws/mustella/tests/bin/js-debug/SetProperty.js'>
[java] Dependencies calculated for '<http://apacheflexbuild.cloudapp.net:8080/job/flex-asjs/ws/mustella/tests/bin/js-debug/AssertPropertyValue.js'>
[java] Dependencies calculated for '<http://apacheflexbuild.cloudapp.net:8080/job/flex-asjs/ws/mustella/tests/bin/js-debug/DispatchMouseEvent.js'>
[java] Dependencies calculated for '<http://apacheflexbuild.cloudapp.net:8080/job/flex-asjs/ws/mustella/tests/bin/js-debug/DispatchMouseClickEvent.js'>
[java] Dependencies calculated for '<http://apacheflexbuild.cloudapp.net:8080/job/flex-asjs/ws/mustella/tests/bin/js-debug/halo/scripts/ButtonTestScript.js'>
[java] The project 'BasicTestsApp' has been successfully compiled and optimized.
[java] Picked up JAVA_TOOL_OPTIONS: -Dfile.encoding=UTF8
basictests-compile-java:
[delete] Deleting directory <http://apacheflexbuild.cloudapp.net:8080/job/flex-asjs/ws/mustella/java/bin>
[mkdir] Created dir: <http://apacheflexbuild.cloudapp.net:8080/job/flex-asjs/ws/mustella/java/bin>
[javac] <http://apacheflexbuild.cloudapp.net:8080/job/flex-asjs/ws/build.xml>:1220: warning: 'includeantruntime' was not set, defaulting to build.sysclasspath=last; set to false for repeatable builds
[javac] Compiling 11 source files to <http://apacheflexbuild.cloudapp.net:8080/job/flex-asjs/ws/mustella/java/bin>
basictests-run-js:
[echo] url=file://<http://apacheflexbuild.cloudapp.net:8080/job/flex-asjs/ws/mustella/tests/basicTests/bin/js-debug/index.html>
[echo] script=<http://apacheflexbuild.cloudapp.net:8080/job/flex-asjs/ws/mustella/tests/basicTests/halo/scripts/ButtonTestScript.mxml>
[echo] script=<http://apacheflexbuild.cloudapp.net:8080/job/flex-asjs/ws/mustella/tests/basicTests/halo/scripts/CheckBoxTestScript.mxml>
[java] file://<http://apacheflexbuild.cloudapp.net:8080/job/flex-asjs/ws/mustella/tests/bin/js-debug/index.html>
[java] running script <http://apacheflexbuild.cloudapp.net:8080/job/flex-asjs/ws/mustella/tests/basicTests/halo/scripts/ButtonTestScript.mxml>
[java] test case count: 2
[java] RESULT: scriptName=<http://apacheflexbuild.cloudapp.net:8080/job/flex-asjs/ws/mustella/tests/basicTests/halo/scripts/ButtonTestScript.mxml> id=SetupButtonTest result=pass elapsed=476 phase=body started=1468618854011 extraInfo= msg=
[java] RESULT: scriptName=<http://apacheflexbuild.cloudapp.net:8080/job/flex-asjs/ws/mustella/tests/basicTests/halo/scripts/ButtonTestScript.mxml> id=ButtonTest1 result=pass elapsed=10115 phase=body started=1468618854487 extraInfo= msg=
[java] running script <http://apacheflexbuild.cloudapp.net:8080/job/flex-asjs/ws/mustella/tests/basicTests/halo/scripts/CheckBoxTestScript.mxml>
[java] test case count: 2
[java] RESULT: scriptName=<http://apacheflexbuild.cloudapp.net:8080/job/flex-asjs/ws/mustella/tests/basicTests/halo/scripts/CheckBoxTestScript.mxml> id=SetupCheckBoxTest result=pass elapsed=544 phase=body started=1468618864639 extraInfo= msg=
[java] RESULT: scriptName=<http://apacheflexbuild.cloudapp.net:8080/job/flex-asjs/ws/mustella/tests/basicTests/halo/scripts/CheckBoxTestScript.mxml> id=CheckBoxTest1 result=pass elapsed=539 phase=body started=1468618865183 extraInfo= msg=
[java] Picked up JAVA_TOOL_OPTIONS: -Dfile.encoding=UTF8
basictests-js:
basictests-marmotinni:
checkintests:
doc:
other.locales:
check-goog-home:
binary-package:
check-flex-home:
stage-source-no-scripts:
clean-temp:
[delete] Deleting directory <http://apacheflexbuild.cloudapp.net:8080/job/flex-asjs/ws/temp>
[copy] Copying 18 files to <http://apacheflexbuild.cloudapp.net:8080/job/flex-asjs/ws/temp>
stage-framework-as:
[copy] Copying 2006 files to <http://apacheflexbuild.cloudapp.net:8080/job/flex-asjs/ws/temp/frameworks>
[echo] Updating config file air-config.xml with version 0.7.0.20160715
[echo] Updating config file flex-config.xml with version 0.7.0.20160715
[echo] Updating config file js-config.xml with version 0.7.0.20160715
[echo] Updating config file jquery-config.xml with version 0.7.0.20160715
[echo] Updating config file createjs-config.xml with version 0.7.0.20160715
[echo] Updating config file node-config.xml with version 0.7.0.20160715
[copy] Copying 1 file to <http://apacheflexbuild.cloudapp.net:8080/job/flex-asjs/ws/temp/asdoc>
[copy] Copying 3 files to <http://apacheflexbuild.cloudapp.net:8080/job/flex-asjs/ws/temp>
[copy] Copying 11 files to <http://apacheflexbuild.cloudapp.net:8080/job/flex-asjs/ws/temp/ide>
[copy] Copying 14 files to <http://apacheflexbuild.cloudapp.net:8080/job/flex-asjs/ws/temp/js/bin>
[copy] Copying 298 files to <http://apacheflexbuild.cloudapp.net:8080/job/flex-asjs/ws/temp/examples>
[copy] Copying 1 file to <http://apacheflexbuild.cloudapp.net:8080/job/flex-asjs/ws/temp/templates>
stage-source:
stage-scripts:
[copy] Copying 4 files to <http://apacheflexbuild.cloudapp.net:8080/job/flex-asjs/ws/temp/scripts>
stage-nightly:
[copy] Copying 1 file to <http://apacheflexbuild.cloudapp.net:8080/job/flex-asjs/ws/temp>
[copy] Copying 101 files to <http://apacheflexbuild.cloudapp.net:8080/job/flex-asjs/ws/temp/frameworks>
[copy] Copying 460 files to <http://apacheflexbuild.cloudapp.net:8080/job/flex-asjs/ws/temp/frameworks>
copy-gcl-from-goog-home:
[echo] Copying GCL from C:\google\closure\Library
[copy] Copying 28 files to <http://apacheflexbuild.cloudapp.net:8080/job/flex-asjs/ws/temp/js/lib/google/closure-library>
[copy] Copied 158 empty directories to 142 empty directories under <http://apacheflexbuild.cloudapp.net:8080/job/flex-asjs/ws/temp/js/lib/google/closure-library>
copy-gcl-from-downloaded:
inject-asf-header:
binary-package-zip:
[zip] Building zip: <http://apacheflexbuild.cloudapp.net:8080/job/flex-asjs/1248/artifact/out/apache-flex-flexjs-0.7.0-bin.zip>
binary-package-tgz:
[tar] Building tar: <http://apacheflexbuild.cloudapp.net:8080/job/flex-asjs/1248/artifact/out/apache-flex-flexjs-0.7.0-bin.tar.gz>
[copy] Copying 1 file to <http://apacheflexbuild.cloudapp.net:8080/job/flex-asjs/ws/out>
ja-locale-samples:
additional-packages:
binary-release:
rat-taskdef:
have-rattasks:
no-rattasks:
[echo] Rat report not generated.
[echo] rat jars (apache-rat-*.jar, apache-rat-tasks-*.jar)
[echo] not found in anttask.classpath
rat-check:
release:
create-md5:
[echo] Generating MD5 hashes for release artifacts
BUILD SUCCESSFUL
Total time: 32 minutes 40 seconds
Picked up JAVA_TOOL_OPTIONS: -Dfile.encoding=UTF8
[flex-asjs] $ cmd.exe /C "c:\Jenkins\tools\hudson.tasks.Ant_AntInstallation\c_apache-ant-1.9.3\bin\ant.bat -file build.xml -Dnightly=true -Djshint=C:\Users\apacheflexbuild\AppData\Roaming\npm\jshint_jenkins.cmd '"-Dbrowser=C:\Program Files (x86)\Mozilla Firefox\firefox.exe"' -Dgjslint=C:\Python27\Scripts\gjslint.exe -Dbuild.noprompt=true -Ddoc_output=<http://apacheflexbuild.cloudapp.net:8080/job/flex-asjs/1248/artifact/out/asdoc> -Dplayerglobal.version=11.7 asdoc-package doc-create-md5 && exit %%ERRORLEVEL%%"
Buildfile: <http://apacheflexbuild.cloudapp.net:8080/job/flex-asjs/ws/build.xml>
asdoc-package:
clean-temp:
[delete] Deleting directory <http://apacheflexbuild.cloudapp.net:8080/job/flex-asjs/ws/temp>
asdoc:
[echo] FLEX_HOME = <http://apacheflexbuild.cloudapp.net:8080/job/flex-asjs/ws/asdoc/../../flex-sdk>
[echo] flexlib = <http://apacheflexbuild.cloudapp.net:8080/job/flex-asjs/ws/frameworks>
[echo] doc_output = <http://apacheflexbuild.cloudapp.net:8080/job/flex-asjs/1248/artifact/out/asdoc>
[echo] compiler.source-path = <http://apacheflexbuild.cloudapp.net:8080/job/flex-asjs/ws/frameworks/projects/*/src/main/flex>
clean:
doc:
[asdoc] Loading configuration file C:\Jenkins\workspace\flex-asjs\frameworks\asdoc-config.xml
[asdoc] Error: unable to open '<http://apacheflexbuild.cloudapp.net:8080/job/flex-asjs/ws/frameworks/projects/Core/src/main/flex/org/apache/flex/utils/Language.as'>
[asdoc]
[asdoc] Use 'asdoc -help' for information about using the command line.
[asdoc] Picked up JAVA_TOOL_OPTIONS: -Dfile.encoding=UTF8
[asdoc] Apache Flex ASDoc
[asdoc] Version 4.16.0 build 0
[asdoc] Copyright 2016 The Apache Software Foundation.
[asdoc]
BUILD FAILED
<http://apacheflexbuild.cloudapp.net:8080/job/flex-asjs/ws/build.xml>:1059: The following error occurred while executing this line:
<http://apacheflexbuild.cloudapp.net:8080/job/flex-asjs/ws/build.xml>:513: The following error occurred while executing this line:
<http://apacheflexbuild.cloudapp.net:8080/job/flex-asjs/ws/asdoc/build.xml>:73: asdoc task failed.
Total time: 22 seconds
Picked up JAVA_TOOL_OPTIONS: -Dfile.encoding=UTF8
Build step 'Invoke Ant' marked build as failure
Skipped archiving because build is not successful
Build failed in Jenkins: flex-asjs #1247
Posted by fl...@gmail.com.
See <http://apacheflexbuild.cloudapp.net:8080/job/flex-asjs/1247/changes>
Changes:
[yishayjobs] Fix ticket
------------------------------------------
[...truncated 404 lines...]
[echo] flexlib = <http://apacheflexbuild.cloudapp.net:8080/job/flex-asjs/ws/frameworks>
[echo] doc_output = <http://apacheflexbuild.cloudapp.net:8080/job/flex-asjs/ws/asdoc-output>
[echo] compiler.source-path = <http://apacheflexbuild.cloudapp.net:8080/job/flex-asjs/ws/frameworks/projects/*/src/main/flex>
clean:
super-clean:
create-description:
[echo] build.number is 20160715
create-config:
playerglobal-setswfversion:
flex-config:
[copy] Copying 1 file to <http://apacheflexbuild.cloudapp.net:8080/job/flex-asjs/ws/frameworks>
playerglobal-setswfversion:
air-config:
[copy] Copying 1 file to <http://apacheflexbuild.cloudapp.net:8080/job/flex-asjs/ws/frameworks>
playerglobal-setswfversion:
js-config:
[copy] Copying 1 file to <http://apacheflexbuild.cloudapp.net:8080/job/flex-asjs/ws/frameworks>
playerglobal-setswfversion:
jquery-config:
[copy] Copying 1 file to <http://apacheflexbuild.cloudapp.net:8080/job/flex-asjs/ws/frameworks>
playerglobal-setswfversion:
createjs-config:
[copy] Copying 1 file to <http://apacheflexbuild.cloudapp.net:8080/job/flex-asjs/ws/frameworks>
playerglobal-setswfversion:
node-config:
[copy] Copying 1 file to <http://apacheflexbuild.cloudapp.net:8080/job/flex-asjs/ws/frameworks>
check-flex-home:
[echo] FLEX_HOME is C:\Jenkins\workspace\flex-sdk
[available] DEPRECATED - <available> used to override an existing property.
[available] Build file should not reuse the same property name for different values.
stage-source-no-scripts:
clean-temp:
[copy] Copying 18 files to <http://apacheflexbuild.cloudapp.net:8080/job/flex-asjs/ws/temp>
stage-framework-as:
[copy] Copying 912 files to <http://apacheflexbuild.cloudapp.net:8080/job/flex-asjs/ws/temp/frameworks>
[echo] Updating config file air-config.xml with version 0.7.0.20160715
[echo] Updating config file flex-config.xml with version 0.7.0.20160715
[echo] Updating config file js-config.xml with version 0.7.0.20160715
[echo] Updating config file jquery-config.xml with version 0.7.0.20160715
[echo] Updating config file createjs-config.xml with version 0.7.0.20160715
[echo] Updating config file node-config.xml with version 0.7.0.20160715
[copy] Copying 1 file to <http://apacheflexbuild.cloudapp.net:8080/job/flex-asjs/ws/temp/asdoc>
[copy] Copying 3 files to <http://apacheflexbuild.cloudapp.net:8080/job/flex-asjs/ws/temp>
[copy] Copying 11 files to <http://apacheflexbuild.cloudapp.net:8080/job/flex-asjs/ws/temp/ide>
[copy] Copying 14 files to <http://apacheflexbuild.cloudapp.net:8080/job/flex-asjs/ws/temp/js/bin>
[copy] Copying 298 files to <http://apacheflexbuild.cloudapp.net:8080/job/flex-asjs/ws/temp/examples>
[copy] Copying 1 file to <http://apacheflexbuild.cloudapp.net:8080/job/flex-asjs/ws/temp/templates>
stage-source:
stage-scripts:
[copy] Copying 4 files to <http://apacheflexbuild.cloudapp.net:8080/job/flex-asjs/ws/temp/scripts>
source-package-zip:
[mkdir] Created dir: <http://apacheflexbuild.cloudapp.net:8080/job/flex-asjs/ws/out>
[zip] Building zip: <http://apacheflexbuild.cloudapp.net:8080/job/flex-asjs/1247/artifact/out/apache-flex-flexjs-0.7.0-src.zip>
source-package-tgz:
[tar] Building tar: <http://apacheflexbuild.cloudapp.net:8080/job/flex-asjs/1247/artifact/out/apache-flex-flexjs-0.7.0-src.tar.gz>
source-package:
source-release:
setup-binary-release:
check-for-airsdk:
ask-or-fail:
check-git:
[echo] Checking for Git...
[exec] git version 1.9.0.msysgit.0
get-download-folder:
download-all:
ask-about-downloading-repos:
block-main:
check-if-ide:
thirdparty-downloads:
thirdparty-downloads:
swfobject-check:
swfobject-download:
[mkdir] Created dir: <http://apacheflexbuild.cloudapp.net:8080/job/flex-asjs/ws/in>
[get] Getting: https://codeload.github.com/swfobject/swfobject/zip/2.2
[get] To: <http://apacheflexbuild.cloudapp.net:8080/job/flex-asjs/ws/in/swfobject_2_2.zip>
[unzip] Expanding: <http://apacheflexbuild.cloudapp.net:8080/job/flex-asjs/ws/in/swfobject_2_2.zip> into <http://apacheflexbuild.cloudapp.net:8080/job/flex-asjs/ws/templates/swfobject>
flat-ui-check:
ask-flat:
get-flat-fonts:
[get] Getting: https://github.com/designmodo/Flat-UI/archive/2.2.2.zip
[get] To: <http://apacheflexbuild.cloudapp.net:8080/job/flex-asjs/ws/in/flat-ui_2_2.zip>
[get] https://github.com/designmodo/Flat-UI/archive/2.2.2.zip moved to https://codeload.github.com/designmodo/Flat-UI/zip/2.2.2
[unzip] Expanding: <http://apacheflexbuild.cloudapp.net:8080/job/flex-asjs/ws/in/flat-ui_2_2.zip> into <http://apacheflexbuild.cloudapp.net:8080/job/flex-asjs/ws/frameworks/fonts>
[unzip] Expanding: <http://apacheflexbuild.cloudapp.net:8080/job/flex-asjs/ws/in/flat-ui_2_2.zip> into <http://apacheflexbuild.cloudapp.net:8080/job/flex-asjs/ws/frameworks/fonts>
flat-ui-download:
check-goog-home:
[echo] GOOG_HOME is C:\google\closure\Library
gcl-download:
main:
[echo] Use thirdparty-clean or super-clean to remove these.
copy-externs:
[mkdir] Created dir: <http://apacheflexbuild.cloudapp.net:8080/job/flex-asjs/ws/js/libs>
[copy] Copying 8 files to <http://apacheflexbuild.cloudapp.net:8080/job/flex-asjs/ws/js/libs>
check_jquery:
rename_jquery:
[move] Moving 1 file to <http://apacheflexbuild.cloudapp.net:8080/job/flex-asjs/ws/js/libs>
prebuild:
frameworks:
check-compile-env:
check-playerglobal-home:
check-air-home:
check-falcon-home:
check-falconjx-home:
check-compile-env:
[echo] OS: Windows Server 2008 R2 / 6.1 / amd64
[echo] VM: Java HotSpot(TM) 64-Bit Server VM / 24.55-b03
[echo] Java: 1.7.0_55
[echo] Ant: Apache Ant(TM) version 1.9.3 compiled on December 23 2013 Ant Java Version: 1.7
clean:
clean:
clean:
clean:
clean:
clean:
clean:
clean:
clean:
clean:
clean:
clean:
clean:
clean:
clean:
clean:
clean:
clean:
clean:
clean:
thirdparty-downloads:
prepare:
compile:
Core:
clean:
check-falcon-home:
check-falconjx-home:
check-compiler:
compile-js-swc:
[echo] Compiling target/CoreJS.swc
[echo] FLEX_HOME: <http://apacheflexbuild.cloudapp.net:8080/job/flex-asjs/ws/>
[echo] FALCON_HOME: <http://apacheflexbuild.cloudapp.net:8080/job/flex-asjs/ws/../flex-falcon/compiler>
[mkdir] Created dir: <http://apacheflexbuild.cloudapp.net:8080/job/flex-asjs/ws/frameworks/js/FlexJS/libs>
[mkdir] Created dir: <http://apacheflexbuild.cloudapp.net:8080/job/flex-asjs/ws/frameworks/js/FlexJS/projects/CoreJS/target>
[compc] Loading configuration: <http://apacheflexbuild.cloudapp.net:8080/job/flex-asjs/ws/frameworks/js-config.xml>
[compc] Loading configuration: <http://apacheflexbuild.cloudapp.net:8080/job/flex-asjs/ws/frameworks/js/FlexJS/projects/CoreJS/src/main/config/compile-js-config.xml>
[compc]
[compc] <http://apacheflexbuild.cloudapp.net:8080/job/flex-asjs/ws/frameworks/js-config.xml>:75
[compc] Error: unable to open '<http://apacheflexbuild.cloudapp.net:8080/job/flex-asjs/ws/frameworks/libs/Core.swc'.>
[compc] <http://apacheflexbuild.cloudapp.net:8080/job/flex-asjs/ws/frameworks/js-config.xml> (line: 75)
[compc] </library-path>
[compc]
[compc]
[compc] Picked up JAVA_TOOL_OPTIONS: -Dfile.encoding=UTF8
BUILD FAILED
<http://apacheflexbuild.cloudapp.net:8080/job/flex-asjs/ws/build.xml>:469: The following error occurred while executing this line:
<http://apacheflexbuild.cloudapp.net:8080/job/flex-asjs/ws/frameworks/js/FlexJS/build.xml>:78: The following error occurred while executing this line:
<http://apacheflexbuild.cloudapp.net:8080/job/flex-asjs/ws/frameworks/js/FlexJS/build.xml>:152: The following error occurred while executing this line:
<http://apacheflexbuild.cloudapp.net:8080/job/flex-asjs/ws/frameworks/js/FlexJS/projects/CoreJS/build.xml>:75: compc task failed.
Total time: 1 minute 33 seconds
Picked up JAVA_TOOL_OPTIONS: -Dfile.encoding=UTF8
Build step 'Invoke Ant' marked build as failure
Skipped archiving because build is not successful
Build failed in Jenkins: flex-asjs #1246
Posted by fl...@gmail.com.
See <http://apacheflexbuild.cloudapp.net:8080/job/flex-asjs/1246/changes>
Changes:
[harbs] Added DOUBLE_CLICK constant to MouseEvent
------------------------------------------
[...truncated 404 lines...]
[echo] flexlib = <http://apacheflexbuild.cloudapp.net:8080/job/flex-asjs/ws/frameworks>
[echo] doc_output = <http://apacheflexbuild.cloudapp.net:8080/job/flex-asjs/ws/asdoc-output>
[echo] compiler.source-path = <http://apacheflexbuild.cloudapp.net:8080/job/flex-asjs/ws/frameworks/projects/*/src/main/flex>
clean:
super-clean:
create-description:
[echo] build.number is 20160715
create-config:
playerglobal-setswfversion:
flex-config:
[copy] Copying 1 file to <http://apacheflexbuild.cloudapp.net:8080/job/flex-asjs/ws/frameworks>
playerglobal-setswfversion:
air-config:
[copy] Copying 1 file to <http://apacheflexbuild.cloudapp.net:8080/job/flex-asjs/ws/frameworks>
playerglobal-setswfversion:
js-config:
[copy] Copying 1 file to <http://apacheflexbuild.cloudapp.net:8080/job/flex-asjs/ws/frameworks>
playerglobal-setswfversion:
jquery-config:
[copy] Copying 1 file to <http://apacheflexbuild.cloudapp.net:8080/job/flex-asjs/ws/frameworks>
playerglobal-setswfversion:
createjs-config:
[copy] Copying 1 file to <http://apacheflexbuild.cloudapp.net:8080/job/flex-asjs/ws/frameworks>
playerglobal-setswfversion:
node-config:
[copy] Copying 1 file to <http://apacheflexbuild.cloudapp.net:8080/job/flex-asjs/ws/frameworks>
check-flex-home:
[echo] FLEX_HOME is C:\Jenkins\workspace\flex-sdk
[available] DEPRECATED - <available> used to override an existing property.
[available] Build file should not reuse the same property name for different values.
stage-source-no-scripts:
clean-temp:
[copy] Copying 18 files to <http://apacheflexbuild.cloudapp.net:8080/job/flex-asjs/ws/temp>
stage-framework-as:
[copy] Copying 912 files to <http://apacheflexbuild.cloudapp.net:8080/job/flex-asjs/ws/temp/frameworks>
[echo] Updating config file air-config.xml with version 0.7.0.20160715
[echo] Updating config file flex-config.xml with version 0.7.0.20160715
[echo] Updating config file js-config.xml with version 0.7.0.20160715
[echo] Updating config file jquery-config.xml with version 0.7.0.20160715
[echo] Updating config file createjs-config.xml with version 0.7.0.20160715
[echo] Updating config file node-config.xml with version 0.7.0.20160715
[copy] Copying 1 file to <http://apacheflexbuild.cloudapp.net:8080/job/flex-asjs/ws/temp/asdoc>
[copy] Copying 3 files to <http://apacheflexbuild.cloudapp.net:8080/job/flex-asjs/ws/temp>
[copy] Copying 11 files to <http://apacheflexbuild.cloudapp.net:8080/job/flex-asjs/ws/temp/ide>
[copy] Copying 14 files to <http://apacheflexbuild.cloudapp.net:8080/job/flex-asjs/ws/temp/js/bin>
[copy] Copying 298 files to <http://apacheflexbuild.cloudapp.net:8080/job/flex-asjs/ws/temp/examples>
[copy] Copying 1 file to <http://apacheflexbuild.cloudapp.net:8080/job/flex-asjs/ws/temp/templates>
stage-source:
stage-scripts:
[copy] Copying 4 files to <http://apacheflexbuild.cloudapp.net:8080/job/flex-asjs/ws/temp/scripts>
source-package-zip:
[mkdir] Created dir: <http://apacheflexbuild.cloudapp.net:8080/job/flex-asjs/ws/out>
[zip] Building zip: <http://apacheflexbuild.cloudapp.net:8080/job/flex-asjs/1246/artifact/out/apache-flex-flexjs-0.7.0-src.zip>
source-package-tgz:
[tar] Building tar: <http://apacheflexbuild.cloudapp.net:8080/job/flex-asjs/1246/artifact/out/apache-flex-flexjs-0.7.0-src.tar.gz>
source-package:
source-release:
setup-binary-release:
check-for-airsdk:
ask-or-fail:
check-git:
[echo] Checking for Git...
[exec] git version 1.9.0.msysgit.0
get-download-folder:
download-all:
ask-about-downloading-repos:
block-main:
check-if-ide:
thirdparty-downloads:
thirdparty-downloads:
swfobject-check:
swfobject-download:
[mkdir] Created dir: <http://apacheflexbuild.cloudapp.net:8080/job/flex-asjs/ws/in>
[get] Getting: https://codeload.github.com/swfobject/swfobject/zip/2.2
[get] To: <http://apacheflexbuild.cloudapp.net:8080/job/flex-asjs/ws/in/swfobject_2_2.zip>
[unzip] Expanding: <http://apacheflexbuild.cloudapp.net:8080/job/flex-asjs/ws/in/swfobject_2_2.zip> into <http://apacheflexbuild.cloudapp.net:8080/job/flex-asjs/ws/templates/swfobject>
flat-ui-check:
ask-flat:
get-flat-fonts:
[get] Getting: https://github.com/designmodo/Flat-UI/archive/2.2.2.zip
[get] To: <http://apacheflexbuild.cloudapp.net:8080/job/flex-asjs/ws/in/flat-ui_2_2.zip>
[get] https://github.com/designmodo/Flat-UI/archive/2.2.2.zip moved to https://codeload.github.com/designmodo/Flat-UI/zip/2.2.2
[unzip] Expanding: <http://apacheflexbuild.cloudapp.net:8080/job/flex-asjs/ws/in/flat-ui_2_2.zip> into <http://apacheflexbuild.cloudapp.net:8080/job/flex-asjs/ws/frameworks/fonts>
[unzip] Expanding: <http://apacheflexbuild.cloudapp.net:8080/job/flex-asjs/ws/in/flat-ui_2_2.zip> into <http://apacheflexbuild.cloudapp.net:8080/job/flex-asjs/ws/frameworks/fonts>
flat-ui-download:
check-goog-home:
[echo] GOOG_HOME is C:\google\closure\Library
gcl-download:
main:
[echo] Use thirdparty-clean or super-clean to remove these.
copy-externs:
[mkdir] Created dir: <http://apacheflexbuild.cloudapp.net:8080/job/flex-asjs/ws/js/libs>
[copy] Copying 8 files to <http://apacheflexbuild.cloudapp.net:8080/job/flex-asjs/ws/js/libs>
check_jquery:
rename_jquery:
[move] Moving 1 file to <http://apacheflexbuild.cloudapp.net:8080/job/flex-asjs/ws/js/libs>
prebuild:
frameworks:
check-compile-env:
check-playerglobal-home:
check-air-home:
check-falcon-home:
check-falconjx-home:
check-compile-env:
[echo] OS: Windows Server 2008 R2 / 6.1 / amd64
[echo] VM: Java HotSpot(TM) 64-Bit Server VM / 24.55-b03
[echo] Java: 1.7.0_55
[echo] Ant: Apache Ant(TM) version 1.9.3 compiled on December 23 2013 Ant Java Version: 1.7
clean:
clean:
clean:
clean:
clean:
clean:
clean:
clean:
clean:
clean:
clean:
clean:
clean:
clean:
clean:
clean:
clean:
clean:
clean:
clean:
thirdparty-downloads:
prepare:
compile:
Core:
clean:
check-falcon-home:
check-falconjx-home:
check-compiler:
compile-js-swc:
[echo] Compiling target/CoreJS.swc
[echo] FLEX_HOME: <http://apacheflexbuild.cloudapp.net:8080/job/flex-asjs/ws/>
[echo] FALCON_HOME: <http://apacheflexbuild.cloudapp.net:8080/job/flex-asjs/ws/../flex-falcon/compiler>
[mkdir] Created dir: <http://apacheflexbuild.cloudapp.net:8080/job/flex-asjs/ws/frameworks/js/FlexJS/libs>
[mkdir] Created dir: <http://apacheflexbuild.cloudapp.net:8080/job/flex-asjs/ws/frameworks/js/FlexJS/projects/CoreJS/target>
[compc] Loading configuration: <http://apacheflexbuild.cloudapp.net:8080/job/flex-asjs/ws/frameworks/js-config.xml>
[compc] Loading configuration: <http://apacheflexbuild.cloudapp.net:8080/job/flex-asjs/ws/frameworks/js/FlexJS/projects/CoreJS/src/main/config/compile-js-config.xml>
[compc]
[compc] <http://apacheflexbuild.cloudapp.net:8080/job/flex-asjs/ws/frameworks/js-config.xml>:75
[compc] Error: unable to open '<http://apacheflexbuild.cloudapp.net:8080/job/flex-asjs/ws/frameworks/libs/Core.swc'.>
[compc] <http://apacheflexbuild.cloudapp.net:8080/job/flex-asjs/ws/frameworks/js-config.xml> (line: 75)
[compc] </library-path>
[compc]
[compc]
[compc] Picked up JAVA_TOOL_OPTIONS: -Dfile.encoding=UTF8
BUILD FAILED
<http://apacheflexbuild.cloudapp.net:8080/job/flex-asjs/ws/build.xml>:469: The following error occurred while executing this line:
<http://apacheflexbuild.cloudapp.net:8080/job/flex-asjs/ws/frameworks/js/FlexJS/build.xml>:78: The following error occurred while executing this line:
<http://apacheflexbuild.cloudapp.net:8080/job/flex-asjs/ws/frameworks/js/FlexJS/build.xml>:152: The following error occurred while executing this line:
<http://apacheflexbuild.cloudapp.net:8080/job/flex-asjs/ws/frameworks/js/FlexJS/projects/CoreJS/build.xml>:75: compc task failed.
Total time: 1 minute 16 seconds
Picked up JAVA_TOOL_OPTIONS: -Dfile.encoding=UTF8
Build step 'Invoke Ant' marked build as failure
Skipped archiving because build is not successful