You are viewing a plain text version of this content. The canonical link for it is here.
Posted to builds@cassandra.apache.org by Apache Jenkins Server <je...@builds.apache.org> on 2021/12/20 15:37:45 UTC
Build complete: Cassandra-trunk #892 [UNSTABLE] 11952fae774d51d4e268dae506803fef874c8c50
-------------------------------------------------------------------------------
Build Cassandra-trunk #892 Still Unstable
URL: https://ci-cassandra.apache.org/job/Cassandra-trunk/892/
-------------------------------------------------------------------------------
Changes:
[Benjamin Lerer] Avoid unecessary array allocations and initializations when performing
-------------------------------------------------------------------------------
Failed Tests:
15 tests failed.
FAILED: org.apache.cassandra.distributed.upgrade.MixedModeAvailabilityV3XTest.testAvailability
FAILED: org.apache.cassandra.db.commitlog.CommitLogSegmentManagerCDCTest.testNonblockingShouldMaintainSteadyDiskUsage
FAILED: org.apache.cassandra.db.commitlog.CommitLogSegmentManagerCDCTest.testNonblockingShouldMaintainSteadyDiskUsage
FAILED: org.apache.cassandra.db.commitlog.CommitLogSegmentManagerCDCTest.testNonblockingShouldMaintainSteadyDiskUsage
FAILED: org.apache.cassandra.net.ProxyHandlerConnectionsTest.testExpireSome-compression
FAILED: org.apache.cassandra.db.commitlog.CommitLogInitWithExceptionTest.testCommitLogInitWithException
FAILED: dtest-upgrade.upgrade_tests.upgrade_through_versions_test.TestProtoV3Upgrade_AllVersions_EndsAt_3_11_X.test_rolling_upgrade
FAILED: dtest-upgrade.upgrade_tests.upgrade_through_versions_test.TestProtoV3Upgrade_AllVersions_EndsAt_3_11_X.test_rolling_upgrade_with_internode_ssl
FAILED: dtest-upgrade.upgrade_tests.cql_tests.TestCQLNodes3RF3_Upgrade_indev_4_0_x_To_indev_trunk.test_timeuuid
FAILED: dtest-upgrade.upgrade_tests.upgrade_through_versions_test.TestProtoV3Upgrade_AllVersions_RandomPartitioner_EndsAt_3_11_X_HEAD.test_rolling_upgrade
FAILED: dtest-upgrade.upgrade_tests.upgrade_through_versions_test.TestProtoV3Upgrade_AllVersions_RandomPartitioner_EndsAt_3_11_X_HEAD.test_rolling_upgrade_with_internode_ssl
FAILED: dtest-upgrade.upgrade_tests.cql_tests.TestCQLNodes2RF1_Upgrade_current_4_0_x_To_indev_trunk.test_timeuuid
FAILED: dtest-upgrade.upgrade_tests.cql_tests.cls.test_timeuuid
FAILED: dtest-upgrade.upgrade_tests.cql_tests.TestCQLNodes2RF1_Upgrade_indev_4_0_x_To_indev_trunk.test_timeuuid
FAILED: dtest-upgrade.upgrade_tests.cql_tests.TestCQLNodes3RF3_Upgrade_current_4_0_x_To_indev_trunk.test_timeuuid
-------------------------------------------------------------------------------
For complete test report and logs see https://nightlies.apache.org/cassandra/Cassandra-trunk/892/