You are viewing a plain text version of this content. The canonical link for it is here.
Posted to builds@solr.apache.org by Apache Jenkins Server <je...@builds.apache.org> on 2025/12/12 00:34:24 UTC

[JENKINS] Solr » Solr-Test-10.0 - Build # 551 - Still Failing!

Build: https://ci-builds.apache.org/job/Solr/job/Solr-Test-10.0/551/

No tests ran.

Build Log:
[...truncated 163 lines...]
BUILD FAILED in 1m 23s
54 actionable tasks: 54 executed

Publishing build scan...
https://develocity.apache.org/s/fymwvplzxyh5k

Build step 'Invoke Gradle script' changed build result to FAILURE
Build step 'Invoke Gradle script' marked build as failure
Archiving artifacts
Recording test results
ERROR: Step ‘Publish JUnit test result report’ failed: No test report files were found. Configuration error?
Email was triggered for: Failure - Any
Sending email for trigger: Failure - Any

[JENKINS] Solr » Solr-Test-10.0 - Build # 557 - Still Failing!

Posted by Apache Jenkins Server <je...@builds.apache.org>.
Build: https://ci-builds.apache.org/job/Solr/job/Solr-Test-10.0/557/

No tests ran.

Build Log:
[...truncated 164 lines...]
BUILD FAILED in 1m 32s
54 actionable tasks: 54 executed

Publishing build scan...
https://develocity.apache.org/s/mm4zreepv5cri

Build step 'Invoke Gradle script' changed build result to FAILURE
Build step 'Invoke Gradle script' marked build as failure
Archiving artifacts
Recording test results
ERROR: Step ‘Publish JUnit test result report’ failed: No test report files were found. Configuration error?
Email was triggered for: Failure - Any
Sending email for trigger: Failure - Any

[JENKINS] Solr » Solr-Test-10.0 - Build # 556 - Still Failing!

Posted by Apache Jenkins Server <je...@builds.apache.org>.
Build: https://ci-builds.apache.org/job/Solr/job/Solr-Test-10.0/556/

No tests ran.

Build Log:
[...truncated 163 lines...]
BUILD FAILED in 1m 23s
54 actionable tasks: 54 executed

Publishing build scan...
https://develocity.apache.org/s/q7ahn2btgsgwo

Build step 'Invoke Gradle script' changed build result to FAILURE
Build step 'Invoke Gradle script' marked build as failure
Archiving artifacts
Recording test results
ERROR: Step ‘Publish JUnit test result report’ failed: No test report files were found. Configuration error?
Email was triggered for: Failure - Any
Sending email for trigger: Failure - Any

[JENKINS] Solr » Solr-Test-10.0 - Build # 555 - Still Failing!

Posted by Apache Jenkins Server <je...@builds.apache.org>.
Build: https://ci-builds.apache.org/job/Solr/job/Solr-Test-10.0/555/

No tests ran.

Build Log:
[...truncated 163 lines...]
BUILD FAILED in 1m 22s
54 actionable tasks: 54 executed

Publishing build scan...
https://develocity.apache.org/s/sqjzoifrsuh2s

Build step 'Invoke Gradle script' changed build result to FAILURE
Build step 'Invoke Gradle script' marked build as failure
Archiving artifacts
Recording test results
ERROR: Step ‘Publish JUnit test result report’ failed: No test report files were found. Configuration error?
Email was triggered for: Failure - Any
Sending email for trigger: Failure - Any

[JENKINS] Solr » Solr-Test-10.0 - Build # 554 - Still Failing!

Posted by Apache Jenkins Server <je...@builds.apache.org>.
Build: https://ci-builds.apache.org/job/Solr/job/Solr-Test-10.0/554/

No tests ran.

Build Log:
[...truncated 164 lines...]
BUILD FAILED in 1m 32s
54 actionable tasks: 54 executed

Publishing build scan...
https://develocity.apache.org/s/pzwt4xabgrmbw

Build step 'Invoke Gradle script' changed build result to FAILURE
Build step 'Invoke Gradle script' marked build as failure
Archiving artifacts
Recording test results
ERROR: Step ‘Publish JUnit test result report’ failed: No test report files were found. Configuration error?
Email was triggered for: Failure - Any
Sending email for trigger: Failure - Any

[JENKINS] Solr » Solr-Test-10.0 - Build # 553 - Still Failing!

Posted by Apache Jenkins Server <je...@builds.apache.org>.
Build: https://ci-builds.apache.org/job/Solr/job/Solr-Test-10.0/553/

No tests ran.

Build Log:
[...truncated 163 lines...]
BUILD FAILED in 1m 28s
54 actionable tasks: 54 executed

Publishing build scan...
https://develocity.apache.org/s/w46bgd6vudxr4

Build step 'Invoke Gradle script' changed build result to FAILURE
Build step 'Invoke Gradle script' marked build as failure
Archiving artifacts
Recording test results
ERROR: Step ‘Publish JUnit test result report’ failed: No test report files were found. Configuration error?
Email was triggered for: Failure - Any
Sending email for trigger: Failure - Any

[JENKINS] Solr » Solr-Test-10.0 - Build # 552 - Still Failing!

Posted by Apache Jenkins Server <je...@builds.apache.org>.
Build: https://ci-builds.apache.org/job/Solr/job/Solr-Test-10.0/552/

No tests ran.

Build Log:
[...truncated 163 lines...]
BUILD FAILED in 1m 29s
54 actionable tasks: 54 executed

Publishing build scan...
https://develocity.apache.org/s/giqcc2fprpxxs

Build step 'Invoke Gradle script' changed build result to FAILURE
Build step 'Invoke Gradle script' marked build as failure
Archiving artifacts
Recording test results
ERROR: Step ‘Publish JUnit test result report’ failed: No test report files were found. Configuration error?
Email was triggered for: Failure - Any
Sending email for trigger: Failure - Any