You are viewing a plain text version of this content. The canonical link for it is here.
Posted to builds@hbase.apache.org by Apache Jenkins Server <je...@builds.apache.org> on 2017/02/28 11:07:29 UTC
Build failed in Jenkins: HBase-1.2-IT » IntegrationTestAcidGuarantees,JDK 1.7 (latest),Hadoop #607
See <https://builds.apache.org/job/HBase-1.2-IT/it.test=IntegrationTestAcidGuarantees,jdk=JDK%201.7%20(latest),label=Hadoop/607/display/redirect?page=changes>
Changes:
[jingchengdu] HBASE-17688 MultiRowRangeFilter not working correctly if given same
------------------------------------------
[...truncated 4.20 MB...]
SUREFIRE-859: [GC 2891253K->1662749K(3276288K), 0.0201140 secs]
SUREFIRE-859: [GC 2946333K->1713043K(3278848K), 0.0201730 secs]
SUREFIRE-859: [GC 2996584K->1735551K(3282944K), 0.0235190 secs]
SUREFIRE-859: [GC 3024249K->1776768K(3258368K), 0.0237240 secs]
SUREFIRE-859: [GC 3065472K->1826873K(3281920K), 0.0311530 secs]
SUREFIRE-859: [GC 3116601K->1887885K(3280896K), 0.0301560 secs]
SUREFIRE-859: [GC 3177613K->1894134K(3280896K), 0.0196740 secs]
SUREFIRE-859: [Full GC 1894134K->1295856K(3642368K), 0.2602840 secs]
SUREFIRE-859: [GC 2579440K->1328986K(3618304K), 0.0156310 secs]
SUREFIRE-859: [GC 2612570K->1385092K(3631104K), 0.0190960 secs]
SUREFIRE-859: [GC 2659460K->1448577K(3637760K), 0.0188580 secs]
SUREFIRE-859: [GC 2722890K->1493660K(3635712K), 0.0211730 secs]
SUREFIRE-859: [GC 2771070K->1528326K(3638272K), 0.0219180 secs]
SUREFIRE-859: [GC 2805766K->1556493K(3638784K), 0.0280120 secs]
SUREFIRE-859: [GC 2838029K->1619192K(3639808K), 0.0270550 secs]
SUREFIRE-859: [GC 2900728K->1629618K(3641856K), 0.0254020 secs]
SUREFIRE-859: [GC 2915250K->1654607K(3641856K), 0.0242920 secs]
SUREFIRE-859: [GC 2940231K->1664479K(3641856K), 0.0268750 secs]
SUREFIRE-859: [GC 2952671K->1697018K(3642368K), 0.0249150 secs]
SUREFIRE-859: [GC 2985210K->1730717K(3638784K), 0.0279190 secs]
SUREFIRE-859: [GC 3014289K->1764413K(3642368K), 0.0261870 secs]
SUREFIRE-859: [GC 3047997K->1805247K(3638784K), 0.0251160 secs]
SUREFIRE-859: [GC 3089325K->1848912K(3640832K), 0.0208920 secs]
SUREFIRE-859: [GC 3133008K->1885785K(3640832K), 0.0247160 secs]
SUREFIRE-859: [GC 3175001K->1931637K(3642880K), 0.0249260 secs]
SUREFIRE-859: [GC 3220853K->1994639K(3645952K), 0.0290670 secs]
SUREFIRE-859: [GC 3288463K->2013693K(3647488K), 0.0285730 secs]
SUREFIRE-859: [GC 3307517K->2037230K(3646976K), 0.0325690 secs]
SUREFIRE-859: [GC 3332078K->2085808K(3637760K), 0.0335650 secs]
SUREFIRE-859: [GC 3380656K->2086624K(3640832K), 0.0281290 secs]
SUREFIRE-859: [GC 3373280K->2087018K(3590656K), 0.0202940 secs]
SUREFIRE-859: [GC 3373674K->2089417K(3640832K), 0.0157470 secs]
SUREFIRE-859: [GC 3370953K->2089839K(3585536K), 0.0169970 secs]
SUREFIRE-859: [GC 3371375K->2093237K(3641344K), 0.0202980 secs]
SUREFIRE-859: [GC 3374261K->2091884K(3584000K), 0.0148750 secs]
SUREFIRE-859: [GC 3372908K->2095855K(3641856K), 0.0211950 secs]
SUREFIRE-859: [GC 3378415K->2093647K(3640320K), 0.0252710 secs]
SUREFIRE-859: [GC 3376207K->2196621K(3586560K), 0.0309650 secs]
SUREFIRE-859: [GC 3426957K->2435822K(3666944K), 0.0853850 secs]
SUREFIRE-859: [Full GC 2435822K->1592155K(4020736K), 0.4811660 secs]
SUREFIRE-859: [GC 2820548K->1766932K(3766784K), 0.0366300 secs]
SUREFIRE-859: [GC 2743316K->2004375K(3885568K), 0.0457470 secs]
SUREFIRE-859: [GC 2980759K->2134147K(3805696K), 0.0538110 secs]
SUREFIRE-859: [GC 3014275K->2247810K(3845632K), 0.0451620 secs]
SUREFIRE-859: [GC 3127938K->2356539K(3801600K), 0.0387360 secs]
SUREFIRE-859: [GC 3252027K->2461332K(3831296K), 0.0360720 secs]
SUREFIRE-859: [GC 3356817K->2467026K(3869184K), 0.0452780 secs]
SUREFIRE-859: [GC 3399378K->2519552K(3868672K), 0.0337190 secs]
SUREFIRE-859: [Full GC 2519552K->1497551K(3906048K), 0.2862360 secs]
SUREFIRE-859: [GC 2429864K->1532121K(3896320K), 0.0128030 secs]
SUREFIRE-859: [GC 2470617K->1579737K(3904000K), 0.0245150 secs]
SUREFIRE-859: [GC 2518215K->1618396K(3907584K), 0.0226590 secs]
SUREFIRE-859: [GC 2584529K->1689684K(3912192K), 0.0276540 secs]
SUREFIRE-859: [GC 2655828K->1738956K(3928576K), 0.0240960 secs]
SUREFIRE-859: [GC 2744517K->1752228K(3930624K), 0.0170260 secs]
SUREFIRE-859: [GC 2757751K->1780582K(3949056K), 0.0174500 secs]
SUREFIRE-859: [GC 2819942K->1828580K(3954176K), 0.0306160 secs]
SUREFIRE-859: [GC 2867940K->1852911K(3963392K), 0.0229730 secs]
SUREFIRE-859: [GC 2918895K->1909290K(3964928K), 0.0242790 secs]
SUREFIRE-859: [GC 2975274K->1942562K(3980288K), 0.0218910 secs]
SUREFIRE-859: [GC 3038754K->1972053K(3978752K), 0.0173530 secs]
SUREFIRE-859: [GC 3068202K->2004011K(3995648K), 0.0164340 secs]
SUREFIRE-859: [GC 3125801K->2053408K(3998208K), 0.0298810 secs]
SUREFIRE-859: [GC 3175200K->2084588K(4000256K), 0.0312280 secs]
SUREFIRE-859: [GC 3225324K->2113927K(4002304K), 0.0260700 secs]
SUREFIRE-859: [GC 3254663K->2153849K(4023296K), 0.0177730 secs]
SUREFIRE-859: [GC 3319673K->2200904K(4022272K), 0.0225110 secs]
SUREFIRE-859: [GC 3366728K->2229514K(4024320K), 0.0276030 secs]
SUREFIRE-859: [GC 3406602K->2273669K(4023808K), 0.0297840 secs]
SUREFIRE-859: [GC 3450757K->2319473K(4034560K), 0.0226240 secs]
SUREFIRE-859: [GC 3515979K->2335459K(4033536K), 0.0237850 secs]
SUREFIRE-859: [GC 3532003K->2374764K(4045312K), 0.0225200 secs]
SUREFIRE-859: [GC 3589228K->2423635K(4044800K), 0.0229230 secs]
SUREFIRE-859: [GC 3638092K->2461030K(4051456K), 0.0190670 secs]
SUREFIRE-859: [GC 3689830K->2499071K(4050432K), 0.0170820 secs]
SUREFIRE-859: [GC 3727871K->2533230K(4058112K), 0.0249510 secs]
SUREFIRE-859: [GC 3776878K->2552741K(4060160K), 0.0360400 secs]
SUREFIRE-859: [GC 3796348K->2580910K(4064256K), 0.0341520 secs]
SUREFIRE-859: [GC 3834798K->2622574K(4067328K), 0.0288300 secs]
SUREFIRE-859: [GC 3876462K->2669941K(4066304K), 0.0252050 secs]
SUREFIRE-859: [GC 3930997K->2710866K(4069888K), 0.0278400 secs]
SUREFIRE-859: [GC 3971922K->2745552K(4075520K), 0.0339850 secs]
SUREFIRE-859: [Full GC 2745552K->2252430K(4127744K), 0.7482160 secs]
SUREFIRE-859: [GC 3521166K->2285087K(4097536K), 0.0269540 secs]
SUREFIRE-859: [GC 3553823K->2336136K(4124672K), 0.0298270 secs]
SUREFIRE-859: [GC 3603799K->2344774K(4128256K), 0.0176260 secs]
SUREFIRE-859: [GC 3612486K->2408203K(4129792K), 0.0240940 secs]
SUREFIRE-859: [GC 3679471K->2443874K(4103680K), 0.0201750 secs]
SUREFIRE-859: [GC 3715170K->2483818K(4128256K), 0.0232810 secs]
SUREFIRE-859: [GC 3755114K->2499419K(4129280K), 0.0263270 secs]
SUREFIRE-859: [GC 3770715K->2528126K(4130304K), 0.0270500 secs]
SUREFIRE-859: [GC 3804546K->2547869K(4130816K), 0.0292560 secs]
SUREFIRE-859: [GC 3824298K->2570728K(4133376K), 0.0232100 secs]
SUREFIRE-859: [GC 3850216K->2574316K(4134912K), 0.0212170 secs]
SUREFIRE-859: [GC 3853804K->2573052K(4133888K), 0.0195550 secs]
SUREFIRE-859: [GC 3852549K->2708446K(4134400K), 0.0340640 secs]
SUREFIRE-859: [GC-- 3988137K->4134363K(4134400K), 0.3407950 secs]
SUREFIRE-859: [Full GC 4134363K->2308575K(4134400K), 0.5771710 secs]
SUREFIRE-859: [GC 3588198K->2458183K(3983872K), 0.0308990 secs]
SUREFIRE-859: [GC 3588238K->2556833K(4021248K), 0.0321790 secs]
SUREFIRE-859: [GC 3684933K->2627344K(4056576K), 0.0308510 secs]
SUREFIRE-859: [GC 3744156K->2632818K(4050432K), 0.0156560 secs]
SUREFIRE-859: [GC 3749881K->2675736K(4047360K), 0.0256740 secs]
SUREFIRE-859: [GC 3798619K->2723858K(4048896K), 0.0337690 secs]
SUREFIRE-859: [GC 3847255K->2764738K(4058112K), 0.0254830 secs]
SUREFIRE-859: [Full GC 2764738K->2154027K(4058112K), 0.6854080 secs]
SUREFIRE-859: [GC 3300230K->2226273K(4058112K), 0.0295340 secs]
SUREFIRE-859: [GC 3372389K->2259474K(4049408K), 0.0287460 secs]
SUREFIRE-859: [GC 3394669K->2279121K(4062720K), 0.0309760 secs]
SUREFIRE-859: [GC 3414438K->2312615K(4051456K), 0.0251150 secs]
SUREFIRE-859: [GC 3455343K->2373350K(4060160K), 0.0284010 secs]
SUREFIRE-859: [GC 3516140K->2398589K(4068864K), 0.0396690 secs]
SUREFIRE-859: [GC 3548272K->2431902K(3991552K), 0.0404900 secs]
SUREFIRE-859: [GC 3581436K->2430522K(4063744K), 0.0243430 secs]
Tests run: 1, Failures: 0, Errors: 0, Skipped: 0, Time elapsed: 634.64 sec - in org.apache.hadoop.hbase.IntegrationTestIngestWithTags
Results :
Failed tests:
IntegrationTestRegionReplicaReplication.testIngest:112->runIngestTest:197 Load failed with error code 1
IntegrationTestBulkLoad.testBulkLoad:217->runCheck:719 expected:<true> but was:<false>
Tests in error:
IntegrationTestIngestWithACL>IntegrationTestBase.setUp:133->setUpCluster:64->IntegrationTestIngest.setUpCluster:84 » IO
IntegrationTestMTTR.testKillRsHoldingMeta:278->run:319 » Execution java.io.IOE...
IntegrationTestMTTR.testRestartRsHoldingTable:273->run:319 » Execution java.io...
IntegrationTestBigLinkedListWithVisibility.testContinuousIngest:636 » Runtime ...
IntegrationTestWithCellVisibilityLoadAndVerify>IntegrationTestLoadAndVerify.testLoadAndVerify:545->doVerify:293->access$400:79->doVerify:338 » FileAlreadyExists
Tests run: 32, Failures: 2, Errors: 5, Skipped: 2
[WARNING] File encoding has not been set, using platform encoding ISO-8859-1, i.e. build is platform dependent! The file encoding for reports output files should be provided by the POM property ${project.reporting.outputEncoding}.
[INFO]
[INFO] --- maven-failsafe-plugin:2.18.1:verify (verify) @ hbase-it ---
[INFO] Failsafe report directory: <https://builds.apache.org/job/HBase-1.2-IT/it.test=IntegrationTestAcidGuarantees,jdk=JDK%201.7%20(latest),label=Hadoop/ws/hbase-it/target/failsafe-reports>
[WARNING] File encoding has not been set, using platform encoding ISO-8859-1, i.e. build is platform dependent! The file encoding for reports output files should be provided by the POM property ${project.reporting.outputEncoding}.
[INFO] ------------------------------------------------------------------------
[INFO] Reactor Summary:
[INFO]
[INFO] Apache HBase ...................................... SUCCESS [1:43.826s]
[INFO] Apache HBase - Checkstyle ......................... SUCCESS [7.587s]
[INFO] Apache HBase - Resource Bundle .................... SUCCESS [0.258s]
[INFO] Apache HBase - Annotations ........................ SUCCESS [1.272s]
[INFO] Apache HBase - Protocol ........................... SUCCESS [17.958s]
[INFO] Apache HBase - Common ............................. SUCCESS [1:45.159s]
[INFO] Apache HBase - Procedure .......................... SUCCESS [1.469s]
[INFO] Apache HBase - Client ............................. SUCCESS [11.946s]
[INFO] Apache HBase - Hadoop Compatibility ............... SUCCESS [2.573s]
[INFO] Apache HBase - Hadoop Two Compatibility ........... SUCCESS [3.610s]
[INFO] Apache HBase - Prefix Tree ........................ SUCCESS [1.188s]
[INFO] Apache HBase - Server ............................. SUCCESS [1:47.996s]
[INFO] Apache HBase - Testing Util ....................... SUCCESS [2.413s]
[INFO] Apache HBase - Thrift ............................. SUCCESS [10.525s]
[INFO] Apache HBase - Rest ............................... SUCCESS [2.899s]
[INFO] Apache HBase - Shell .............................. SUCCESS [5.036s]
[INFO] Apache HBase - Integration Tests .................. FAILURE [3:21:55.054s]
[INFO] Apache HBase - Examples ........................... SKIPPED
[INFO] Apache HBase - External Block Cache ............... SKIPPED
[INFO] Apache HBase - Assembly ........................... SKIPPED
[INFO] Apache HBase - Shaded ............................. SKIPPED
[INFO] Apache HBase - Shaded - Client .................... SKIPPED
[INFO] Apache HBase - Shaded - Server .................... SKIPPED
[INFO] ------------------------------------------------------------------------
[INFO] BUILD FAILURE
[INFO] ------------------------------------------------------------------------
[INFO] Total time: 3:28:53.074s
[INFO] Finished at: Tue Feb 28 10:57:14 UTC 2017
[INFO] Final Memory: 75M/566M
[INFO] ------------------------------------------------------------------------
[ERROR] Failed to execute goal org.apache.maven.plugins:maven-failsafe-plugin:2.18.1:verify (verify) on project hbase-it: There was a timeout or other error in the fork -> [Help 1]
[ERROR]
[ERROR] To see the full stack trace of the errors, re-run Maven with the -e switch.
[ERROR] Re-run Maven using the -X switch to enable full debug logging.
[ERROR]
[ERROR] For more information about the errors and possible solutions, please read the following articles:
[ERROR] [Help 1] http://cwiki.apache.org/confluence/display/MAVEN/MojoFailureException
[ERROR]
[ERROR] After correcting the problems, you can resume the build with the command
[ERROR] mvn <goals> -rf :hbase-it
Build step 'Invoke top-level Maven targets' marked build as failure
Performing Post build task...
Match found for :.* : True
Logical operation result is TRUE
Running script : # Post-build task script. TODO: Check this in and have all builds reference check-in.
pwd && ls
# NOTE!!!! The below code has been copied and pasted from ./dev-tools/run-test.sh
# Do not change here without syncing there and vice-versa.
ZOMBIE_TESTS_COUNT=`jps -v | grep surefirebooter | grep -e '-Dhbase.test' | wc -l`
if [[ $ZOMBIE_TESTS_COUNT != 0 ]] ; then
echo "Suspicious java process found - waiting 30s to see if there are just slow to stop"
sleep 30
ZOMBIE_TESTS_COUNT=`jps -v | grep surefirebooter | grep -e '-Dhbase.test' | wc -l`
if [[ $ZOMBIE_TESTS_COUNT != 0 ]] ; then
echo " {color:red}There appear to be $ZOMBIE_TESTS_COUNT zombie tests{color}, they should have been killed by surefire but survived"
jps -v | grep surefirebooter | grep -e '-Dhbase.test'
jps -v | grep surefirebooter | grep -e '-Dhbase.test' | cut -d ' ' -f 1 | xargs -n 1 jstack
# Exit with error
exit 1
else
echo "We're ok: there is no zombie test, but some tests took some time to stop"
fi
else
echo "We're ok: there is no zombie test"
fi
[468d432e] $ /bin/bash -xe /tmp/hudson8746464467874193300.sh
+ pwd
<https://builds.apache.org/job/HBase-1.2-IT/it.test=IntegrationTestAcidGuarantees,jdk=JDK%201.7%20(latest),label=Hadoop/ws/>
+ ls
bin
CHANGES.txt
conf
dev-support
hbase-annotations
hbase-assembly
hbase-checkstyle
hbase-client
hbase-common
hbase-examples
hbase-external-blockcache
hbase-hadoop2-compat
hbase-hadoop-compat
hbase-it
hbase-native-client
hbase-prefix-tree
hbase-procedure
hbase-protocol
hbase-resource-bundle
hbase-rest
hbase-server
hbase-shaded
hbase-shell
hbase-testing-util
hbase-thrift
LICENSE.txt
NOTICE.txt
pom.xml
README.txt
src
target
++ jps -v
++ grep surefirebooter
++ grep -e -Dhbase.test
++ wc -l
+ ZOMBIE_TESTS_COUNT=0
+ [[ 0 != 0 ]]
+ echo 'We'\''re ok: there is no zombie test'
We're ok: there is no zombie test
POST BUILD TASK : SUCCESS
END OF POST BUILD TASK : 0
Archiving artifacts
Build failed in Jenkins: HBase-1.2-IT » IntegrationTestAcidGuarantees,JDK 1.7 (latest),Hadoop #608
Posted by Apache Jenkins Server <je...@builds.apache.org>.
See <https://builds.apache.org/job/HBase-1.2-IT/it.test=IntegrationTestAcidGuarantees,jdk=JDK%201.7%20(latest),label=Hadoop/608/display/redirect?page=changes>
Changes:
[ramkrishna] HBASE-16630 Handle Fragmentation in bucket cache
[busbey] Revert "HBASE-16630 Handle Fragmentation in bucket cache"
[busbey] HBASE-17700 update version to 1.2.5 for RC0.
[busbey] HBASE-17700 update CHANGES.txt for 1.2.5 RC0.
------------------------------------------
[...truncated 2.08 MB...]
bool UseAdaptiveSizePolicyWithSystemGC = false {product}
bool UseAddressNop = true {ARCH product}
bool UseAltSigs = false {product}
bool UseAutoGCSelectPolicy = false {product}
bool UseBiasedLocking = true {product}
bool UseBimorphicInlining = true {C2 product}
bool UseBoundThreads = true {product}
bool UseCMSBestFit = true {product}
bool UseCMSCollectionPassing = true {product}
bool UseCMSCompactAtFullCollection = true {product}
bool UseCMSInitiatingOccupancyOnly = false {product}
bool UseCodeCacheFlushing = true {product}
bool UseCompiler = true {product}
bool UseCompilerSafepoints = true {product}
bool UseCompressedOops := true {lp64_product}
bool UseConcMarkSweepGC = false {product}
bool UseCondCardMark = false {C2 product}
bool UseCountLeadingZerosInstruction = false {ARCH product}
bool UseCounterDecay = true {product}
bool UseDivMod = true {C2 product}
bool UseDynamicNumberOfGCThreads = false {product}
bool UseFPUForSpilling = false {C2 product}
bool UseFastAccessorMethods = false {product}
bool UseFastEmptyMethods = false {product}
bool UseFastJNIAccessors = true {product}
bool UseFastStosb = false {ARCH product}
bool UseG1GC = false {product}
bool UseGCLogFileRotation = false {product}
bool UseGCOverheadLimit = true {product}
bool UseGCTaskAffinity = false {product}
bool UseHeavyMonitors = false {product}
bool UseHugeTLBFS = false {product}
bool UseInlineCaches = true {product}
bool UseInterpreter = true {product}
bool UseJumpTables = true {C2 product}
bool UseLWPSynchronization = true {product}
bool UseLargePages = false {pd product}
bool UseLargePagesIndividualAllocation = false {pd product}
bool UseLinuxPosixThreadCPUClocks = true {product}
bool UseLockedTracing = false {product}
bool UseLoopCounter = true {product}
bool UseLoopPredicate = true {C2 product}
bool UseMaximumCompactionOnSystemGC = true {product}
bool UseMembar = false {pd product}
bool UseNUMA = false {product}
bool UseNUMAInterleaving = false {product}
bool UseNewLongLShift = false {ARCH product}
bool UseOSErrorReporting = false {pd product}
bool UseOldInlining = true {C2 product}
bool UseOnStackReplacement = true {pd product}
bool UseOnlyInlinedBimorphic = true {C2 product}
bool UseOprofile = false {product}
bool UseOptoBiasInlining = true {C2 product}
bool UsePPCLWSYNC = true {product}
bool UsePSAdaptiveSurvivorSizePolicy = true {product}
bool UseParNewGC = false {product}
bool UseParallelGC := true {product}
bool UseParallelOldGC = true {product}
bool UsePerfData = true {product}
bool UsePopCountInstruction = true {product}
bool UseRDPCForConstantTableBase = false {C2 product}
bool UseSHM = false {product}
intx UseSSE = 4 {product}
bool UseSSE42Intrinsics = true {product}
bool UseSerialGC = false {product}
bool UseSharedSpaces = false {product}
bool UseSignalChaining = true {product}
bool UseSplitVerifier = true {product}
bool UseStoreImmI16 = false {ARCH product}
bool UseStringCache = false {product}
bool UseSuperWord = true {C2 product}
bool UseTLAB = true {pd product}
bool UseThreadPriorities = true {pd product}
bool UseTransparentHugePages = false {product}
bool UseTypeProfile = true {product}
bool UseUnalignedLoadStores = true {ARCH product}
bool UseVMInterruptibleIO = false {product}
bool UseVectoredExceptions = false {pd product}
bool UseXMMForArrayCopy = true {product}
bool UseXmmI2D = false {ARCH product}
bool UseXmmI2F = false {ARCH product}
bool UseXmmLoadAndClearUpper = true {ARCH product}
bool UseXmmRegToRegMoveAll = true {ARCH product}
bool VMThreadHintNoPreempt = false {product}
intx VMThreadPriority = -1 {product}
intx VMThreadStackSize = 1024 {pd product}
intx ValueMapInitialSize = 11 {C1 product}
intx ValueMapMaxLoopSize = 8 {C1 product}
intx ValueSearchLimit = 1000 {C2 product}
bool VerifyMergedCPBytecodes = true {product}
intx WorkAroundNPTLTimedWaitHang = 1 {product}
uintx YoungGenerationSizeIncrement = 20 {product}
uintx YoungGenerationSizeSupplement = 80 {product}
uintx YoungGenerationSizeSupplementDecay = 8 {product}
uintx YoungPLABSize = 4096 {product}
bool ZeroTLAB = false {product}
intx hashCode = 0 {product}
Running org.apache.hadoop.hbase.mapreduce.IntegrationTestBulkLoad
SUREFIRE-859: [GC 194048K->15122K(740864K), 0.0244630 secs]
SUREFIRE-859: [GC 209170K->71764K(740864K), 0.1230750 secs]
SUREFIRE-859: [GC 265812K->100184K(740864K), 0.0768520 secs]
SUREFIRE-859: [GC 294232K->125861K(934912K), 0.0582030 secs]
SUREFIRE-859: [GC 513957K->148485K(934912K), 0.0408720 secs]
SUREFIRE-859: [GC 536581K->164595K(1364992K), 0.0584760 secs]
SUREFIRE-859: [GC 940787K->174402K(1368576K), 0.0498510 secs]
Tests run: 1, Failures: 1, Errors: 0, Skipped: 0, Time elapsed: 238.7 sec <<< FAILURE! - in org.apache.hadoop.hbase.mapreduce.IntegrationTestBulkLoad
testBulkLoad(org.apache.hadoop.hbase.mapreduce.IntegrationTestBulkLoad) Time elapsed: 238.581 sec <<< FAILURE!
java.lang.AssertionError: expected:<true> but was:<false>
at org.junit.Assert.fail(Assert.java:88)
at org.junit.Assert.failNotEquals(Assert.java:834)
at org.junit.Assert.assertEquals(Assert.java:118)
at org.junit.Assert.assertEquals(Assert.java:144)
at org.apache.hadoop.hbase.mapreduce.IntegrationTestBulkLoad.runCheck(IntegrationTestBulkLoad.java:719)
at org.apache.hadoop.hbase.mapreduce.IntegrationTestBulkLoad.testBulkLoad(IntegrationTestBulkLoad.java:217)
Results :
Failed tests:
IntegrationTestBulkLoad.testBulkLoad:217->runCheck:719 expected:<true> but was:<false>
IntegrationTestTimeBoundedMultiGetRequestsWithRegionReplicas>IntegrationTestIngest.testIngest:112->IntegrationTestTimeBoundedRequestsWithRegionReplicas.runIngestTest:217 Verification failed with error code 1
Tests in error:
IntegrationTestIngestWithACL>IntegrationTestBase.setUp:133->setUpCluster:64->IntegrationTestIngest.setUpCluster:84 » IO
IntegrationTestMTTR.testKillRsHoldingMeta:278->run:319 » Execution java.io.IOE...
IntegrationTestMTTR.testRestartRsHoldingTable:273->run:319 » Execution java.io...
IntegrationTestBigLinkedListWithVisibility.testContinuousIngest:636 » Runtime ...
IntegrationTestWithCellVisibilityLoadAndVerify>IntegrationTestLoadAndVerify.testLoadAndVerify:545->doVerify:293->access$400:79->doVerify:338 » FileAlreadyExists
Tests run: 32, Failures: 2, Errors: 5, Skipped: 2
[WARNING] File encoding has not been set, using platform encoding ISO-8859-1, i.e. build is platform dependent! The file encoding for reports output files should be provided by the POM property ${project.reporting.outputEncoding}.
[INFO]
[INFO] --- maven-failsafe-plugin:2.18.1:verify (verify) @ hbase-it ---
[INFO] Failsafe report directory: <https://builds.apache.org/job/HBase-1.2-IT/it.test=IntegrationTestAcidGuarantees,jdk=JDK%201.7%20(latest),label=Hadoop/ws/hbase-it/target/failsafe-reports>
[WARNING] File encoding has not been set, using platform encoding ISO-8859-1, i.e. build is platform dependent! The file encoding for reports output files should be provided by the POM property ${project.reporting.outputEncoding}.
[INFO] ------------------------------------------------------------------------
[INFO] Reactor Summary:
[INFO]
[INFO] Apache HBase ...................................... SUCCESS [6.159s]
[INFO] Apache HBase - Checkstyle ......................... SUCCESS [1.399s]
[INFO] Apache HBase - Resource Bundle .................... SUCCESS [0.494s]
[INFO] Apache HBase - Annotations ........................ SUCCESS [2.063s]
[INFO] Apache HBase - Protocol ........................... SUCCESS [16.467s]
[INFO] Apache HBase - Common ............................. SUCCESS [12.357s]
[INFO] Apache HBase - Procedure .......................... SUCCESS [1.688s]
[INFO] Apache HBase - Client ............................. SUCCESS [7.224s]
[INFO] Apache HBase - Hadoop Compatibility ............... SUCCESS [0.847s]
[INFO] Apache HBase - Hadoop Two Compatibility ........... SUCCESS [1.895s]
[INFO] Apache HBase - Prefix Tree ........................ SUCCESS [2.180s]
[INFO] Apache HBase - Server ............................. SUCCESS [41.100s]
[INFO] Apache HBase - Testing Util ....................... SUCCESS [1.890s]
[INFO] Apache HBase - Thrift ............................. SUCCESS [7.550s]
[INFO] Apache HBase - Rest ............................... SUCCESS [3.903s]
[INFO] Apache HBase - Shell .............................. SUCCESS [1.496s]
[INFO] Apache HBase - Integration Tests .................. FAILURE [3:25:27.394s]
[INFO] Apache HBase - Examples ........................... SKIPPED
[INFO] Apache HBase - External Block Cache ............... SKIPPED
[INFO] Apache HBase - Assembly ........................... SKIPPED
[INFO] Apache HBase - Shaded ............................. SKIPPED
[INFO] Apache HBase - Shaded - Client .................... SKIPPED
[INFO] Apache HBase - Shaded - Server .................... SKIPPED
[INFO] ------------------------------------------------------------------------
[INFO] BUILD FAILURE
[INFO] ------------------------------------------------------------------------
[INFO] Total time: 3:27:18.910s
[INFO] Finished at: Wed Mar 01 10:54:56 UTC 2017
[INFO] Final Memory: 92M/1839M
[INFO] ------------------------------------------------------------------------
[ERROR] Failed to execute goal org.apache.maven.plugins:maven-failsafe-plugin:2.18.1:verify (verify) on project hbase-it: There was a timeout or other error in the fork -> [Help 1]
[ERROR]
[ERROR] To see the full stack trace of the errors, re-run Maven with the -e switch.
[ERROR] Re-run Maven using the -X switch to enable full debug logging.
[ERROR]
[ERROR] For more information about the errors and possible solutions, please read the following articles:
[ERROR] [Help 1] http://cwiki.apache.org/confluence/display/MAVEN/MojoFailureException
[ERROR]
[ERROR] After correcting the problems, you can resume the build with the command
[ERROR] mvn <goals> -rf :hbase-it
Build step 'Invoke top-level Maven targets' marked build as failure
Performing Post build task...
Match found for :.* : True
Logical operation result is TRUE
Running script : # Post-build task script. TODO: Check this in and have all builds reference check-in.
pwd && ls
# NOTE!!!! The below code has been copied and pasted from ./dev-tools/run-test.sh
# Do not change here without syncing there and vice-versa.
ZOMBIE_TESTS_COUNT=`jps -v | grep surefirebooter | grep -e '-Dhbase.test' | wc -l`
if [[ $ZOMBIE_TESTS_COUNT != 0 ]] ; then
echo "Suspicious java process found - waiting 30s to see if there are just slow to stop"
sleep 30
ZOMBIE_TESTS_COUNT=`jps -v | grep surefirebooter | grep -e '-Dhbase.test' | wc -l`
if [[ $ZOMBIE_TESTS_COUNT != 0 ]] ; then
echo " {color:red}There appear to be $ZOMBIE_TESTS_COUNT zombie tests{color}, they should have been killed by surefire but survived"
jps -v | grep surefirebooter | grep -e '-Dhbase.test'
jps -v | grep surefirebooter | grep -e '-Dhbase.test' | cut -d ' ' -f 1 | xargs -n 1 jstack
# Exit with error
exit 1
else
echo "We're ok: there is no zombie test, but some tests took some time to stop"
fi
else
echo "We're ok: there is no zombie test"
fi
[468d432e] $ /bin/bash -xe /tmp/hudson6075394256788260637.sh
+ pwd
<https://builds.apache.org/job/HBase-1.2-IT/it.test=IntegrationTestAcidGuarantees,jdk=JDK%201.7%20(latest),label=Hadoop/ws/>
+ ls
bin
CHANGES.txt
conf
dev-support
hbase-annotations
hbase-assembly
hbase-checkstyle
hbase-client
hbase-common
hbase-examples
hbase-external-blockcache
hbase-hadoop2-compat
hbase-hadoop-compat
hbase-it
hbase-native-client
hbase-prefix-tree
hbase-procedure
hbase-protocol
hbase-resource-bundle
hbase-rest
hbase-server
hbase-shaded
hbase-shell
hbase-testing-util
hbase-thrift
LICENSE.txt
NOTICE.txt
pom.xml
README.txt
src
target
++ jps -v
++ grep surefirebooter
++ grep -e -Dhbase.test
++ wc -l
+ ZOMBIE_TESTS_COUNT=0
+ [[ 0 != 0 ]]
+ echo 'We'\''re ok: there is no zombie test'
We're ok: there is no zombie test
POST BUILD TASK : SUCCESS
END OF POST BUILD TASK : 0
Archiving artifacts