You are viewing a plain text version of this content. The canonical link for it is here.
Posted to oak-dev@jackrabbit.apache.org by Apache Jenkins Server <je...@builds.apache.org> on 2017/09/20 16:11:51 UTC

BUILD FAILURE: Jackrabbit Oak - Build # 767 - Still Failing

The Apache Jenkins build system has built Jackrabbit Oak (build #767)

Status: Still Failing

Check console output at https://builds.apache.org/job/Jackrabbit%20Oak/767/ to view the results.

Changes:
[adulceanu] OAK-6667 - Refactor StandbyDiff for better clarity and understandability

 

Test results:
3 tests failed.
FAILED:  org.apache.jackrabbit.oak.upgrade.RepeatedRepositorySidegradeTest.shouldContainCustomInitializerContent

Error Message:
already shut down

Stack Trace:
java.lang.IllegalStateException: already shut down
	at org.apache.jackrabbit.oak.upgrade.RepeatedRepositorySidegradeTest.upgradeRepository(RepeatedRepositorySidegradeTest.java:67)


FAILED:  org.apache.jackrabbit.oak.upgrade.RepeatedRepositorySidegradeTest.shouldContainUpgradeInitializedContent

Error Message:
Privilege definition with name 'test:privilege' already exists.

Stack Trace:
javax.jcr.RepositoryException: Privilege definition with name 'test:privilege' already exists.
	at org.apache.jackrabbit.oak.upgrade.RepeatedRepositorySidegradeTest.upgradeRepository(RepeatedRepositorySidegradeTest.java:57)


FAILED:  org.apache.jackrabbit.oak.upgrade.RepeatedRepositorySidegradeTest.shouldReflectSourceAfterModifications

Error Message:
Privilege definition with name 'test:privilege' already exists.

Stack Trace:
javax.jcr.RepositoryException: Privilege definition with name 'test:privilege' already exists.
	at org.apache.jackrabbit.oak.upgrade.RepeatedRepositorySidegradeTest.upgradeRepository(RepeatedRepositorySidegradeTest.java:57)