You are viewing a plain text version of this content. The canonical link for it is here.
Posted to notifications@maven.apache.org by Apache Jenkins Server <je...@builds.apache.org> on 2015/02/12 02:17:24 UTC

Build failed in Jenkins: maven-archetype-m2 #125

See <https://builds.apache.org/job/maven-archetype-m2/125/changes>

Changes:

[bimargulies] No jira: add pointer to git.

------------------------------------------
[...truncated 2070 lines...]
1956K downloaded  (guava-jdk5-14.0.1.jar)
15K downloaded  (doxia-module-xhtml-1.4.jar)
Downloading: http://repo1.maven.org/maven2/org/apache/maven/doxia/doxia-module-fml/1.4/doxia-module-fml-1.4.jar
36K downloaded  (doxia-module-fml-1.4.jar)
[WARNING] DEPRECATED [sourceDirectory]: instead use {@link #sourceDirectories}
[WARNING] DEPRECATED [testSourceDirectory]: instead use {@link #testSourceDirectories}
[INFO] [checkstyle:check {execution: checkstyle-check}]
[INFO] 
Downloading: http://repo1.maven.org/maven2/org/apache/rat/apache-rat-core/0.11/apache-rat-core-0.11.pom
4K downloaded  (apache-rat-core-0.11.pom)
Downloading: http://repo1.maven.org/maven2/commons-lang/commons-lang/2.6/commons-lang-2.6.pom
17K downloaded  (commons-lang-2.6.pom)
Downloading: http://repo1.maven.org/maven2/org/apache/commons/commons-parent/17/commons-parent-17.pom
30K downloaded  (commons-parent-17.pom)
Downloading: http://repo1.maven.org/maven2/commons-io/commons-io/2.2/commons-io-2.2.pom
10K downloaded  (commons-io-2.2.pom)
Downloading: http://repo1.maven.org/maven2/org/apache/commons/commons-parent/24/commons-parent-24.pom
46K downloaded  (commons-parent-24.pom)
Downloading: http://repo1.maven.org/maven2/org/apache/maven/shared/maven-plugin-testing-harness/1.1/maven-plugin-testing-harness-1.1.pom
6K downloaded  (maven-plugin-testing-harness-1.1.pom)
Downloading: http://repo1.maven.org/maven2/org/apache/maven/shared/maven-shared-components/7/maven-shared-components-7.pom
2K downloaded  (maven-shared-components-7.pom)
Downloading: http://repo1.maven.org/maven2/org/apache/maven/maven-project/2.0/maven-project-2.0.pom
1K downloaded  (maven-project-2.0.pom)
Downloading: http://repo1.maven.org/maven2/org/apache/maven/maven/2.0/maven-2.0.pom
8K downloaded  (maven-2.0.pom)
Downloading: http://repo1.maven.org/maven2/org/apache/maven/maven-core/2.0/maven-core-2.0.pom
5K downloaded  (maven-core-2.0.pom)
Downloading: http://repo1.maven.org/maven2/org/apache/maven/maven-settings/2.0/maven-settings-2.0.pom
1K downloaded  (maven-settings-2.0.pom)
Downloading: http://repo1.maven.org/maven2/org/apache/maven/wagon/wagon-file/1.0-alpha-5/wagon-file-1.0-alpha-5.pom
5K downloaded  (wagon-file-1.0-alpha-5.pom)
Downloading: http://repo1.maven.org/maven2/org/apache/maven/wagon/wagon-provider-api/1.0-alpha-5/wagon-provider-api-1.0-alpha-5.pom
4K downloaded  (wagon-provider-api-1.0-alpha-5.pom)
Downloading: http://repo1.maven.org/maven2/org/apache/maven/maven-plugin-parameter-documenter/2.0/maven-plugin-parameter-documenter-2.0.pom
1K downloaded  (maven-plugin-parameter-documenter-2.0.pom)
Downloading: http://repo1.maven.org/maven2/org/apache/maven/wagon/wagon-http-lightweight/1.0-alpha-5/wagon-http-lightweight-1.0-alpha-5.pom
5K downloaded  (wagon-http-lightweight-1.0-alpha-5.pom)
Downloading: http://repo1.maven.org/maven2/org/apache/maven/reporting/maven-reporting-api/2.0/maven-reporting-api-2.0.pom
1K downloaded  (maven-reporting-api-2.0.pom)
Downloading: http://repo1.maven.org/maven2/org/apache/maven/reporting/maven-reporting/2.0/maven-reporting-2.0.pom
504b downloaded  (maven-reporting-2.0.pom)
Downloading: http://repo1.maven.org/maven2/org/apache/maven/maven-profile/2.0/maven-profile-2.0.pom
1K downloaded  (maven-profile-2.0.pom)
Downloading: http://repo1.maven.org/maven2/org/apache/maven/maven-model/2.0/maven-model-2.0.pom
2K downloaded  (maven-model-2.0.pom)
Downloading: http://repo1.maven.org/maven2/org/apache/maven/maven-artifact/2.0/maven-artifact-2.0.pom
723b downloaded  (maven-artifact-2.0.pom)
Downloading: http://repo1.maven.org/maven2/org/apache/maven/maven-repository-metadata/2.0/maven-repository-metadata-2.0.pom
1K downloaded  (maven-repository-metadata-2.0.pom)
Downloading: http://repo1.maven.org/maven2/org/apache/maven/maven-error-diagnostics/2.0/maven-error-diagnostics-2.0.pom
812b downloaded  (maven-error-diagnostics-2.0.pom)
Downloading: http://repo1.maven.org/maven2/org/apache/maven/maven-plugin-registry/2.0/maven-plugin-registry-2.0.pom
1K downloaded  (maven-plugin-registry-2.0.pom)
Downloading: http://repo1.maven.org/maven2/org/apache/maven/maven-plugin-api/2.0/maven-plugin-api-2.0.pom
601b downloaded  (maven-plugin-api-2.0.pom)
Downloading: http://repo1.maven.org/maven2/org/apache/maven/maven-plugin-descriptor/2.0/maven-plugin-descriptor-2.0.pom
1K downloaded  (maven-plugin-descriptor-2.0.pom)
Downloading: http://repo1.maven.org/maven2/org/apache/maven/maven-artifact-manager/2.0/maven-artifact-manager-2.0.pom
1K downloaded  (maven-artifact-manager-2.0.pom)
Downloading: http://repo1.maven.org/maven2/org/apache/maven/maven-monitor/2.0/maven-monitor-2.0.pom
400b downloaded  (maven-monitor-2.0.pom)
Downloading: http://repo1.maven.org/maven2/org/apache/maven/wagon/wagon-ssh/1.0-alpha-5/wagon-ssh-1.0-alpha-5.pom
6K downloaded  (wagon-ssh-1.0-alpha-5.pom)
Downloading: http://repo1.maven.org/maven2/com/jcraft/jsch/0.1.23/jsch-0.1.23.pom
485b downloaded  (jsch-0.1.23.pom)
Downloading: http://repo1.maven.org/maven2/org/codehaus/plexus/plexus-archiver/1.0-alpha-7/plexus-archiver-1.0-alpha-7.pom
1K downloaded  (plexus-archiver-1.0-alpha-7.pom)
Downloading: http://repo1.maven.org/maven2/org/codehaus/plexus/plexus-components/1.1.6/plexus-components-1.1.6.pom
1K downloaded  (plexus-components-1.1.6.pom)
Downloading: http://repo1.maven.org/maven2/org/codehaus/plexus/plexus/1.0.8/plexus-1.0.8.pom
7K downloaded  (plexus-1.0.8.pom)
Downloading: http://repo1.maven.org/maven2/org/codehaus/plexus/plexus-utils/1.2/plexus-utils-1.2.pom
767b downloaded  (plexus-utils-1.2.pom)
Downloading: http://repo1.maven.org/maven2/org/codehaus/plexus/plexus/1.0.5/plexus-1.0.5.pom
5K downloaded  (plexus-1.0.5.pom)
Downloading: http://repo1.maven.org/maven2/org/codehaus/plexus/plexus-utils/3.0.8/plexus-utils-3.0.8.pom
3K downloaded  (plexus-utils-3.0.8.pom)
Downloading: http://repo1.maven.org/maven2/junit/junit/4.11/junit-4.11.jar
Downloading: http://repo1.maven.org/maven2/commons-cli/commons-cli/1.2/commons-cli-1.2.jar
Downloading: http://repo1.maven.org/maven2/org/codehaus/plexus/plexus-utils/3.0.8/plexus-utils-3.0.8.jar
Downloading: http://repo1.maven.org/maven2/org/apache/maven/shared/maven-plugin-testing-harness/1.1/maven-plugin-testing-harness-1.1.jar
Downloading: http://repo1.maven.org/maven2/commons-io/commons-io/2.2/commons-io-2.2.jar
40K downloaded  (commons-cli-1.2.jar)
31K downloaded  (maven-plugin-testing-harness-1.1.jar)
226K downloaded  (plexus-utils-3.0.8.jar)
169K downloaded  (commons-io-2.2.jar)
Downloading: http://repo1.maven.org/maven2/commons-lang/commons-lang/2.6/commons-lang-2.6.jar
Downloading: http://repo1.maven.org/maven2/org/apache/rat/apache-rat-core/0.11/apache-rat-core-0.11.jar
Downloading: http://repo1.maven.org/maven2/org/hamcrest/hamcrest-core/1.3/hamcrest-core-1.3.jar
239K downloaded  (junit-4.11.jar)
Downloading: http://repo1.maven.org/maven2/org/apache/maven/doxia/doxia-decoration-model/1.2/doxia-decoration-model-1.2.jar
115K downloaded  (apache-rat-core-0.11.jar)
277K downloaded  (commons-lang-2.6.jar)
43K downloaded  (hamcrest-core-1.3.jar)
Downloading: http://repo1.maven.org/maven2/org/codehaus/plexus/plexus-velocity/1.1.7/plexus-velocity-1.1.7.jar
58K downloaded  (doxia-decoration-model-1.2.jar)
7K downloaded  (plexus-velocity-1.1.7.jar)
Downloading: http://repo1.maven.org/maven2/org/apache/maven/doxia/doxia-site-renderer/1.2/doxia-site-renderer-1.2.jar
Downloading: http://repo1.maven.org/maven2/org/codehaus/plexus/plexus-archiver/1.0-alpha-7/plexus-archiver-1.0-alpha-7.jar
50K downloaded  (doxia-site-renderer-1.2.jar)
Downloading: http://repo1.maven.org/maven2/org/apache/maven/doxia/doxia-module-xhtml/1.2/doxia-module-xhtml-1.2.jar
138K downloaded  (plexus-archiver-1.0-alpha-7.jar)
14K downloaded  (doxia-module-xhtml-1.2.jar)
Downloading: http://repo1.maven.org/maven2/org/apache/maven/doxia/doxia-module-fml/1.2/doxia-module-fml-1.2.jar
36K downloaded  (doxia-module-fml-1.2.jar)
[INFO] [apache-rat:check {execution: rat-check}]
[INFO] 56 implicit excludes (use -debug for more details).
[INFO] Exclude: README.txt
[INFO] Exclude: *.sh
[INFO] Exclude: archetype-samples/**
[INFO] Exclude: **/*.sha1
[INFO] Exclude: src/main/resources/org/apache/maven/archetype/creator/*
[INFO] Exclude: **/Format.java
[INFO] Exclude: **/NamespaceStack.java
[INFO] Exclude: **/XMLOutputter.java
[INFO] Exclude: src/test/**
[INFO] Exclude: src/it/**
[INFO] Exclude: .repository/**
[INFO] Exclude: .java-version
[INFO] Exclude: DEPENDENCIES
[INFO] 8 resources included (use -debug for more details)
[INFO] Rat check: Summary of files. Unapproved: 1 unknown: 1 generated: 0 approved: 5 licence.
[INFO] ------------------------------------------------------------------------
[INFO] SKIPPING Maven Archetype Testing
[INFO]    task-segment: [clean, install]
[INFO] This project has been banned from further executions due to previous failures.
[INFO] ------------------------------------------------------------------------
[INFO] ------------------------------------------------------------------------
[INFO] SKIPPING Maven Archetype Webapp Proxy
[INFO]    task-segment: [clean, install]
[INFO] This project has been banned from further executions due to previous failures.
[INFO] ------------------------------------------------------------------------
[INFO] ------------------------------------------------------------------------
[INFO] SKIPPING Maven Archetype Webapp Repository
[INFO]    task-segment: [clean, install]
[INFO] This project has been banned from further executions due to previous failures.
[INFO] ------------------------------------------------------------------------
[INFO] ------------------------------------------------------------------------
[INFO] SKIPPING Maven Archetype Models
[INFO]    task-segment: [clean, install]
[INFO] This project has been banned from further executions due to previous failures.
[INFO] ------------------------------------------------------------------------
[INFO] ------------------------------------------------------------------------
[INFO] SKIPPING Maven Archetype Catalog Model
[INFO]    task-segment: [clean, install]
[INFO] This project has been banned from further executions due to previous failures.
[INFO] ------------------------------------------------------------------------
[INFO] ------------------------------------------------------------------------
[INFO] SKIPPING Maven Archetype Descriptor Model
[INFO]    task-segment: [clean, install]
[INFO] This project has been banned from further executions due to previous failures.
[INFO] ------------------------------------------------------------------------
[INFO] ------------------------------------------------------------------------
[INFO] SKIPPING Maven Archetype Registry Model
[INFO]    task-segment: [clean, install]
[INFO] This project has been banned from further executions due to previous failures.
[INFO] ------------------------------------------------------------------------
[INFO] ------------------------------------------------------------------------
[INFO] SKIPPING Maven Archetype Common
[INFO]    task-segment: [clean, install]
[INFO] This project has been banned from further executions due to previous failures.
[INFO] ------------------------------------------------------------------------
[INFO] ------------------------------------------------------------------------
[INFO] SKIPPING Maven Archetype Packaging
[INFO]    task-segment: [clean, install]
[INFO] This project has been banned from further executions due to previous failures.
[INFO] ------------------------------------------------------------------------
[INFO] ------------------------------------------------------------------------
[INFO] SKIPPING Maven Archetype Plugin
[INFO]    task-segment: [clean, install]
[INFO] This project has been banned from further executions due to previous failures.
[INFO] ------------------------------------------------------------------------
[INFO] 
[INFO] 
[INFO] ------------------------------------------------------------------------
[INFO] Reactor Summary:
[INFO] ------------------------------------------------------------------------
[INFO] Maven Archetype ....................................... FAILED [42.573s]
[INFO] Maven Archetype Testing ............................... SKIPPED (dependency build failed or was skipped)
[INFO] Maven Archetype Webapp Proxy .......................... SKIPPED (dependency build failed or was skipped)
[INFO] Maven Archetype Webapp Repository ..................... SKIPPED (dependency build failed or was skipped)
[INFO] Maven Archetype Models ................................ SKIPPED (dependency build failed or was skipped)
[INFO] Maven Archetype Catalog Model ......................... SKIPPED (dependency build failed or was skipped)
[INFO] Maven Archetype Descriptor Model ...................... SKIPPED (dependency build failed or was skipped)
[INFO] Maven Archetype Registry Model ........................ SKIPPED (dependency build failed or was skipped)
[INFO] Maven Archetype Common ................................ SKIPPED (dependency build failed or was skipped)
[INFO] Maven Archetype Packaging ............................. SKIPPED (dependency build failed or was skipped)
[INFO] Maven Archetype Plugin ................................ SKIPPED (dependency build failed or was skipped)
[INFO] ------------------------------------------------------------------------
[INFO] Error for project: Maven Archetype (during install)
[INFO] ------------------------------------------------------------------------
[INFO] Too many files with unapproved license: 1 See RAT report in: <https://builds.apache.org/job/maven-archetype-m2/ws/target/rat.txt>
[INFO] ------------------------------------------------------------------------
[INFO] Trace
org.apache.maven.BuildFailureException: Too many files with unapproved license: 1 See RAT report in: <https://builds.apache.org/job/maven-archetype-m2/ws/target/rat.txt>
	at org.apache.maven.lifecycle.DefaultLifecycleExecutor.executeGoals(DefaultLifecycleExecutor.java:715)
	at org.apache.maven.lifecycle.DefaultLifecycleExecutor.executeGoalWithLifecycle(DefaultLifecycleExecutor.java:556)
	at org.apache.maven.lifecycle.DefaultLifecycleExecutor.executeGoal(DefaultLifecycleExecutor.java:535)
	at org.apache.maven.lifecycle.DefaultLifecycleExecutor.executeGoalAndHandleFailures(DefaultLifecycleExecutor.java:387)
	at org.apache.maven.lifecycle.DefaultLifecycleExecutor.executeTaskSegments(DefaultLifecycleExecutor.java:348)
	at org.apache.maven.lifecycle.DefaultLifecycleExecutor.execute(DefaultLifecycleExecutor.java:180)
	at org.apache.maven.lifecycle.LifecycleExecutorInterceptor.execute(LifecycleExecutorInterceptor.java:65)
	at org.apache.maven.DefaultMaven.doExecute(DefaultMaven.java:328)
	at org.apache.maven.DefaultMaven.execute(DefaultMaven.java:138)
	at org.apache.maven.cli.MavenCli.main(MavenCli.java:362)
	at sun.reflect.NativeMethodAccessorImpl.invoke0(Native Method)
	at sun.reflect.NativeMethodAccessorImpl.invoke(NativeMethodAccessorImpl.java:39)
	at sun.reflect.DelegatingMethodAccessorImpl.invoke(DelegatingMethodAccessorImpl.java:25)
	at java.lang.reflect.Method.invoke(Method.java:597)
	at org.codehaus.classworlds.Launcher.launchEnhanced(Launcher.java:315)
	at org.codehaus.classworlds.Launcher.launch(Launcher.java:255)
	at hudson.maven.agent.Main.launch(Main.java:205)
	at hudson.maven.MavenBuilder.call(MavenBuilder.java:154)
	at hudson.maven.Maven2Builder.call(Maven2Builder.java:79)
	at hudson.maven.Maven2Builder.call(Maven2Builder.java:55)
	at hudson.remoting.UserRequest.perform(UserRequest.java:118)
	at hudson.remoting.UserRequest.perform(UserRequest.java:48)
	at hudson.remoting.Request$2.run(Request.java:328)
	at hudson.remoting.InterceptingExecutorService$1.call(InterceptingExecutorService.java:72)
	at java.util.concurrent.FutureTask$Sync.innerRun(FutureTask.java:303)
	at java.util.concurrent.FutureTask.run(FutureTask.java:138)
	at java.util.concurrent.ThreadPoolExecutor$Worker.runTask(ThreadPoolExecutor.java:895)
	at java.util.concurrent.ThreadPoolExecutor$Worker.run(ThreadPoolExecutor.java:918)
	at java.lang.Thread.run(Thread.java:662)
Caused by: org.apache.rat.mp.RatCheckException: Too many files with unapproved license: 1 See RAT report in: <https://builds.apache.org/job/maven-archetype-m2/ws/target/rat.txt>
	at org.apache.rat.mp.RatCheckMojo.check(RatCheckMojo.java:194)
	at org.apache.rat.mp.RatCheckMojo.execute(RatCheckMojo.java:182)
	at org.apache.maven.plugin.DefaultPluginManager.executeMojo(DefaultPluginManager.java:490)
	at hudson.maven.agent.PluginManagerInterceptor.executeMojo(PluginManagerInterceptor.java:182)
	at org.apache.maven.lifecycle.DefaultLifecycleExecutor.executeGoals(DefaultLifecycleExecutor.java:694)
	... 28 more
[INFO] ------------------------------------------------------------------------
[INFO] BUILD ERRORS
[INFO] ------------------------------------------------------------------------
[INFO] Total time: 43 seconds
[INFO] Finished at: Thu Feb 12 01:17:22 UTC 2015
[INFO] Final Memory: 55M/557M
[INFO] ------------------------------------------------------------------------
[JENKINS] Archiving <https://builds.apache.org/job/maven-archetype-m2/ws/pom.xml> to org.apache.maven.archetype/maven-archetype/2.3-SNAPSHOT/maven-archetype-2.3-SNAPSHOT.pom
[JENKINS] Archiving <https://builds.apache.org/job/maven-archetype-m2/ws/target/maven-archetype-2.3-SNAPSHOT-site.xml> to org.apache.maven.archetype/maven-archetype/2.3-SNAPSHOT/maven-archetype-2.3-SNAPSHOT-site.xml
Sending artifact delta relative to maven-archetype-m2 ? Maven Archetype #124
Archived 2 artifacts
Archive block size is 32768
Received 0 blocks and 12863 bytes
Compression is 0.0%
Took 74 ms
Sending e-mails to: notifications@maven.apache.org bimargulies@gmail.com
channel stopped

Jenkins build is back to normal : maven-archetype-m2 #127

Posted by Apache Jenkins Server <je...@builds.apache.org>.
See <https://builds.apache.org/job/maven-archetype-m2/127/changes>


Build failed in Jenkins: maven-archetype-m2 #126

Posted by Apache Jenkins Server <je...@builds.apache.org>.
See <https://builds.apache.org/job/maven-archetype-m2/126/>

------------------------------------------
[...truncated 3529 lines...]
Downloading: http://repo1.maven.org/maven2/org/apache/maven/doxia/doxia-core/1.1.4/doxia-core-1.1.4.pom
3K downloaded  (doxia-core-1.1.4.pom)
Downloading: http://repo1.maven.org/maven2/org/apache/maven/doxia/doxia-decoration-model/1.1.4/doxia-decoration-model-1.1.4.pom
2K downloaded  (doxia-decoration-model-1.1.4.pom)
Downloading: http://repo1.maven.org/maven2/org/apache/maven/doxia/doxia-module-xhtml/1.1.4/doxia-module-xhtml-1.1.4.pom
1K downloaded  (doxia-module-xhtml-1.1.4.pom)
Downloading: http://repo1.maven.org/maven2/org/apache/maven/doxia/doxia-modules/1.1.4/doxia-modules-1.1.4.pom
2K downloaded  (doxia-modules-1.1.4.pom)
Downloading: http://repo1.maven.org/maven2/org/apache/maven/doxia/doxia-module-fml/1.1.4/doxia-module-fml-1.1.4.pom
5K downloaded  (doxia-module-fml-1.1.4.pom)
Downloading: http://repo1.maven.org/maven2/org/codehaus/plexus/plexus-utils/3.0.1/plexus-utils-3.0.1.pom
2K downloaded  (plexus-utils-3.0.1.pom)
Downloading: http://repo1.maven.org/maven2/org/apache/maven/doxia/doxia-core/1.1.2/doxia-core-1.1.2.jar
Downloading: http://repo1.maven.org/maven2/xerces/xercesImpl/2.8.1/xercesImpl-2.8.1.jar
Downloading: http://repo1.maven.org/maven2/org/codehaus/plexus/plexus-utils/3.0.1/plexus-utils-3.0.1.jar
Downloading: http://repo1.maven.org/maven2/org/ow2/asm/asm-tree/4.0/asm-tree-4.0.jar
Downloading: http://repo1.maven.org/maven2/commons-httpclient/commons-httpclient/3.1/commons-httpclient-3.1.jar
21K downloaded  (asm-tree-4.0.jar)
Downloading: http://repo1.maven.org/maven2/org/codehaus/groovy/groovy/2.0.1/groovy-2.0.1.jar
154K downloaded  (doxia-core-1.1.2.jar)
Downloading: http://repo1.maven.org/maven2/commons-collections/commons-collections/3.2/commons-collections-3.2.jar
221K downloaded  (plexus-utils-3.0.1.jar)
Downloading: http://repo1.maven.org/maven2/org/apache/maven/shared/maven-script-interpreter/1.1/maven-script-interpreter-1.1.jar
297K downloaded  (commons-httpclient-3.1.jar)
20K downloaded  (maven-script-interpreter-1.1.jar)
Downloading: http://repo1.maven.org/maven2/org/ow2/asm/asm/4.0/asm-4.0.jar
Downloading: http://repo1.maven.org/maven2/org/apache/maven/doxia/doxia-site-renderer/1.1.4/doxia-site-renderer-1.1.4.jar
44K downloaded  (asm-4.0.jar)
49K downloaded  (doxia-site-renderer-1.1.4.jar)
557K downloaded  (commons-collections-3.2.jar)
Downloading: http://repo1.maven.org/maven2/org/ow2/asm/asm-commons/4.0/asm-commons-4.0.jar
Downloading: http://repo1.maven.org/maven2/org/apache/maven/doxia/doxia-decoration-model/1.1.4/doxia-decoration-model-1.1.4.jar
36K downloaded  (asm-commons-4.0.jar)
51K downloaded  (doxia-decoration-model-1.1.4.jar)
Downloading: http://repo1.maven.org/maven2/org/ow2/asm/asm-util/4.0/asm-util-4.0.jar
Downloading: http://repo1.maven.org/maven2/org/apache/maven/doxia/doxia-module-xhtml/1.1.4/doxia-module-xhtml-1.1.4.jar
36K downloaded  (asm-util-4.0.jar)
14K downloaded  (doxia-module-xhtml-1.1.4.jar)
1184K downloaded  (xercesImpl-2.8.1.jar)
Downloading: http://repo1.maven.org/maven2/org/ow2/asm/asm-analysis/4.0/asm-analysis-4.0.jar
Downloading: http://repo1.maven.org/maven2/org/apache/maven/doxia/doxia-module-fml/1.1.4/doxia-module-fml-1.1.4.jar
19K downloaded  (asm-analysis-4.0.jar)
36K downloaded  (doxia-module-fml-1.1.4.jar)
3193K downloaded  (groovy-2.0.1.jar)
[INFO] [invoker:install {execution: integration-test}]
[INFO] Installing <https://builds.apache.org/job/maven-archetype-m2/ws/archetype-models/archetype-catalog/pom.xml> to <https://builds.apache.org/job/maven-archetype-m2/ws/maven-archetype-plugin/target/local-repo/org/apache/maven/archetype/archetype-catalog/2.3-SNAPSHOT/archetype-catalog-2.3-SNAPSHOT.pom>
[INFO] Installing <https://builds.apache.org/job/maven-archetype-m2/ws/archetype-models/archetype-catalog/target/archetype-catalog-2.3-SNAPSHOT.jar> to <https://builds.apache.org/job/maven-archetype-m2/ws/maven-archetype-plugin/target/local-repo/org/apache/maven/archetype/archetype-catalog/2.3-SNAPSHOT/archetype-catalog-2.3-SNAPSHOT.jar>
[INFO] Installing <https://builds.apache.org/job/maven-archetype-m2/ws/archetype-models/pom.xml> to <https://builds.apache.org/job/maven-archetype-m2/ws/maven-archetype-plugin/target/local-repo/org/apache/maven/archetype/archetype-models/2.3-SNAPSHOT/archetype-models-2.3-SNAPSHOT.pom>
[INFO] Installing <https://builds.apache.org/job/maven-archetype-m2/ws/pom.xml> to <https://builds.apache.org/job/maven-archetype-m2/ws/maven-archetype-plugin/target/local-repo/org/apache/maven/archetype/maven-archetype/2.3-SNAPSHOT/maven-archetype-2.3-SNAPSHOT.pom>
[INFO] Installing <https://builds.apache.org/job/maven-archetype-m2/ws/archetype-models/archetype-descriptor/pom.xml> to <https://builds.apache.org/job/maven-archetype-m2/ws/maven-archetype-plugin/target/local-repo/org/apache/maven/archetype/archetype-descriptor/2.3-SNAPSHOT/archetype-descriptor-2.3-SNAPSHOT.pom>
[INFO] Installing <https://builds.apache.org/job/maven-archetype-m2/ws/archetype-models/archetype-descriptor/target/archetype-descriptor-2.3-SNAPSHOT.jar> to <https://builds.apache.org/job/maven-archetype-m2/ws/maven-archetype-plugin/target/local-repo/org/apache/maven/archetype/archetype-descriptor/2.3-SNAPSHOT/archetype-descriptor-2.3-SNAPSHOT.jar>
[INFO] Installing <https://builds.apache.org/job/maven-archetype-m2/ws/archetype-models/archetype-registry/pom.xml> to <https://builds.apache.org/job/maven-archetype-m2/ws/maven-archetype-plugin/target/local-repo/org/apache/maven/archetype/archetype-registry/2.3-SNAPSHOT/archetype-registry-2.3-SNAPSHOT.pom>
[INFO] Installing <https://builds.apache.org/job/maven-archetype-m2/ws/archetype-models/archetype-registry/target/archetype-registry-2.3-SNAPSHOT.jar> to <https://builds.apache.org/job/maven-archetype-m2/ws/maven-archetype-plugin/target/local-repo/org/apache/maven/archetype/archetype-registry/2.3-SNAPSHOT/archetype-registry-2.3-SNAPSHOT.jar>
[INFO] Installing <https://builds.apache.org/job/maven-archetype-m2/ws/archetype-common/pom.xml> to <https://builds.apache.org/job/maven-archetype-m2/ws/maven-archetype-plugin/target/local-repo/org/apache/maven/archetype/archetype-common/2.3-SNAPSHOT/archetype-common-2.3-SNAPSHOT.pom>
[INFO] Installing <https://builds.apache.org/job/maven-archetype-m2/ws/archetype-common/target/archetype-common-2.3-SNAPSHOT.jar> to <https://builds.apache.org/job/maven-archetype-m2/ws/maven-archetype-plugin/target/local-repo/org/apache/maven/archetype/archetype-common/2.3-SNAPSHOT/archetype-common-2.3-SNAPSHOT.jar>
[INFO] Installing <https://builds.apache.org/job/maven-archetype-m2/ws/maven-archetype-plugin/pom.xml> to <https://builds.apache.org/job/maven-archetype-m2/ws/maven-archetype-plugin/target/local-repo/org/apache/maven/plugins/maven-archetype-plugin/2.3-SNAPSHOT/maven-archetype-plugin-2.3-SNAPSHOT.pom>
[INFO] Installing <https://builds.apache.org/job/maven-archetype-m2/ws/maven-archetype-plugin/target/maven-archetype-plugin-2.3-SNAPSHOT.jar> to <https://builds.apache.org/job/maven-archetype-m2/ws/maven-archetype-plugin/target/local-repo/org/apache/maven/plugins/maven-archetype-plugin/2.3-SNAPSHOT/maven-archetype-plugin-2.3-SNAPSHOT.jar>
[INFO] [invoker:run {execution: integration-test}]
[INFO] Building: build-archetype/pom.xml
[INFO] ..FAILED (15.0 s)
[INFO]   The build exited with code 1. See <https://builds.apache.org/job/maven-archetype-m2/ws/maven-archetype-plugin/target/it/build-archetype/build.log> for details.
[INFO] Building: create-from-project/pom.xml
[INFO] run script verify.bsh
[INFO] ..SUCCESS (3.6 s)
[INFO] Building: property-setting-cli/pom.xml
[INFO] ..SUCCESS (3.7 s)
[INFO] Building: generate-basic
[INFO] run script setup.groovy
[INFO] run script verify.bsh
[INFO] ..SUCCESS (4.5 s)
[INFO] -------------------------------------------------
[INFO] Build Summary:
[INFO]   Passed: 3, Failed: 1, Errors: 0, Skipped: 0
[INFO] -------------------------------------------------
[ERROR] The following builds failed:
[ERROR] *  build-archetype/pom.xml
[INFO] -------------------------------------------------
[INFO] 
[INFO] 
[INFO] ------------------------------------------------------------------------
[INFO] Reactor Summary:
[INFO] ------------------------------------------------------------------------
[INFO] Maven Archetype ....................................... SUCCESS [37.095s]
[INFO] Maven Archetype Testing ............................... SUCCESS [0.612s]
[INFO] Maven Archetype Webapp Proxy .......................... SUCCESS [7.772s]
[INFO] Maven Archetype Webapp Repository ..................... SUCCESS [0.833s]
[INFO] Maven Archetype Models ................................ SUCCESS [0.610s]
[INFO] Maven Archetype Catalog Model ......................... SUCCESS [5.537s]
[INFO] Maven Archetype Descriptor Model ...................... SUCCESS [0.963s]
[INFO] Maven Archetype Registry Model ........................ SUCCESS [0.819s]
[INFO] Maven Archetype Common ................................ SUCCESS [38.648s]
[INFO] Maven Archetype Packaging ............................. SUCCESS [0.790s]
[INFO] Maven Archetype Plugin ................................ FAILED [43.943s]
[INFO] ------------------------------------------------------------------------
[INFO] Error for project: Maven Archetype Plugin (during install)
[INFO] ------------------------------------------------------------------------
[INFO] 1 build failed. See console output above for details.
[INFO] ------------------------------------------------------------------------
[INFO] Trace
org.apache.maven.BuildFailureException: 1 build failed. See console output above for details.
	at org.apache.maven.lifecycle.DefaultLifecycleExecutor.executeGoals(DefaultLifecycleExecutor.java:715)
	at org.apache.maven.lifecycle.DefaultLifecycleExecutor.executeGoalWithLifecycle(DefaultLifecycleExecutor.java:556)
	at org.apache.maven.lifecycle.DefaultLifecycleExecutor.executeGoal(DefaultLifecycleExecutor.java:535)
	at org.apache.maven.lifecycle.DefaultLifecycleExecutor.executeGoalAndHandleFailures(DefaultLifecycleExecutor.java:387)
	at org.apache.maven.lifecycle.DefaultLifecycleExecutor.executeTaskSegments(DefaultLifecycleExecutor.java:348)
	at org.apache.maven.lifecycle.DefaultLifecycleExecutor.execute(DefaultLifecycleExecutor.java:180)
	at org.apache.maven.lifecycle.LifecycleExecutorInterceptor.execute(LifecycleExecutorInterceptor.java:65)
	at org.apache.maven.DefaultMaven.doExecute(DefaultMaven.java:328)
	at org.apache.maven.DefaultMaven.execute(DefaultMaven.java:138)
	at org.apache.maven.cli.MavenCli.main(MavenCli.java:362)
	at sun.reflect.NativeMethodAccessorImpl.invoke0(Native Method)
	at sun.reflect.NativeMethodAccessorImpl.invoke(NativeMethodAccessorImpl.java:39)
	at sun.reflect.DelegatingMethodAccessorImpl.invoke(DelegatingMethodAccessorImpl.java:25)
	at java.lang.reflect.Method.invoke(Method.java:597)
	at org.codehaus.classworlds.Launcher.launchEnhanced(Launcher.java:315)
	at org.codehaus.classworlds.Launcher.launch(Launcher.java:255)
	at hudson.maven.agent.Main.launch(Main.java:205)
	at hudson.maven.MavenBuilder.call(MavenBuilder.java:154)
	at hudson.maven.Maven2Builder.call(Maven2Builder.java:79)
	at hudson.maven.Maven2Builder.call(Maven2Builder.java:55)
	at hudson.remoting.UserRequest.perform(UserRequest.java:118)
	at hudson.remoting.UserRequest.perform(UserRequest.java:48)
	at hudson.remoting.Request$2.run(Request.java:328)
	at hudson.remoting.InterceptingExecutorService$1.call(InterceptingExecutorService.java:72)
	at java.util.concurrent.FutureTask$Sync.innerRun(FutureTask.java:303)
	at java.util.concurrent.FutureTask.run(FutureTask.java:138)
	at java.util.concurrent.ThreadPoolExecutor$Worker.runTask(ThreadPoolExecutor.java:895)
	at java.util.concurrent.ThreadPoolExecutor$Worker.run(ThreadPoolExecutor.java:918)
	at java.lang.Thread.run(Thread.java:662)
Caused by: org.apache.maven.plugin.MojoFailureException: 1 build failed. See console output above for details.
	at org.apache.maven.plugin.invoker.InvokerSession.handleFailures(InvokerSession.java:258)
	at org.apache.maven.plugin.invoker.InvokerMojo.processResults(InvokerMojo.java:61)
	at org.apache.maven.plugin.invoker.AbstractInvokerMojo.execute(AbstractInvokerMojo.java:672)
	at org.apache.maven.plugin.DefaultPluginManager.executeMojo(DefaultPluginManager.java:490)
	at hudson.maven.agent.PluginManagerInterceptor.executeMojo(PluginManagerInterceptor.java:182)
	at org.apache.maven.lifecycle.DefaultLifecycleExecutor.executeGoals(DefaultLifecycleExecutor.java:694)
	... 28 more
[INFO] ------------------------------------------------------------------------
[INFO] BUILD ERRORS
[INFO] ------------------------------------------------------------------------
[INFO] Total time: 2 minutes 25 seconds
[INFO] Finished at: Thu Feb 12 23:08:44 UTC 2015
[INFO] Final Memory: 107M/829M
[INFO] ------------------------------------------------------------------------
[JENKINS] Archiving <https://builds.apache.org/job/maven-archetype-m2/ws/archetype-models/archetype-catalog/pom.xml> to org.apache.maven.archetype/archetype-catalog/2.3-SNAPSHOT/archetype-catalog-2.3-SNAPSHOT.pom
[JENKINS] Archiving <https://builds.apache.org/job/maven-archetype-m2/ws/archetype-models/archetype-catalog/target/archetype-catalog-2.3-SNAPSHOT.jar> to org.apache.maven.archetype/archetype-catalog/2.3-SNAPSHOT/archetype-catalog-2.3-SNAPSHOT.jar
Sending artifact delta relative to maven-archetype-m2 » Maven Archetype Catalog Model #124
Archived 2 artifacts
Archive block size is 32768
Received 0 blocks and 20823 bytes
Compression is 0.0%
Took 0.13 sec
[JENKINS] Archiving <https://builds.apache.org/job/maven-archetype-m2/ws/archetype-testing/archetype-repository/pom.xml> to org.apache.maven.archetype/archetype-repository/2.3-SNAPSHOT/archetype-repository-2.3-SNAPSHOT.pom
[JENKINS] Archiving <https://builds.apache.org/job/maven-archetype-m2/ws/archetype-testing/archetype-repository/target/archetype-repository-2.3-SNAPSHOT.war> to org.apache.maven.archetype/archetype-repository/2.3-SNAPSHOT/archetype-repository-2.3-SNAPSHOT.war
Sending artifact delta relative to maven-archetype-m2 » Maven Archetype Webapp Repository #124
Archived 2 artifacts
Archive block size is 32768
Received 3 blocks and 75164 bytes
Compression is 56.7%
Took 0.14 sec
[JENKINS] Archiving <https://builds.apache.org/job/maven-archetype-m2/ws/.repository/org/apache/maven/archetype/archetype-testing/2.3-SNAPSHOT/archetype-testing-2.3-SNAPSHOT.pom> to org.apache.maven.archetype/archetype-testing/2.3-SNAPSHOT/archetype-testing-2.3-SNAPSHOT.pom
[JENKINS] Archiving <https://builds.apache.org/job/maven-archetype-m2/ws/archetype-testing/target/archetype-testing-2.3-SNAPSHOT-site.xml> to org.apache.maven.archetype/archetype-testing/2.3-SNAPSHOT/archetype-testing-2.3-SNAPSHOT-site.xml
<https://builds.apache.org/job/maven-archetype-m2/ws/.repository/org/apache/maven/archetype/archetype-testing/2.3-SNAPSHOT/archetype-testing-2.3-SNAPSHOT.pom> is not inside <https://builds.apache.org/job/maven-archetype-m2/ws/archetype-testing/;> will archive in a separate pass
Sending artifact delta relative to maven-archetype-m2 » Maven Archetype Testing #124
Archived 1 artifacts
Archive block size is 32768
Received 0 blocks and 1212 bytes
Compression is 0.0%
Took 86 ms
Sending artifact delta relative to maven-archetype-m2 » Maven Archetype Testing #124
Archived 1 artifacts
Archive block size is 32768
Received 0 blocks and 1628 bytes
Compression is 0.0%
Took 71 ms
[JENKINS] Archiving <https://builds.apache.org/job/maven-archetype-m2/ws/.repository/org/apache/maven/archetype/maven-archetype/2.3-SNAPSHOT/maven-archetype-2.3-SNAPSHOT.pom> to org.apache.maven.archetype/maven-archetype/2.3-SNAPSHOT/maven-archetype-2.3-SNAPSHOT.pom
[JENKINS] Archiving <https://builds.apache.org/job/maven-archetype-m2/ws/target/maven-archetype-2.3-SNAPSHOT-site.xml> to org.apache.maven.archetype/maven-archetype/2.3-SNAPSHOT/maven-archetype-2.3-SNAPSHOT-site.xml
Sending artifact delta relative to maven-archetype-m2 » Maven Archetype #124
Archived 2 artifacts
Archive block size is 32768
Received 0 blocks and 14113 bytes
Compression is 0.0%
Took 85 ms
[JENKINS] Archiving <https://builds.apache.org/job/maven-archetype-m2/ws/archetype-models/archetype-descriptor/pom.xml> to org.apache.maven.archetype/archetype-descriptor/2.3-SNAPSHOT/archetype-descriptor-2.3-SNAPSHOT.pom
[JENKINS] Archiving <https://builds.apache.org/job/maven-archetype-m2/ws/archetype-models/archetype-descriptor/target/archetype-descriptor-2.3-SNAPSHOT.jar> to org.apache.maven.archetype/archetype-descriptor/2.3-SNAPSHOT/archetype-descriptor-2.3-SNAPSHOT.jar
Sending artifact delta relative to maven-archetype-m2 » Maven Archetype Descriptor Model #124
Archived 2 artifacts
Archive block size is 32768
Received 0 blocks and 25387 bytes
Compression is 0.0%
Took 75 ms
[JENKINS] Archiving <https://builds.apache.org/job/maven-archetype-m2/ws/archetype-testing/archetype-proxy/pom.xml> to org.apache.maven.archetype/archetype-proxy/2.3-SNAPSHOT/archetype-proxy-2.3-SNAPSHOT.pom
[JENKINS] Archiving <https://builds.apache.org/job/maven-archetype-m2/ws/archetype-testing/archetype-proxy/target/archetype-proxy-2.3-SNAPSHOT.war> to org.apache.maven.archetype/archetype-proxy/2.3-SNAPSHOT/archetype-proxy-2.3-SNAPSHOT.war
Sending artifact delta relative to maven-archetype-m2 » Maven Archetype Webapp Proxy #124
Archived 2 artifacts
Archive block size is 32768
Received 3 blocks and 71363 bytes
Compression is 57.9%
Took 0.2 sec
[JENKINS] Archiving <https://builds.apache.org/job/maven-archetype-m2/ws/archetype-models/archetype-registry/pom.xml> to org.apache.maven.archetype/archetype-registry/2.3-SNAPSHOT/archetype-registry-2.3-SNAPSHOT.pom
[JENKINS] Archiving <https://builds.apache.org/job/maven-archetype-m2/ws/archetype-models/archetype-registry/target/archetype-registry-2.3-SNAPSHOT.jar> to org.apache.maven.archetype/archetype-registry/2.3-SNAPSHOT/archetype-registry-2.3-SNAPSHOT.jar
Sending artifact delta relative to maven-archetype-m2 » Maven Archetype Registry Model #124
Archived 2 artifacts
Archive block size is 32768
Received 0 blocks and 18897 bytes
Compression is 0.0%
Took 0.12 sec
[JENKINS] Archiving <https://builds.apache.org/job/maven-archetype-m2/ws/.repository/org/apache/maven/archetype/archetype-models/2.3-SNAPSHOT/archetype-models-2.3-SNAPSHOT.pom> to org.apache.maven.archetype/archetype-models/2.3-SNAPSHOT/archetype-models-2.3-SNAPSHOT.pom
[JENKINS] Archiving <https://builds.apache.org/job/maven-archetype-m2/ws/archetype-models/target/archetype-models-2.3-SNAPSHOT-site.xml> to org.apache.maven.archetype/archetype-models/2.3-SNAPSHOT/archetype-models-2.3-SNAPSHOT-site.xml
<https://builds.apache.org/job/maven-archetype-m2/ws/.repository/org/apache/maven/archetype/archetype-models/2.3-SNAPSHOT/archetype-models-2.3-SNAPSHOT.pom> is not inside <https://builds.apache.org/job/maven-archetype-m2/ws/archetype-models/;> will archive in a separate pass
Sending artifact delta relative to maven-archetype-m2 » Maven Archetype Models #124
Archived 1 artifacts
Archive block size is 32768
Received 0 blocks and 1619 bytes
Compression is 0.0%
Took 0.11 sec
Sending artifact delta relative to maven-archetype-m2 » Maven Archetype Models #124
Archived 1 artifacts
Archive block size is 32768
Received 0 blocks and 2882 bytes
Compression is 0.0%
Took 70 ms
[JENKINS] Archiving <https://builds.apache.org/job/maven-archetype-m2/ws/archetype-packaging/pom.xml> to org.apache.maven.archetype/archetype-packaging/2.3-SNAPSHOT/archetype-packaging-2.3-SNAPSHOT.pom
[JENKINS] Archiving <https://builds.apache.org/job/maven-archetype-m2/ws/archetype-packaging/target/archetype-packaging-2.3-SNAPSHOT.jar> to org.apache.maven.archetype/archetype-packaging/2.3-SNAPSHOT/archetype-packaging-2.3-SNAPSHOT.jar
Sending artifact delta relative to maven-archetype-m2 » Maven Archetype Packaging #124
Archived 2 artifacts
Archive block size is 32768
Received 0 blocks and 9450 bytes
Compression is 0.0%
Took 73 ms
[JENKINS] Archiving <https://builds.apache.org/job/maven-archetype-m2/ws/maven-archetype-plugin/pom.xml> to org.apache.maven.plugins/maven-archetype-plugin/2.3-SNAPSHOT/maven-archetype-plugin-2.3-SNAPSHOT.pom
[JENKINS] Archiving <https://builds.apache.org/job/maven-archetype-m2/ws/maven-archetype-plugin/target/maven-archetype-plugin-2.3-SNAPSHOT.jar> to org.apache.maven.plugins/maven-archetype-plugin/2.3-SNAPSHOT/maven-archetype-plugin-2.3-SNAPSHOT.jar
Sending artifact delta relative to maven-archetype-m2 » Maven Archetype Plugin #124
Archived 2 artifacts
Archive block size is 32768
Received 0 blocks and 99843 bytes
Compression is 0.0%
Took 0.15 sec
[JENKINS] Archiving <https://builds.apache.org/job/maven-archetype-m2/ws/archetype-common/pom.xml> to org.apache.maven.archetype/archetype-common/2.3-SNAPSHOT/archetype-common-2.3-SNAPSHOT.pom
[JENKINS] Archiving <https://builds.apache.org/job/maven-archetype-m2/ws/archetype-common/target/archetype-common-2.3-SNAPSHOT.jar> to org.apache.maven.archetype/archetype-common/2.3-SNAPSHOT/archetype-common-2.3-SNAPSHOT.jar
Sending artifact delta relative to maven-archetype-m2 » Maven Archetype Common #124
Archived 2 artifacts
Archive block size is 32768
Received 0 blocks and 189223 bytes
Compression is 0.0%
Took 0.21 sec
Sending e-mails to: notifications@maven.apache.org
Sending e-mails to: notifications@maven.apache.org
channel stopped