You are viewing a plain text version of this content. The canonical link for it is here.
Posted to server-dev@james.apache.org by Apache Hudson Server <hu...@hudson.apache.org> on 2011/03/25 06:55:12 UTC
Build failed in Jenkins: james-server-trunk » Apache James Server IMAP #1318
See <https://hudson.apache.org/hudson/job/james-server-trunk/org.apache.james$james-server-imapserver/1318/changes>
Changes:
[felixk] Make sure, the stream gets closed (see JAMES-1207)
------------------------------------------
[JENKINS] Archiving /home/hudson/hudson-slave/workspace/james-server-trunk/trunk/smtpserver/pom.xml to /home/hudson/hudson/jobs/james-server-trunk/modules/org.apache.james$james-server-smtpserver/builds/2011-03-25_05-52-27/archive/org.apache.james/james-server-smtpserver/3.0-M3-SNAPSHOT/pom.xml
[JENKINS] Archiving /home/hudson/hudson-slave/workspace/james-server-trunk/trunk/smtpserver/target/james-server-smtpserver-3.0-M3-SNAPSHOT.jar to /home/hudson/hudson/jobs/james-server-trunk/modules/org.apache.james$james-server-smtpserver/builds/2011-03-25_05-52-27/archive/org.apache.james/james-server-smtpserver/3.0-M3-20110325.055503-78/james-server-smtpserver-3.0-M3-SNAPSHOT.jar
[JENKINS] Archiving /home/hudson/hudson-slave/workspace/james-server-trunk/trunk/smtpserver/target/james-server-smtpserver-3.0-M3-SNAPSHOT-tests.jar to /home/hudson/hudson/jobs/james-server-trunk/modules/org.apache.james$james-server-smtpserver/builds/2011-03-25_05-52-27/archive/org.apache.james/james-server-smtpserver/3.0-M3-20110325.055503-78/james-server-smtpserver-3.0-M3-SNAPSHOT-tests.jar
[INFO] Downloading: http://download.java.net/maven/2/org/apache/james/apache-james-imap-api/0.2-M2-SNAPSHOT/maven-metadata.xml
Downloading: http://repository.apache.org/snapshots/org/apache/james/apache-james-imap-api/0.2-M2-SNAPSHOT/maven-metadata.xml
[INFO] ------------------------------------------------------------------------
[INFO] Building Apache James Server IMAP 3.0-M3-SNAPSHOT
[INFO] ------------------------------------------------------------------------
Downloaded: http://repository.apache.org/snapshots/org/apache/james/apache-james-imap-api/0.2-M2-SNAPSHOT/maven-metadata.xml (1007 B at 5.7 KB/sec)
Downloading: http://download.java.net/maven/2/org/apache/james/apache-james-imap/0.2-M2-SNAPSHOT/maven-metadata.xml
Downloading: http://repository.apache.org/snapshots/org/apache/james/apache-james-imap/0.2-M2-SNAPSHOT/maven-metadata.xml
Downloaded: http://repository.apache.org/snapshots/org/apache/james/apache-james-imap/0.2-M2-SNAPSHOT/maven-metadata.xml (2 KB at 8.0 KB/sec)
Downloading: http://download.java.net/maven/2/org/apache/james/apache-james-imap-message/0.2-M2-SNAPSHOT/maven-metadata.xml
Downloading: http://repository.apache.org/snapshots/org/apache/james/apache-james-imap-message/0.2-M2-SNAPSHOT/maven-metadata.xml
Downloaded: http://repository.apache.org/snapshots/org/apache/james/apache-james-imap-message/0.2-M2-SNAPSHOT/maven-metadata.xml (1011 B at 8.3 KB/sec)
Downloading: http://download.java.net/maven/2/org/apache/james/apache-james-imap-processor/0.2-M2-SNAPSHOT/maven-metadata.xml
Downloading: http://repository.apache.org/snapshots/org/apache/james/apache-james-imap-processor/0.2-M2-SNAPSHOT/maven-metadata.xml
Downloaded: http://repository.apache.org/snapshots/org/apache/james/apache-james-imap-processor/0.2-M2-SNAPSHOT/maven-metadata.xml (1013 B at 6.7 KB/sec)
[INFO] [INFO] Deleting <https://hudson.apache.org/hudson/job/james-server-trunk/org.apache.james$james-server-imapserver/ws/target>
[INFO] --- maven-clean-plugin:2.4.1:clean (default-clean) @ james-server-imapserver ---
[INFO]
[INFO] --- maven-remote-resources-plugin:1.1:process (default) @ james-server-imapserver ---
Downloading: http://download.java.net/maven/2/org/apache/james/apache-james-imap-api/0.2-M2-SNAPSHOT/maven-metadata.xml
Downloading: http://repository.apache.org/snapshots/org/apache/james/apache-james-imap-api/0.2-M2-SNAPSHOT/maven-metadata.xml
Downloaded: http://repository.apache.org/snapshots/org/apache/james/apache-james-imap-api/0.2-M2-SNAPSHOT/maven-metadata.xml (1007 B at 12.3 KB/sec)
Downloading: http://repository.apache.org/snapshots/org/apache/james/apache-james-imap-message/0.2-M2-SNAPSHOT/maven-metadata.xml
Downloading: http://download.java.net/maven/2/org/apache/james/apache-james-imap-message/0.2-M2-SNAPSHOT/maven-metadata.xml
Downloaded: http://repository.apache.org/snapshots/org/apache/james/apache-james-imap-message/0.2-M2-SNAPSHOT/maven-metadata.xml (1011 B at 12.3 KB/sec)
Downloading: http://download.java.net/maven/2/org/apache/james/apache-james-imap-processor/0.2-M2-SNAPSHOT/maven-metadata.xml
Downloading: http://repository.apache.org/snapshots/org/apache/james/apache-james-imap-processor/0.2-M2-SNAPSHOT/maven-metadata.xml
Downloaded: http://repository.apache.org/snapshots/org/apache/james/apache-james-imap-processor/0.2-M2-SNAPSHOT/maven-metadata.xml (1013 B at 12.2 KB/sec)
[INFO] [INFO] Using 'UTF-8' encoding to copy filtered resources.
[INFO] Copying 0 resource
[INFO] Copying 3 resources
[INFO] --- maven-resources-plugin:2.4.3:resources (default-resources) @ james-server-imapserver ---
[INFO] [INFO] Compiling 16 source files to <https://hudson.apache.org/hudson/job/james-server-trunk/org.apache.james$james-server-imapserver/ws/target/classes>
[INFO] --- maven-compiler-plugin:2.3.2:compile (default-compile) @ james-server-imapserver ---
[INFO] -------------------------------------------------------------
[ERROR] COMPILATION ERROR :
[INFO] -------------------------------------------------------------
[ERROR] <https://hudson.apache.org/hudson/job/james-server-trunk/org.apache.james$james-server-imapserver/ws/src/main/java/org/apache/james/imapserver/netty/ChannelImapResponseWriter.java>:[54,18] cannot find symbol
symbol : constructor IOException(java.lang.Throwable)
location: class java.io.IOException
[ERROR] <https://hudson.apache.org/hudson/job/james-server-trunk/org.apache.james$james-server-imapserver/ws/src/main/java/org/apache/james/imapserver/netty/ChannelWritableByteChannel.java>:[62,18] cannot find symbol
symbol : constructor IOException(java.lang.Throwable)
location: class java.io.IOException
[INFO] 2 errors
[INFO] -------------------------------------------------------------
mojoFailed org.apache.maven.plugins:maven-compiler-plugin:2.3.2(default-compile)
projectFailed org.apache.james:james-server-imapserver:3.0-M3-SNAPSHOT
---------------------------------------------------------------------
To unsubscribe, e-mail: server-dev-unsubscribe@james.apache.org
For additional commands, e-mail: server-dev-help@james.apache.org
Jenkins build is back to normal : james-server-trunk » Apache James Server IMAP #1322
Posted by Apache Hudson Server <hu...@hudson.apache.org>.
See <https://hudson.apache.org/hudson/job/james-server-trunk/org.apache.james$james-server-imapserver/1322/changes>
---------------------------------------------------------------------
To unsubscribe, e-mail: server-dev-unsubscribe@james.apache.org
For additional commands, e-mail: server-dev-help@james.apache.org
Build failed in Jenkins: james-server-trunk » Apache James Server IMAP #1321
Posted by Apache Hudson Server <hu...@hudson.apache.org>.
See <https://hudson.apache.org/hudson/job/james-server-trunk/org.apache.james$james-server-imapserver/1321/>
------------------------------------------
[JENKINS] Archiving /home/hudson/hudson-slave/workspace/james-server-trunk/trunk/smtpserver/pom.xml to /home/hudson/hudson/jobs/james-server-trunk/modules/org.apache.james$james-server-smtpserver/builds/2011-03-25_10-08-28/archive/org.apache.james/james-server-smtpserver/3.0-M3-SNAPSHOT/pom.xml
[JENKINS] Archiving /home/hudson/hudson-slave/workspace/james-server-trunk/trunk/smtpserver/target/james-server-smtpserver-3.0-M3-SNAPSHOT.jar to /home/hudson/hudson/jobs/james-server-trunk/modules/org.apache.james$james-server-smtpserver/builds/2011-03-25_10-08-28/archive/org.apache.james/james-server-smtpserver/3.0-M3-20110325.101128-80/james-server-smtpserver-3.0-M3-SNAPSHOT.jar
[JENKINS] Archiving /home/hudson/hudson-slave/workspace/james-server-trunk/trunk/smtpserver/target/james-server-smtpserver-3.0-M3-SNAPSHOT-tests.jar to /home/hudson/hudson/jobs/james-server-trunk/modules/org.apache.james$james-server-smtpserver/builds/2011-03-25_10-08-28/archive/org.apache.james/james-server-smtpserver/3.0-M3-20110325.101128-80/james-server-smtpserver-3.0-M3-SNAPSHOT-tests.jar
[INFO]
[INFO] ------------------------------------------------------------------------
[INFO] Building Apache James Server IMAP 3.0-M3-SNAPSHOT
[INFO] ------------------------------------------------------------------------
Downloading: http://download.java.net/maven/2/org/apache/james/apache-james-imap-api/0.2-M2-SNAPSHOT/maven-metadata.xml
Downloading: http://repository.apache.org/snapshots/org/apache/james/apache-james-imap-api/0.2-M2-SNAPSHOT/maven-metadata.xml
Downloaded: http://repository.apache.org/snapshots/org/apache/james/apache-james-imap-api/0.2-M2-SNAPSHOT/maven-metadata.xml (1007 B at 1.9 KB/sec)
Downloading: http://download.java.net/maven/2/org/apache/james/apache-james-imap-api/0.2-M2-SNAPSHOT/apache-james-imap-api-0.2-M2-20110325.040728-60.pom
Downloading: http://repository.apache.org/snapshots/org/apache/james/apache-james-imap-api/0.2-M2-SNAPSHOT/apache-james-imap-api-0.2-M2-20110325.040728-60.pom
Downloaded: http://repository.apache.org/snapshots/org/apache/james/apache-james-imap-api/0.2-M2-SNAPSHOT/apache-james-imap-api-0.2-M2-20110325.040728-60.pom (2 KB at 5.4 KB/sec)
Downloading: http://download.java.net/maven/2/org/apache/james/apache-james-imap/0.2-M2-SNAPSHOT/maven-metadata.xml
Downloading: http://repository.apache.org/snapshots/org/apache/james/apache-james-imap/0.2-M2-SNAPSHOT/maven-metadata.xml
Downloaded: http://repository.apache.org/snapshots/org/apache/james/apache-james-imap/0.2-M2-SNAPSHOT/maven-metadata.xml (2 KB at 5.5 KB/sec)
Downloading: http://repository.apache.org/snapshots/org/apache/james/apache-james-imap/0.2-M2-SNAPSHOT/apache-james-imap-0.2-M2-20110325.040714-60.pom
Downloaded: http://repository.apache.org/snapshots/org/apache/james/apache-james-imap/0.2-M2-SNAPSHOT/apache-james-imap-0.2-M2-20110325.040714-60.pom (21 KB at 122.3 KB/sec)
Downloading: http://download.java.net/maven/2/org/apache/james/apache-james-imap-message/0.2-M2-SNAPSHOT/maven-metadata.xml
Downloading: http://repository.apache.org/snapshots/org/apache/james/apache-james-imap-message/0.2-M2-SNAPSHOT/maven-metadata.xml
Downloaded: http://repository.apache.org/snapshots/org/apache/james/apache-james-imap-message/0.2-M2-SNAPSHOT/maven-metadata.xml (1011 B at 7.3 KB/sec)
Downloading: http://download.java.net/maven/2/org/apache/james/apache-james-imap-message/0.2-M2-SNAPSHOT/apache-james-imap-message-0.2-M2-20110325.040802-59.pom
Downloading: http://repository.apache.org/snapshots/org/apache/james/apache-james-imap-message/0.2-M2-SNAPSHOT/apache-james-imap-message-0.2-M2-20110325.040802-59.pom
Downloaded: http://repository.apache.org/snapshots/org/apache/james/apache-james-imap-message/0.2-M2-SNAPSHOT/apache-james-imap-message-0.2-M2-20110325.040802-59.pom (3 KB at 25.8 KB/sec)
Downloading: http://download.java.net/maven/2/org/apache/james/apache-james-imap-processor/0.2-M2-SNAPSHOT/maven-metadata.xml
Downloading: http://repository.apache.org/snapshots/org/apache/james/apache-james-imap-processor/0.2-M2-SNAPSHOT/maven-metadata.xml
Downloaded: http://repository.apache.org/snapshots/org/apache/james/apache-james-imap-processor/0.2-M2-SNAPSHOT/maven-metadata.xml (1013 B at 8.3 KB/sec)
Downloading: http://download.java.net/maven/2/org/apache/james/apache-james-imap-processor/0.2-M2-SNAPSHOT/apache-james-imap-processor-0.2-M2-20110325.040818-59.pom
Downloading: http://repository.apache.org/snapshots/org/apache/james/apache-james-imap-processor/0.2-M2-SNAPSHOT/apache-james-imap-processor-0.2-M2-20110325.040818-59.pom
Downloaded: http://repository.apache.org/snapshots/org/apache/james/apache-james-imap-processor/0.2-M2-SNAPSHOT/apache-james-imap-processor-0.2-M2-20110325.040818-59.pom (2 KB at 23.6 KB/sec)
Downloading: http://repository.apache.org/snapshots/org/apache/james/apache-james-imap-api/0.2-M2-SNAPSHOT/apache-james-imap-api-0.2-M2-20110325.040728-60.jar
Downloading: http://repository.apache.org/snapshots/org/apache/james/apache-james-imap-message/0.2-M2-SNAPSHOT/apache-james-imap-message-0.2-M2-20110325.040802-59.jar
Downloading: http://repository.apache.org/snapshots/org/apache/james/apache-james-imap-processor/0.2-M2-SNAPSHOT/apache-james-imap-processor-0.2-M2-20110325.040818-59.jar
Downloaded: http://repository.apache.org/snapshots/org/apache/james/apache-james-imap-processor/0.2-M2-SNAPSHOT/apache-james-imap-processor-0.2-M2-20110325.040818-59.jar (117 KB at 380.5 KB/sec)
Downloaded: http://repository.apache.org/snapshots/org/apache/james/apache-james-imap-message/0.2-M2-SNAPSHOT/apache-james-imap-message-0.2-M2-20110325.040802-59.jar (160 KB at 469.4 KB/sec)
Downloaded: http://repository.apache.org/snapshots/org/apache/james/apache-james-imap-api/0.2-M2-SNAPSHOT/apache-james-imap-api-0.2-M2-20110325.040728-60.jar (41 KB at 92.2 KB/sec)
[INFO] Deleting <https://hudson.apache.org/hudson/job/james-server-trunk/org.apache.james$james-server-imapserver/ws/target>
[INFO]
[INFO] --- maven-clean-plugin:2.4.1:clean (default-clean) @ james-server-imapserver ---
[INFO]
[INFO] --- maven-remote-resources-plugin:1.1:process (default) @ james-server-imapserver ---
Downloading: http://download.java.net/maven/2/org/apache/james/apache-james-imap-api/0.2-M2-SNAPSHOT/maven-metadata.xml
Downloading: http://repository.apache.org/snapshots/org/apache/james/apache-james-imap-api/0.2-M2-SNAPSHOT/maven-metadata.xml
Downloaded: http://repository.apache.org/snapshots/org/apache/james/apache-james-imap-api/0.2-M2-SNAPSHOT/maven-metadata.xml (1007 B at 11.3 KB/sec)
Downloading: http://download.java.net/maven/2/org/apache/james/apache-james-imap-message/0.2-M2-SNAPSHOT/maven-metadata.xml
Downloading: http://repository.apache.org/snapshots/org/apache/james/apache-james-imap-message/0.2-M2-SNAPSHOT/maven-metadata.xml
Downloaded: http://repository.apache.org/snapshots/org/apache/james/apache-james-imap-message/0.2-M2-SNAPSHOT/maven-metadata.xml (1011 B at 6.4 KB/sec)
Downloading: http://repository.apache.org/snapshots/org/apache/james/apache-james-imap-processor/0.2-M2-SNAPSHOT/maven-metadata.xml
Downloading: http://download.java.net/maven/2/org/apache/james/apache-james-imap-processor/0.2-M2-SNAPSHOT/maven-metadata.xml
Downloaded: http://repository.apache.org/snapshots/org/apache/james/apache-james-imap-processor/0.2-M2-SNAPSHOT/maven-metadata.xml (1013 B at 11.0 KB/sec)
[INFO] [INFO] Using 'UTF-8' encoding to copy filtered resources.
[INFO] Copying 0 resource
[INFO] Copying 3 resources
[INFO] --- maven-resources-plugin:2.4.3:resources (default-resources) @ james-server-imapserver ---
[INFO]
[INFO] --- maven-compiler-plugin:2.3.2:compile (default-compile) @ james-server-imapserver ---
[INFO] Compiling 16 source files to <https://hudson.apache.org/hudson/job/james-server-trunk/org.apache.james$james-server-imapserver/ws/target/classes>
[INFO] -------------------------------------------------------------
[ERROR] COMPILATION ERROR :
[INFO] -------------------------------------------------------------
[ERROR] <https://hudson.apache.org/hudson/job/james-server-trunk/org.apache.james$james-server-imapserver/ws/src/main/java/org/apache/james/imapserver/netty/ChannelImapResponseWriter.java>:[54,18] cannot find symbol
symbol : constructor IOException(java.lang.String,java.lang.Throwable)
location: class java.io.IOException
[ERROR] <https://hudson.apache.org/hudson/job/james-server-trunk/org.apache.james$james-server-imapserver/ws/src/main/java/org/apache/james/imapserver/netty/ChannelWritableByteChannel.java>:[62,18] cannot find symbol
symbol : constructor IOException(java.lang.String,java.lang.Throwable)
location: class java.io.IOException
[INFO] 2 errors
[INFO] -------------------------------------------------------------
mojoFailed org.apache.maven.plugins:maven-compiler-plugin:2.3.2(default-compile)
projectFailed org.apache.james:james-server-imapserver:3.0-M3-SNAPSHOT
---------------------------------------------------------------------
To unsubscribe, e-mail: server-dev-unsubscribe@james.apache.org
For additional commands, e-mail: server-dev-help@james.apache.org
Build failed in Jenkins: james-server-trunk » Apache James Server IMAP #1319
Posted by Apache Hudson Server <hu...@hudson.apache.org>.
See <https://hudson.apache.org/hudson/job/james-server-trunk/org.apache.james$james-server-imapserver/1319/>
------------------------------------------
[JENKINS] Archiving /home/hudson/hudson-slave/workspace/james-server-trunk/trunk/smtpserver/pom.xml to /home/hudson/hudson/jobs/james-server-trunk/modules/org.apache.james$james-server-smtpserver/builds/2011-03-25_06-52-48/archive/org.apache.james/james-server-smtpserver/3.0-M3-SNAPSHOT/pom.xml
[JENKINS] Archiving /home/hudson/hudson-slave/workspace/james-server-trunk/trunk/smtpserver/target/james-server-smtpserver-3.0-M3-SNAPSHOT.jar to /home/hudson/hudson/jobs/james-server-trunk/modules/org.apache.james$james-server-smtpserver/builds/2011-03-25_06-52-48/archive/org.apache.james/james-server-smtpserver/3.0-M3-20110325.065528-79/james-server-smtpserver-3.0-M3-SNAPSHOT.jar
[JENKINS] Archiving /home/hudson/hudson-slave/workspace/james-server-trunk/trunk/smtpserver/target/james-server-smtpserver-3.0-M3-SNAPSHOT-tests.jar to /home/hudson/hudson/jobs/james-server-trunk/modules/org.apache.james$james-server-smtpserver/builds/2011-03-25_06-52-48/archive/org.apache.james/james-server-smtpserver/3.0-M3-20110325.065528-79/james-server-smtpserver-3.0-M3-SNAPSHOT-tests.jar
[INFO] Downloading: http://download.java.net/maven/2/org/apache/james/apache-james-imap-api/0.2-M2-SNAPSHOT/maven-metadata.xml
Downloading: http://repository.apache.org/snapshots/org/apache/james/apache-james-imap-api/0.2-M2-SNAPSHOT/maven-metadata.xml
[INFO] ------------------------------------------------------------------------
[INFO] Building Apache James Server IMAP 3.0-M3-SNAPSHOT
[INFO] ------------------------------------------------------------------------
Downloaded: http://repository.apache.org/snapshots/org/apache/james/apache-james-imap-api/0.2-M2-SNAPSHOT/maven-metadata.xml (1007 B at 9.2 KB/sec)
Downloading: http://download.java.net/maven/2/org/apache/james/apache-james-imap/0.2-M2-SNAPSHOT/maven-metadata.xml
Downloading: http://repository.apache.org/snapshots/org/apache/james/apache-james-imap/0.2-M2-SNAPSHOT/maven-metadata.xml
Downloaded: http://repository.apache.org/snapshots/org/apache/james/apache-james-imap/0.2-M2-SNAPSHOT/maven-metadata.xml (2 KB at 7.1 KB/sec)
Downloading: http://download.java.net/maven/2/org/apache/james/apache-james-imap-message/0.2-M2-SNAPSHOT/maven-metadata.xml
Downloading: http://repository.apache.org/snapshots/org/apache/james/apache-james-imap-message/0.2-M2-SNAPSHOT/maven-metadata.xml
Downloaded: http://repository.apache.org/snapshots/org/apache/james/apache-james-imap-message/0.2-M2-SNAPSHOT/maven-metadata.xml (1011 B at 5.3 KB/sec)
Downloading: http://download.java.net/maven/2/org/apache/james/apache-james-imap-processor/0.2-M2-SNAPSHOT/maven-metadata.xml
Downloading: http://repository.apache.org/snapshots/org/apache/james/apache-james-imap-processor/0.2-M2-SNAPSHOT/maven-metadata.xml
Downloaded: http://repository.apache.org/snapshots/org/apache/james/apache-james-imap-processor/0.2-M2-SNAPSHOT/maven-metadata.xml (1013 B at 8.2 KB/sec)
[INFO] Deleting <https://hudson.apache.org/hudson/job/james-server-trunk/org.apache.james$james-server-imapserver/ws/target>
[INFO]
[INFO] --- maven-clean-plugin:2.4.1:clean (default-clean) @ james-server-imapserver ---
[INFO]
[INFO] --- maven-remote-resources-plugin:1.1:process (default) @ james-server-imapserver ---
Downloading: http://download.java.net/maven/2/org/apache/james/apache-james-imap-api/0.2-M2-SNAPSHOT/maven-metadata.xml
Downloading: http://repository.apache.org/snapshots/org/apache/james/apache-james-imap-api/0.2-M2-SNAPSHOT/maven-metadata.xml
Downloaded: http://repository.apache.org/snapshots/org/apache/james/apache-james-imap-api/0.2-M2-SNAPSHOT/maven-metadata.xml (1007 B at 10.7 KB/sec)
Downloading: http://download.java.net/maven/2/org/apache/james/apache-james-imap-message/0.2-M2-SNAPSHOT/maven-metadata.xml
Downloading: http://repository.apache.org/snapshots/org/apache/james/apache-james-imap-message/0.2-M2-SNAPSHOT/maven-metadata.xml
Downloaded: http://repository.apache.org/snapshots/org/apache/james/apache-james-imap-message/0.2-M2-SNAPSHOT/maven-metadata.xml (1011 B at 11.3 KB/sec)
Downloading: http://download.java.net/maven/2/org/apache/james/apache-james-imap-processor/0.2-M2-SNAPSHOT/maven-metadata.xml
Downloading: http://repository.apache.org/snapshots/org/apache/james/apache-james-imap-processor/0.2-M2-SNAPSHOT/maven-metadata.xml
Downloaded: http://repository.apache.org/snapshots/org/apache/james/apache-james-imap-processor/0.2-M2-SNAPSHOT/maven-metadata.xml (1013 B at 10.9 KB/sec)
[INFO] [INFO] Using 'UTF-8' encoding to copy filtered resources.
[INFO] Copying 0 resource
[INFO] Copying 3 resources
[INFO] --- maven-resources-plugin:2.4.3:resources (default-resources) @ james-server-imapserver ---
[INFO]
[INFO] --- maven-compiler-plugin:2.3.2:compile (default-compile) @ james-server-imapserver ---
[INFO] Compiling 16 source files to <https://hudson.apache.org/hudson/job/james-server-trunk/org.apache.james$james-server-imapserver/ws/target/classes>
[INFO] -------------------------------------------------------------
[ERROR] COMPILATION ERROR :
[INFO] -------------------------------------------------------------
[ERROR] <https://hudson.apache.org/hudson/job/james-server-trunk/org.apache.james$james-server-imapserver/ws/src/main/java/org/apache/james/imapserver/netty/ChannelImapResponseWriter.java>:[54,18] cannot find symbol
symbol : constructor IOException(java.lang.Throwable)
location: class java.io.IOException
[ERROR] <https://hudson.apache.org/hudson/job/james-server-trunk/org.apache.james$james-server-imapserver/ws/src/main/java/org/apache/james/imapserver/netty/ChannelWritableByteChannel.java>:[62,18] cannot find symbol
symbol : constructor IOException(java.lang.Throwable)
location: class java.io.IOException
[INFO] 2 errors
[INFO] -------------------------------------------------------------
mojoFailed org.apache.maven.plugins:maven-compiler-plugin:2.3.2(default-compile)
projectFailed org.apache.james:james-server-imapserver:3.0-M3-SNAPSHOT
---------------------------------------------------------------------
To unsubscribe, e-mail: server-dev-unsubscribe@james.apache.org
For additional commands, e-mail: server-dev-help@james.apache.org