You are viewing a plain text version of this content. The canonical link for it is here.
Posted to dev@pdfbox.apache.org by Apache Jenkins Server <je...@builds.apache.org> on 2025/05/17 15:50:47 UTC
Build failed in Jenkins: PDFBox » PDFBox-3.0.x #738
See <https://ci-builds.apache.org/job/PDFBox/job/PDFBox-3.0.x/738/display/redirect?page=changes>
Changes:
[Tilman Hausherr] PDFBOX-6009: get ParentTreeNextKey from tree
------------------------------------------
[...truncated 753.22 KiB...]
17.05.2025 15:48:40 INFO visible.PDVisibleSigBuilder:97 - AcroForm has been created
17.05.2025 15:48:40 INFO visible.PDVisibleSigBuilder:111 - Signature field has been created
17.05.2025 15:48:40 INFO visible.PDVisibleSigBuilder:128 - PDSignature has been created
17.05.2025 15:48:40 INFO visible.PDVisibleSigBuilder:146 - AcroForm dictionary has been created
17.05.2025 15:48:40 INFO visible.PDVisibleSigBuilder:169 - Matrix has been added
17.05.2025 15:48:40 INFO visible.PDVisibleSigBuilder:162 - Signature rectangle has been created
17.05.2025 15:48:40 INFO visible.PDVisibleSigBuilder:202 - Formatter rectangle has been created
17.05.2025 15:48:40 INFO visible.PDVisibleSigBuilder:189 - Visible Signature Image has been created
17.05.2025 15:48:40 INFO visible.PDVisibleSigBuilder:210 - Holder form stream has been created
17.05.2025 15:48:40 INFO visible.PDVisibleSigBuilder:218 - Holder form resources have been created
17.05.2025 15:48:40 INFO visible.PDVisibleSigBuilder:231 - Holder form has been created
17.05.2025 15:48:40 INFO visible.PDVisibleSigBuilder:248 - PDF appearance dictionary has been created
17.05.2025 15:48:40 INFO visible.PDVisibleSigBuilder:256 - Stream of another form (inner form - it will be inside holder form) has been created
17.05.2025 15:48:40 INFO visible.PDVisibleSigBuilder:265 - Resources of another form (inner form - it will be inside holder form)have been created
17.05.2025 15:48:40 INFO visible.PDVisibleSigBuilder:278 - Another form (inner form - it will be inside holder form) has been created
17.05.2025 15:48:40 INFO visible.PDVisibleSigBuilder:287 - Now inserted inner form inside holder form
17.05.2025 15:48:40 INFO visible.PDVisibleSigBuilder:295 - Created image form stream
17.05.2025 15:48:40 INFO visible.PDVisibleSigBuilder:303 - Created image form resources
17.05.2025 15:48:40 INFO visible.PDVisibleSigBuilder:325 - Created image form
17.05.2025 15:48:40 INFO visible.PDVisibleSigBuilder:338 - Created background layer form
17.05.2025 15:48:40 INFO visible.PDVisibleSigBuilder:351 - Inserted ProcSet to PDF
17.05.2025 15:48:40 INFO visible.PDVisibleSigBuilder:373 - Injected appearance stream to pdf
17.05.2025 15:48:40 INFO visible.PDVisibleSigBuilder:386 - Visible signature has been created
17.05.2025 15:48:40 INFO visible.PDVisibleSigBuilder:398 - WidgetDictionary has been created
17.05.2025 15:48:40 INFO visible.PDFTemplateCreator:151 - stream returning started, size= 28487
17.05.2025 15:48:40 INFO visible.PDVisibleSigBuilder:64 - PDF Structure has been created
17.05.2025 15:48:40 INFO visible.PDFTemplateCreator:78 - pdf building has been started
17.05.2025 15:48:40 INFO visible.PDVisibleSigBuilder:182 - ProcSet array has been created
17.05.2025 15:48:40 INFO visible.PDVisibleSigBuilder:73 - PDF page has been created
17.05.2025 15:48:40 INFO visible.PDVisibleSigBuilder:97 - AcroForm has been created
17.05.2025 15:48:40 INFO visible.PDVisibleSigBuilder:111 - Signature field has been created
17.05.2025 15:48:40 INFO visible.PDVisibleSigBuilder:128 - PDSignature has been created
17.05.2025 15:48:40 INFO visible.PDVisibleSigBuilder:146 - AcroForm dictionary has been created
17.05.2025 15:48:40 INFO visible.PDVisibleSigBuilder:169 - Matrix has been added
17.05.2025 15:48:40 INFO visible.PDVisibleSigBuilder:162 - Signature rectangle has been created
17.05.2025 15:48:40 INFO visible.PDVisibleSigBuilder:202 - Formatter rectangle has been created
17.05.2025 15:48:40 INFO visible.PDVisibleSigBuilder:189 - Visible Signature Image has been created
17.05.2025 15:48:40 INFO visible.PDVisibleSigBuilder:210 - Holder form stream has been created
17.05.2025 15:48:40 INFO visible.PDVisibleSigBuilder:218 - Holder form resources have been created
17.05.2025 15:48:40 INFO visible.PDVisibleSigBuilder:231 - Holder form has been created
17.05.2025 15:48:40 INFO visible.PDVisibleSigBuilder:248 - PDF appearance dictionary has been created
17.05.2025 15:48:40 INFO visible.PDVisibleSigBuilder:256 - Stream of another form (inner form - it will be inside holder form) has been created
17.05.2025 15:48:40 INFO visible.PDVisibleSigBuilder:265 - Resources of another form (inner form - it will be inside holder form)have been created
17.05.2025 15:48:40 INFO visible.PDVisibleSigBuilder:278 - Another form (inner form - it will be inside holder form) has been created
17.05.2025 15:48:40 INFO visible.PDVisibleSigBuilder:287 - Now inserted inner form inside holder form
17.05.2025 15:48:40 INFO visible.PDVisibleSigBuilder:295 - Created image form stream
17.05.2025 15:48:40 INFO visible.PDVisibleSigBuilder:303 - Created image form resources
17.05.2025 15:48:40 INFO visible.PDVisibleSigBuilder:325 - Created image form
17.05.2025 15:48:40 INFO visible.PDVisibleSigBuilder:338 - Created background layer form
17.05.2025 15:48:40 INFO visible.PDVisibleSigBuilder:351 - Inserted ProcSet to PDF
17.05.2025 15:48:40 INFO visible.PDVisibleSigBuilder:373 - Injected appearance stream to pdf
17.05.2025 15:48:40 INFO visible.PDVisibleSigBuilder:386 - Visible signature has been created
17.05.2025 15:48:40 INFO visible.PDVisibleSigBuilder:398 - WidgetDictionary has been created
17.05.2025 15:48:40 INFO visible.PDFTemplateCreator:151 - stream returning started, size= 28489
17.05.2025 15:48:40 INFO validation.CertInformationCollector:292 - Get alternative issuer certificate from: http://www.pki.admin.ch/aia/RegularCA01.crt
17.05.2025 15:48:41 INFO signature.SigUtils:440 - 200 OK
17.05.2025 15:48:41 INFO validation.CertInformationCollector:292 - Get alternative issuer certificate from: http://www.pki.admin.ch/aia/RootCAII.crt
17.05.2025 15:48:41 INFO signature.SigUtils:440 - 200 OK
17.05.2025 15:48:41 INFO validation.CertInformationCollector:248 - Found issuer for Cert: CN=Swiss Government Regular CA 01, OU=Certification Authorities, OU=Services, O=Admin, C=CH
CN=Swiss Government Root CA II, OU=Certification Authorities, OU=Services, O=The Federal Authorities of the Swiss Confederation, C=CH
17.05.2025 15:48:41 INFO validation.CertInformationCollector:248 - Found issuer for Cert: CN=EGBA-OFRF-UFRF, OU=CHE-377.639.368, O="Bundesamt fuer Justiz (BJ), Eidgenoessisches Amt fuer Grundbuch- und Bodenrecht (EGBA)", L=Bern (BE), C=CH
CN=Swiss Government Regular CA 01, OU=Certification Authorities, OU=Services, O=Admin, C=CH
17.05.2025 15:48:41 INFO validation.CertInformationCollector:248 - Found issuer for Cert: CN=Swiss Government Regular CA 01, OU=Certification Authorities, OU=Services, O=Admin, C=CH
CN=Swiss Government Root CA II, OU=Certification Authorities, OU=Services, O=The Federal Authorities of the Swiss Confederation, C=CH
17.05.2025 15:48:41 INFO validation.CertInformationCollector:292 - Get alternative issuer certificate from: http://www.pki.admin.ch/aia/RegulatedCA02.crt
17.05.2025 15:48:41 INFO signature.SigUtils:440 - 200 OK
17.05.2025 15:48:41 INFO validation.CertInformationCollector:292 - Get alternative issuer certificate from: http://www.pki.admin.ch/aia/RootCAIV.crt
17.05.2025 15:48:41 INFO signature.SigUtils:440 - 200 OK
17.05.2025 15:48:42 INFO validation.CertInformationCollector:248 - Found issuer for Cert: CN=Swiss Government Regulated CA 02, OU=Swiss Government PKI, O=Bundesamt fuer Informatik und Telekommunikation (BIT), OID.2.5.4.97=VATCH-CHE-221.032.573, C=CH
CN=Swiss Government Root CA IV, OU=Swiss Government PKI, O=Bundesamt fuer Informatik und Telekommunikation (BIT), C=CH
17.05.2025 15:48:42 INFO validation.CertInformationCollector:248 - Found issuer for Cert: CN=Swiss Government TSA, OU=Time Stamp Services, OU=Swiss Government PKI, O=Bundesamt fuer Informatik und Telekommunikation (BIT), OID.2.5.4.97=VATCH-CHE-221.032.573, L=Bern, C=CH
CN=Swiss Government Regulated CA 02, OU=Swiss Government PKI, O=Bundesamt fuer Informatik und Telekommunikation (BIT), OID.2.5.4.97=VATCH-CHE-221.032.573, C=CH
17.05.2025 15:48:42 INFO validation.CertInformationCollector:248 - Found issuer for Cert: CN=Swiss Government Regulated CA 02, OU=Swiss Government PKI, O=Bundesamt fuer Informatik und Telekommunikation (BIT), OID.2.5.4.97=VATCH-CHE-221.032.573, C=CH
CN=Swiss Government Root CA IV, OU=Swiss Government PKI, O=Bundesamt fuer Informatik und Telekommunikation (BIT), C=CH
17.05.2025 15:48:42 INFO cert.OcspHelper:439 - Nonce is good
17.05.2025 15:48:42 ERROR validation.AddValidationInformation:330 - Failed fetching OCSP at http://www.pki.admin.ch/aia/ocsp
org.bouncycastle.cert.ocsp.OCSPException: OCSP: Status of Cert is unknown
at org.apache.pdfbox.examples.signature.cert.OcspHelper.verifyOcspResponse(OcspHelper.java:248) ~[classes/:?]
at org.apache.pdfbox.examples.signature.cert.OcspHelper.getResponseOcsp(OcspHelper.java:139) ~[classes/:?]
at org.apache.pdfbox.examples.signature.validation.AddValidationInformation.addOcspData(AddValidationInformation.java:394) ~[classes/:?]
at org.apache.pdfbox.examples.signature.validation.AddValidationInformation.addOcspData(AddValidationInformation.java:380) ~[classes/:?]
at org.apache.pdfbox.examples.signature.validation.AddValidationInformation.fetchOcspData(AddValidationInformation.java:325) ~[classes/:?]
at org.apache.pdfbox.examples.signature.validation.AddValidationInformation.addRevocationDataRecursive(AddValidationInformation.java:284) ~[classes/:?]
at org.apache.pdfbox.examples.signature.validation.AddValidationInformation.updateVRI(AddValidationInformation.java:526) ~[classes/:?]
at org.apache.pdfbox.examples.signature.validation.AddValidationInformation.addRevocationData(AddValidationInformation.java:254) ~[classes/:?]
at org.apache.pdfbox.examples.signature.validation.AddValidationInformation.doValidation(AddValidationInformation.java:193) ~[classes/:?]
at org.apache.pdfbox.examples.signature.validation.AddValidationInformation.validateSignature(AddValidationInformation.java:134) ~[classes/:?]
at org.apache.pdfbox.examples.pdmodel.TestCreateSignature.testAddValidationInformation(TestCreateSignature.java:919) ~[test-classes/:?]
at java.base/jdk.internal.reflect.NativeMethodAccessorImpl.invoke0(Native Method) ~[?:?]
at java.base/jdk.internal.reflect.NativeMethodAccessorImpl.invoke(NativeMethodAccessorImpl.java:62) ~[?:?]
at java.base/jdk.internal.reflect.DelegatingMethodAccessorImpl.invoke(DelegatingMethodAccessorImpl.java:43) ~[?:?]
at java.base/java.lang.reflect.Method.invoke(Method.java:566) ~[?:?]
at org.junit.platform.commons.util.ReflectionUtils.invokeMethod(ReflectionUtils.java:775) ~[junit-platform-commons-1.12.1.jar:1.12.1]
at org.junit.platform.commons.support.ReflectionSupport.invokeMethod(ReflectionSupport.java:479) ~[junit-platform-commons-1.12.1.jar:1.12.1]
at org.junit.jupiter.engine.execution.MethodInvocation.proceed(MethodInvocation.java:60) ~[junit-jupiter-engine-5.12.1.jar:5.12.1]
at org.junit.jupiter.engine.execution.InvocationInterceptorChain$ValidatingInvocation.proceed(InvocationInterceptorChain.java:131) ~[junit-jupiter-engine-5.12.1.jar:5.12.1]
at org.junit.jupiter.engine.extension.TimeoutExtension.intercept(TimeoutExtension.java:161) ~[junit-jupiter-engine-5.12.1.jar:5.12.1]
at org.junit.jupiter.engine.extension.TimeoutExtension.interceptTestableMethod(TimeoutExtension.java:152) ~[junit-jupiter-engine-5.12.1.jar:5.12.1]
at org.junit.jupiter.engine.extension.TimeoutExtension.interceptTestMethod(TimeoutExtension.java:91) ~[junit-jupiter-engine-5.12.1.jar:5.12.1]
at org.junit.jupiter.engine.execution.InterceptingExecutableInvoker$ReflectiveInterceptorCall.lambda$ofVoidMethod$0(InterceptingExecutableInvoker.java:112) ~[junit-jupiter-engine-5.12.1.jar:5.12.1]
at org.junit.jupiter.engine.execution.InterceptingExecutableInvoker.lambda$invoke$0(InterceptingExecutableInvoker.java:94) ~[junit-jupiter-engine-5.12.1.jar:5.12.1]
at org.junit.jupiter.engine.execution.InvocationInterceptorChain$InterceptedInvocation.proceed(InvocationInterceptorChain.java:106) ~[junit-jupiter-engine-5.12.1.jar:5.12.1]
at org.junit.jupiter.engine.execution.InvocationInterceptorChain.proceed(InvocationInterceptorChain.java:64) ~[junit-jupiter-engine-5.12.1.jar:5.12.1]
at org.junit.jupiter.engine.execution.InvocationInterceptorChain.chainAndInvoke(InvocationInterceptorChain.java:45) ~[junit-jupiter-engine-5.12.1.jar:5.12.1]
at org.junit.jupiter.engine.execution.InvocationInterceptorChain.invoke(InvocationInterceptorChain.java:37) ~[junit-jupiter-engine-5.12.1.jar:5.12.1]
at org.junit.jupiter.engine.execution.InterceptingExecutableInvoker.invoke(InterceptingExecutableInvoker.java:93) ~[junit-jupiter-engine-5.12.1.jar:5.12.1]
at org.junit.jupiter.engine.execution.InterceptingExecutableInvoker.invoke(InterceptingExecutableInvoker.java:87) ~[junit-jupiter-engine-5.12.1.jar:5.12.1]
at org.junit.jupiter.engine.descriptor.TestMethodTestDescriptor.lambda$invokeTestMethod$7(TestMethodTestDescriptor.java:216) ~[junit-jupiter-engine-5.12.1.jar:5.12.1]
at org.junit.platform.engine.support.hierarchical.ThrowableCollector.execute(ThrowableCollector.java:73) ~[junit-platform-engine-1.12.1.jar:1.12.1]
at org.junit.jupiter.engine.descriptor.TestMethodTestDescriptor.invokeTestMethod(TestMethodTestDescriptor.java:212) ~[junit-jupiter-engine-5.12.1.jar:5.12.1]
at org.junit.jupiter.engine.descriptor.TestMethodTestDescriptor.execute(TestMethodTestDescriptor.java:137) ~[junit-jupiter-engine-5.12.1.jar:5.12.1]
at org.junit.jupiter.engine.descriptor.TestMethodTestDescriptor.execute(TestMethodTestDescriptor.java:69) ~[junit-jupiter-engine-5.12.1.jar:5.12.1]
at org.junit.platform.engine.support.hierarchical.NodeTestTask.lambda$executeRecursively$6(NodeTestTask.java:156) ~[junit-platform-engine-1.12.1.jar:1.12.1]
at org.junit.platform.engine.support.hierarchical.ThrowableCollector.execute(ThrowableCollector.java:73) ~[junit-platform-engine-1.12.1.jar:1.12.1]
at org.junit.platform.engine.support.hierarchical.NodeTestTask.lambda$executeRecursively$8(NodeTestTask.java:146) ~[junit-platform-engine-1.12.1.jar:1.12.1]
at org.junit.platform.engine.support.hierarchical.Node.around(Node.java:137) ~[junit-platform-engine-1.12.1.jar:1.12.1]
at org.junit.platform.engine.support.hierarchical.NodeTestTask.lambda$executeRecursively$9(NodeTestTask.java:144) ~[junit-platform-engine-1.12.1.jar:1.12.1]
at org.junit.platform.engine.support.hierarchical.ThrowableCollector.execute(ThrowableCollector.java:73) ~[junit-platform-engine-1.12.1.jar:1.12.1]
at org.junit.platform.engine.support.hierarchical.NodeTestTask.executeRecursively(NodeTestTask.java:143) ~[junit-platform-engine-1.12.1.jar:1.12.1]
at org.junit.platform.engine.support.hierarchical.NodeTestTask.execute(NodeTestTask.java:100) ~[junit-platform-engine-1.12.1.jar:1.12.1]
at org.junit.platform.engine.support.hierarchical.ForkJoinPoolHierarchicalTestExecutorService$ExclusiveTask.exec(ForkJoinPoolHierarchicalTestExecutorService.java:274) ~[junit-platform-engine-1.12.1.jar:1.12.1]
at org.junit.platform.engine.support.hierarchical.ForkJoinPoolHierarchicalTestExecutorService$ExclusiveTask.execSync(ForkJoinPoolHierarchicalTestExecutorService.java:247) ~[junit-platform-engine-1.12.1.jar:1.12.1]
at org.junit.platform.engine.support.hierarchical.ForkJoinPoolHierarchicalTestExecutorService.executeSync(ForkJoinPoolHierarchicalTestExecutorService.java:194) ~[junit-platform-engine-1.12.1.jar:1.12.1]
at org.junit.platform.engine.support.hierarchical.ForkJoinPoolHierarchicalTestExecutorService.invokeAll(ForkJoinPoolHierarchicalTestExecutorService.java:166) ~[junit-platform-engine-1.12.1.jar:1.12.1]
at org.junit.platform.engine.support.hierarchical.NodeTestTask.lambda$executeRecursively$6(NodeTestTask.java:160) ~[junit-platform-engine-1.12.1.jar:1.12.1]
at org.junit.platform.engine.support.hierarchical.ThrowableCollector.execute(ThrowableCollector.java:73) ~[junit-platform-engine-1.12.1.jar:1.12.1]
at org.junit.platform.engine.support.hierarchical.NodeTestTask.lambda$executeRecursively$8(NodeTestTask.java:146) ~[junit-platform-engine-1.12.1.jar:1.12.1]
at org.junit.platform.engine.support.hierarchical.Node.around(Node.java:137) ~[junit-platform-engine-1.12.1.jar:1.12.1]
at org.junit.platform.engine.support.hierarchical.NodeTestTask.lambda$executeRecursively$9(NodeTestTask.java:144) ~[junit-platform-engine-1.12.1.jar:1.12.1]
at org.junit.platform.engine.support.hierarchical.ThrowableCollector.execute(ThrowableCollector.java:73) [junit-platform-engine-1.12.1.jar:1.12.1]
at org.junit.platform.engine.support.hierarchical.NodeTestTask.executeRecursively(NodeTestTask.java:143) [junit-platform-engine-1.12.1.jar:1.12.1]
at org.junit.platform.engine.support.hierarchical.NodeTestTask.execute(NodeTestTask.java:100) [junit-platform-engine-1.12.1.jar:1.12.1]
at org.junit.platform.engine.support.hierarchical.ForkJoinPoolHierarchicalTestExecutorService$ExclusiveTask.exec(ForkJoinPoolHierarchicalTestExecutorService.java:274) [junit-platform-engine-1.12.1.jar:1.12.1]
at java.base/java.util.concurrent.ForkJoinTask.doExec(ForkJoinTask.java:290) [?:?]
at java.base/java.util.concurrent.ForkJoinPool$WorkQueue.topLevelExec(ForkJoinPool.java:1020) [?:?]
at java.base/java.util.concurrent.ForkJoinPool.scan(ForkJoinPool.java:1656) [?:?]
at java.base/java.util.concurrent.ForkJoinPool.runWorker(ForkJoinPool.java:1594) [?:?]
at java.base/java.util.concurrent.ForkJoinWorkerThread.run(ForkJoinWorkerThread.java:183) [?:?]
17.05.2025 15:48:42 INFO signature.SigUtils:440 - 200 OK
17.05.2025 15:48:42 INFO cert.CRLVerifier:229 - The certificate was not revoked by CRL http://www.pki.admin.ch/crl/RegularCA01.crl
17.05.2025 15:48:42 INFO validation.CertInformationCollector:248 - Found issuer for Cert: CN=Swiss Government Regular CA 01, OU=Certification Authorities, OU=Services, O=Admin, C=CH
CN=Swiss Government Root CA II, OU=Certification Authorities, OU=Services, O=The Federal Authorities of the Swiss Confederation, C=CH
17.05.2025 15:48:43 INFO cert.OcspHelper:439 - Nonce is good
17.05.2025 15:48:43 INFO validation.CertInformationCollector:248 - Found issuer for Cert: CN=OCSP-Responder-RootCAII, OU=Swiss Government PKI, O=Bundesamt fuer Informatik und Telekommunikation (BIT), C=CH
CN=Swiss Government Root CA II, OU=Certification Authorities, OU=Services, O=The Federal Authorities of the Swiss Confederation, C=CH
17.05.2025 15:48:43 INFO cert.OcspHelper:439 - Nonce is good
17.05.2025 15:48:43 INFO validation.CertInformationCollector:248 - Found issuer for Cert: CN=OCSP-Responder-RegulatedCA02, OU=Swiss Government PKI, O=Bundesamt fuer Informatik und Telekommunikation (BIT), C=CH
CN=Swiss Government Regulated CA 02, OU=Swiss Government PKI, O=Bundesamt fuer Informatik und Telekommunikation (BIT), OID.2.5.4.97=VATCH-CHE-221.032.573, C=CH
17.05.2025 15:48:43 INFO validation.CertInformationCollector:248 - Found issuer for Cert: CN=Swiss Government Regulated CA 02, OU=Swiss Government PKI, O=Bundesamt fuer Informatik und Telekommunikation (BIT), OID.2.5.4.97=VATCH-CHE-221.032.573, C=CH
CN=Swiss Government Root CA IV, OU=Swiss Government PKI, O=Bundesamt fuer Informatik und Telekommunikation (BIT), C=CH
17.05.2025 15:48:43 INFO cert.OcspHelper:439 - Nonce is good
17.05.2025 15:48:43 INFO validation.CertInformationCollector:248 - Found issuer for Cert: CN=OCSP-Responder-RootCAIV, OU=Swiss Government PKI, O=Bundesamt fuer Informatik und Telekommunikation (BIT), C=CH
CN=Swiss Government Root CA IV, OU=Swiss Government PKI, O=Bundesamt fuer Informatik und Telekommunikation (BIT), C=CH
hexSignatureHash: FDAF28ED27407334A7606598CD1156C9052FC7D4
hexCrlSignatureHash: 5B438C0B683144052F424FA890213D779522CCC2
ocspSignatureHash: 1A35253EE4E6F96010CE176DFAC4605468C4D4BE
ocspSignatureHash: 5A8D6E90835AE63C0B5A3827542AD29295C629AB
ocspSignatureHash: 527779D0D44CB3A96EEE16C5033973E8D3AD9B32
[INFO] Tests run: 16, Failures: 0, Errors: 0, Skipped: 0, Time elapsed: 27.13 s -- in org.apache.pdfbox.examples.pdmodel.TestCreateSignature
[INFO]
[INFO] Results:
[INFO]
[INFO] Tests run: 35, Failures: 0, Errors: 0, Skipped: 0
[INFO]
[JENKINS] Recording test results
[INFO]
[INFO] --- animal-sniffer-maven-plugin:1.24:check (check-java-version) @ pdfbox-examples ---
[INFO] Checking unresolved references to org.codehaus.mojo.signature:java18:1.0
[INFO]
[INFO] --- maven-jar-plugin:3.4.2:jar (default-jar) @ pdfbox-examples ---
[INFO] Building jar: <https://ci-builds.apache.org/job/PDFBox/job/PDFBox-3.0.x/ws/examples/target/pdfbox-examples-3.0.6-SNAPSHOT.jar>
[INFO]
[INFO] --- apache-rat-plugin:0.16.1:check (default) @ pdfbox-examples ---
[INFO] Rat check: Summary over all files. Unapproved: 0, unknown: 0, generated: 0, approved: 114 licenses.
[INFO]
[INFO] --- dependency-check-maven:10.0.4:check (default) @ pdfbox-examples ---
[INFO] Skipping dependency-check
[INFO]
[INFO] --- maven-install-plugin:3.1.4:install (default-install) @ pdfbox-examples ---
[INFO] Installing <https://ci-builds.apache.org/job/PDFBox/job/PDFBox-3.0.x/ws/examples/pom.xml> to /home/jenkins/.m2/repository/org/apache/pdfbox/pdfbox-examples/3.0.6-SNAPSHOT/pdfbox-examples-3.0.6-SNAPSHOT.pom
[INFO] Installing <https://ci-builds.apache.org/job/PDFBox/job/PDFBox-3.0.x/ws/examples/target/pdfbox-examples-3.0.6-SNAPSHOT.jar> to /home/jenkins/.m2/repository/org/apache/pdfbox/pdfbox-examples/3.0.6-SNAPSHOT/pdfbox-examples-3.0.6-SNAPSHOT.jar
[INFO]
[INFO] --- maven-deploy-plugin:3.1.4:deploy (default-deploy) @ pdfbox-examples ---
[INFO] Downloading from apache.snapshots.https: https://repository.apache.org/content/repositories/snapshots/org/apache/pdfbox/pdfbox-examples/3.0.6-SNAPSHOT/maven-metadata.xml
[INFO] Downloaded from apache.snapshots.https: https://repository.apache.org/content/repositories/snapshots/org/apache/pdfbox/pdfbox-examples/3.0.6-SNAPSHOT/maven-metadata.xml (785 B at 1.1 kB/s)
[INFO] Uploading to apache.snapshots.https: https://repository.apache.org/content/repositories/snapshots/org/apache/pdfbox/pdfbox-examples/3.0.6-SNAPSHOT/pdfbox-examples-3.0.6-20250517.153804-14.pom
[INFO] Uploading to apache.snapshots.https: https://repository.apache.org/content/repositories/snapshots/org/apache/pdfbox/pdfbox-examples/3.0.6-SNAPSHOT/pdfbox-examples-3.0.6-20250517.153804-14.jar
[INFO] Uploaded to apache.snapshots.https: https://repository.apache.org/content/repositories/snapshots/org/apache/pdfbox/pdfbox-examples/3.0.6-SNAPSHOT/pdfbox-examples-3.0.6-20250517.153804-14.jar (387 kB at 89 kB/s)
[INFO] ------------------------------------------------------------------------
[INFO] Reactor Summary for Apache PDFBox Reactor 3.0.6-SNAPSHOT:
[INFO]
[INFO] Apache PDFBox parent ............................... SUCCESS [ 31.026 s]
[INFO] Apache PDFBox io ................................... SUCCESS [01:08 min]
[INFO] Apache FontBox ..................................... SUCCESS [ 46.624 s]
[INFO] Apache XmpBox ...................................... SUCCESS [ 30.650 s]
[INFO] Apache PDFBox ...................................... SUCCESS [01:56 min]
[INFO] Apache Preflight ................................... SUCCESS [01:21 min]
[INFO] Apache Preflight application ....................... SUCCESS [ 38.538 s]
[INFO] Apache PDFBox Debugger ............................. SUCCESS [ 33.048 s]
[INFO] Apache PDFBox tools ................................ SUCCESS [ 39.381 s]
[INFO] Apache PDFBox application .......................... SUCCESS [ 33.367 s]
[INFO] Apache PDFBox Debugger application ................. SUCCESS [ 39.468 s]
[INFO] Apache PDFBox examples ............................. FAILURE [01:57 min]
[INFO] Apache PDFBox Reactor .............................. SKIPPED
[INFO] ------------------------------------------------------------------------
[INFO] BUILD FAILURE
[INFO] ------------------------------------------------------------------------
[INFO] Total time: 12:11 min
[INFO] Finished at: 2025-05-17T15:50:15Z
[INFO] ------------------------------------------------------------------------
Waiting for Jenkins to finish collecting data
[ERROR] Failed to execute goal org.apache.maven.plugins:maven-deploy-plugin:3.1.4:deploy (default-deploy) on project pdfbox-examples: Failed to deploy artifacts: Could not transfer artifact org.apache.pdfbox:pdfbox-examples:pom:3.0.6-20250517.153804-14 from/to apache.snapshots.https (https://repository.apache.org/content/repositories/snapshots): transfer failed for https://repository.apache.org/content/repositories/snapshots/org/apache/pdfbox/pdfbox-examples/3.0.6-SNAPSHOT/pdfbox-examples-3.0.6-20250517.153804-14.pom, status: 502 Proxy Error -> [Help 1]
[ERROR]
[ERROR] To see the full stack trace of the errors, re-run Maven with the -e switch.
[ERROR] Re-run Maven using the -X switch to enable full debug logging.
[ERROR]
[ERROR] For more information about the errors and possible solutions, please read the following articles:
[ERROR] [Help 1] http://cwiki.apache.org/confluence/display/MAVEN/MojoExecutionException
[ERROR]
[ERROR] After correcting the problems, you can resume the build with the command
[ERROR] mvn <goals> -rf :pdfbox-examples
[JENKINS] Archiving <https://ci-builds.apache.org/job/PDFBox/job/PDFBox-3.0.x/ws/examples/pom.xml> to org.apache.pdfbox/pdfbox-examples/3.0.6-SNAPSHOT/pdfbox-examples-3.0.6-SNAPSHOT.pom
[JENKINS] Archiving <https://ci-builds.apache.org/job/PDFBox/job/PDFBox-3.0.x/ws/examples/target/pdfbox-examples-3.0.6-SNAPSHOT.jar> to org.apache.pdfbox/pdfbox-examples/3.0.6-SNAPSHOT/pdfbox-examples-3.0.6-SNAPSHOT.jar
[JENKINS] Archiving <https://ci-builds.apache.org/job/PDFBox/job/PDFBox-3.0.x/ws/parent/pom.xml> to org.apache.pdfbox/pdfbox-parent/3.0.6-SNAPSHOT/pdfbox-parent-3.0.6-SNAPSHOT.pom
[JENKINS] Archiving <https://ci-builds.apache.org/job/PDFBox/job/PDFBox-3.0.x/ws/pdfbox/pom.xml> to org.apache.pdfbox/pdfbox/3.0.6-SNAPSHOT/pdfbox-3.0.6-SNAPSHOT.pom
[JENKINS] Archiving <https://ci-builds.apache.org/job/PDFBox/job/PDFBox-3.0.x/ws/pdfbox/target/pdfbox-3.0.6-SNAPSHOT.jar> to org.apache.pdfbox/pdfbox/3.0.6-SNAPSHOT/pdfbox-3.0.6-SNAPSHOT.jar
[JENKINS] Archiving <https://ci-builds.apache.org/job/PDFBox/job/PDFBox-3.0.x/ws/debugger-app/pom.xml> to org.apache.pdfbox/debugger-app/3.0.6-SNAPSHOT/debugger-app-3.0.6-SNAPSHOT.pom
[JENKINS] Archiving <https://ci-builds.apache.org/job/PDFBox/job/PDFBox-3.0.x/ws/debugger-app/target/debugger-app-3.0.6-SNAPSHOT.jar> to org.apache.pdfbox/debugger-app/3.0.6-SNAPSHOT/debugger-app-3.0.6-SNAPSHOT.jar
[JENKINS] Archiving <https://ci-builds.apache.org/job/PDFBox/job/PDFBox-3.0.x/ws/io/pom.xml> to org.apache.pdfbox/pdfbox-io/3.0.6-SNAPSHOT/pdfbox-io-3.0.6-SNAPSHOT.pom
[JENKINS] Archiving <https://ci-builds.apache.org/job/PDFBox/job/PDFBox-3.0.x/ws/io/target/pdfbox-io-3.0.6-SNAPSHOT.jar> to org.apache.pdfbox/pdfbox-io/3.0.6-SNAPSHOT/pdfbox-io-3.0.6-SNAPSHOT.jar
[JENKINS] Archiving <https://ci-builds.apache.org/job/PDFBox/job/PDFBox-3.0.x/ws/fontbox/pom.xml> to org.apache.pdfbox/fontbox/3.0.6-SNAPSHOT/fontbox-3.0.6-SNAPSHOT.pom
[JENKINS] Archiving <https://ci-builds.apache.org/job/PDFBox/job/PDFBox-3.0.x/ws/fontbox/target/fontbox-3.0.6-SNAPSHOT.jar> to org.apache.pdfbox/fontbox/3.0.6-SNAPSHOT/fontbox-3.0.6-SNAPSHOT.jar
[JENKINS] Archiving <https://ci-builds.apache.org/job/PDFBox/job/PDFBox-3.0.x/ws/xmpbox/pom.xml> to org.apache.pdfbox/xmpbox/3.0.6-SNAPSHOT/xmpbox-3.0.6-SNAPSHOT.pom
[JENKINS] Archiving <https://ci-builds.apache.org/job/PDFBox/job/PDFBox-3.0.x/ws/xmpbox/target/xmpbox-3.0.6-SNAPSHOT.jar> to org.apache.pdfbox/xmpbox/3.0.6-SNAPSHOT/xmpbox-3.0.6-SNAPSHOT.jar
[JENKINS] Archiving <https://ci-builds.apache.org/job/PDFBox/job/PDFBox-3.0.x/ws/tools/pom.xml> to org.apache.pdfbox/pdfbox-tools/3.0.6-SNAPSHOT/pdfbox-tools-3.0.6-SNAPSHOT.pom
[JENKINS] Archiving <https://ci-builds.apache.org/job/PDFBox/job/PDFBox-3.0.x/ws/tools/target/pdfbox-tools-3.0.6-SNAPSHOT.jar> to org.apache.pdfbox/pdfbox-tools/3.0.6-SNAPSHOT/pdfbox-tools-3.0.6-SNAPSHOT.jar
[JENKINS] Archiving <https://ci-builds.apache.org/job/PDFBox/job/PDFBox-3.0.x/ws/debugger/pom.xml> to org.apache.pdfbox/pdfbox-debugger/3.0.6-SNAPSHOT/pdfbox-debugger-3.0.6-SNAPSHOT.pom
[JENKINS] Archiving <https://ci-builds.apache.org/job/PDFBox/job/PDFBox-3.0.x/ws/debugger/target/pdfbox-debugger-3.0.6-SNAPSHOT.jar> to org.apache.pdfbox/pdfbox-debugger/3.0.6-SNAPSHOT/pdfbox-debugger-3.0.6-SNAPSHOT.jar
[JENKINS] Archiving <https://ci-builds.apache.org/job/PDFBox/job/PDFBox-3.0.x/ws/preflight-app/pom.xml> to org.apache.pdfbox/preflight-app/3.0.6-SNAPSHOT/preflight-app-3.0.6-SNAPSHOT.pom
[JENKINS] Archiving <https://ci-builds.apache.org/job/PDFBox/job/PDFBox-3.0.x/ws/preflight-app/target/preflight-app-3.0.6-SNAPSHOT.jar> to org.apache.pdfbox/preflight-app/3.0.6-SNAPSHOT/preflight-app-3.0.6-SNAPSHOT.jar
[JENKINS] Archiving <https://ci-builds.apache.org/job/PDFBox/job/PDFBox-3.0.x/ws/app/pom.xml> to org.apache.pdfbox/pdfbox-app/3.0.6-SNAPSHOT/pdfbox-app-3.0.6-SNAPSHOT.pom
[JENKINS] Archiving <https://ci-builds.apache.org/job/PDFBox/job/PDFBox-3.0.x/ws/app/target/pdfbox-app-3.0.6-SNAPSHOT.jar> to org.apache.pdfbox/pdfbox-app/3.0.6-SNAPSHOT/pdfbox-app-3.0.6-SNAPSHOT.jar
[JENKINS] Archiving <https://ci-builds.apache.org/job/PDFBox/job/PDFBox-3.0.x/ws/preflight/pom.xml> to org.apache.pdfbox/preflight/3.0.6-SNAPSHOT/preflight-3.0.6-SNAPSHOT.pom
[JENKINS] Archiving <https://ci-builds.apache.org/job/PDFBox/job/PDFBox-3.0.x/ws/preflight/target/preflight-3.0.6-SNAPSHOT.jar> to org.apache.pdfbox/preflight/3.0.6-SNAPSHOT/preflight-3.0.6-SNAPSHOT.jar
[JENKINS] Archiving <https://ci-builds.apache.org/job/PDFBox/job/PDFBox-3.0.x/ws/pom.xml> to org.apache.pdfbox/pdfbox-reactor/3.0.6-SNAPSHOT/pdfbox-reactor-3.0.6-SNAPSHOT.pom
Sending e-mails to: dev@pdfbox.apache.org
No mail will be sent out, as 'PDFBox » PDFBox-3.0.x » Apache PDFBox Reactor #738' does not have a result yet. Please make sure you set a proper result in case of pipeline/build scripts.
channel stopped
Archiving artifacts
---------------------------------------------------------------------
To unsubscribe, e-mail: dev-unsubscribe@pdfbox.apache.org
For additional commands, e-mail: dev-help@pdfbox.apache.org
Jenkins build is back to normal : PDFBox » PDFBox-3.0.x #739
Posted by Apache Jenkins Server <je...@builds.apache.org>.
See <https://ci-builds.apache.org/job/PDFBox/job/PDFBox-3.0.x/739/display/redirect?page=changes>
---------------------------------------------------------------------
To unsubscribe, e-mail: dev-unsubscribe@pdfbox.apache.org
For additional commands, e-mail: dev-help@pdfbox.apache.org