You are viewing a plain text version of this content. The canonical link for it is here.
Posted to dev@lucene.apache.org by Policeman Jenkins Server <je...@thetaphi.de> on 2014/02/04 19:25:57 UTC

[JENKINS] Lucene-Solr-trunk-Linux (32bit/jdk1.7.0_51) - Build # 9356 - Still Failing!

Build: http://jenkins.thetaphi.de/job/Lucene-Solr-trunk-Linux/9356/
Java: 32bit/jdk1.7.0_51 -server -XX:+UseG1GC

46 tests failed.
REGRESSION:  org.apache.solr.core.TestMergePolicyConfig.testLegacyMergePolicyConfig

Error Message:
SolrCore 'collection1' is not available due to init failure: Lock obtain timed out: org.apache.lucene.store.MockLockFactoryWrapper$MockLock@7e794a

Stack Trace:
org.apache.solr.common.SolrException: SolrCore 'collection1' is not available due to init failure: Lock obtain timed out: org.apache.lucene.store.MockLockFactoryWrapper$MockLock@7e794a
	at __randomizedtesting.SeedInfo.seed([75213E37388FEB53:E65949109745A25]:0)
	at org.apache.solr.core.CoreContainer.getCore(CoreContainer.java:823)
	at org.apache.solr.util.TestHarness.getCore(TestHarness.java:201)
	at org.apache.solr.core.TestMergePolicyConfig.testLegacyMergePolicyConfig(TestMergePolicyConfig.java:69)
	at sun.reflect.NativeMethodAccessorImpl.invoke0(Native Method)
	at sun.reflect.NativeMethodAccessorImpl.invoke(NativeMethodAccessorImpl.java:57)
	at sun.reflect.DelegatingMethodAccessorImpl.invoke(DelegatingMethodAccessorImpl.java:43)
	at java.lang.reflect.Method.invoke(Method.java:606)
	at com.carrotsearch.randomizedtesting.RandomizedRunner.invoke(RandomizedRunner.java:1559)
	at com.carrotsearch.randomizedtesting.RandomizedRunner.access$600(RandomizedRunner.java:79)
	at com.carrotsearch.randomizedtesting.RandomizedRunner$6.evaluate(RandomizedRunner.java:737)
	at com.carrotsearch.randomizedtesting.RandomizedRunner$7.evaluate(RandomizedRunner.java:773)
	at com.carrotsearch.randomizedtesting.RandomizedRunner$8.evaluate(RandomizedRunner.java:787)
	at com.carrotsearch.randomizedtesting.rules.SystemPropertiesRestoreRule$1.evaluate(SystemPropertiesRestoreRule.java:53)
	at org.apache.lucene.util.TestRuleSetupTeardownChained$1.evaluate(TestRuleSetupTeardownChained.java:50)
	at org.apache.lucene.util.TestRuleFieldCacheSanity$1.evaluate(TestRuleFieldCacheSanity.java:51)
	at org.apache.lucene.util.AbstractBeforeAfterRule$1.evaluate(AbstractBeforeAfterRule.java:46)
	at com.carrotsearch.randomizedtesting.rules.SystemPropertiesInvariantRule$1.evaluate(SystemPropertiesInvariantRule.java:55)
	at org.apache.lucene.util.TestRuleThreadAndTestName$1.evaluate(TestRuleThreadAndTestName.java:49)
	at org.apache.lucene.util.TestRuleIgnoreAfterMaxFailures$1.evaluate(TestRuleIgnoreAfterMaxFailures.java:70)
	at org.apache.lucene.util.TestRuleMarkFailure$1.evaluate(TestRuleMarkFailure.java:48)
	at com.carrotsearch.randomizedtesting.rules.StatementAdapter.evaluate(StatementAdapter.java:36)
	at com.carrotsearch.randomizedtesting.ThreadLeakControl$StatementRunner.run(ThreadLeakControl.java:358)
	at com.carrotsearch.randomizedtesting.ThreadLeakControl.forkTimeoutingTask(ThreadLeakControl.java:782)
	at com.carrotsearch.randomizedtesting.ThreadLeakControl$3.evaluate(ThreadLeakControl.java:442)
	at com.carrotsearch.randomizedtesting.RandomizedRunner.runSingleTest(RandomizedRunner.java:746)
	at com.carrotsearch.randomizedtesting.RandomizedRunner$3.evaluate(RandomizedRunner.java:648)
	at com.carrotsearch.randomizedtesting.RandomizedRunner$4.evaluate(RandomizedRunner.java:682)
	at com.carrotsearch.randomizedtesting.RandomizedRunner$5.evaluate(RandomizedRunner.java:693)
	at com.carrotsearch.randomizedtesting.rules.StatementAdapter.evaluate(StatementAdapter.java:36)
	at com.carrotsearch.randomizedtesting.rules.SystemPropertiesRestoreRule$1.evaluate(SystemPropertiesRestoreRule.java:53)
	at org.apache.lucene.util.AbstractBeforeAfterRule$1.evaluate(AbstractBeforeAfterRule.java:46)
	at org.apache.lucene.util.TestRuleStoreClassName$1.evaluate(TestRuleStoreClassName.java:42)
	at com.carrotsearch.randomizedtesting.rules.SystemPropertiesInvariantRule$1.evaluate(SystemPropertiesInvariantRule.java:55)
	at com.carrotsearch.randomizedtesting.rules.NoShadowingOrOverridesOnMethodsRule$1.evaluate(NoShadowingOrOverridesOnMethodsRule.java:39)
	at com.carrotsearch.randomizedtesting.rules.NoShadowingOrOverridesOnMethodsRule$1.evaluate(NoShadowingOrOverridesOnMethodsRule.java:39)
	at com.carrotsearch.randomizedtesting.rules.StatementAdapter.evaluate(StatementAdapter.java:36)
	at org.apache.lucene.util.TestRuleAssertionsRequired$1.evaluate(TestRuleAssertionsRequired.java:43)
	at org.apache.lucene.util.TestRuleMarkFailure$1.evaluate(TestRuleMarkFailure.java:48)
	at org.apache.lucene.util.TestRuleIgnoreAfterMaxFailures$1.evaluate(TestRuleIgnoreAfterMaxFailures.java:70)
	at org.apache.lucene.util.TestRuleIgnoreTestSuites$1.evaluate(TestRuleIgnoreTestSuites.java:55)
	at com.carrotsearch.randomizedtesting.rules.StatementAdapter.evaluate(StatementAdapter.java:36)
	at com.carrotsearch.randomizedtesting.ThreadLeakControl$StatementRunner.run(ThreadLeakControl.java:358)
	at java.lang.Thread.run(Thread.java:744)
Caused by: org.apache.solr.common.SolrException: Lock obtain timed out: org.apache.lucene.store.MockLockFactoryWrapper$MockLock@7e794a
	at org.apache.solr.core.SolrCore.<init>(SolrCore.java:842)
	at org.apache.solr.core.SolrCore.<init>(SolrCore.java:628)
	at org.apache.solr.core.CoreContainer.createFromLocal(CoreContainer.java:562)
	at org.apache.solr.core.CoreContainer.create(CoreContainer.java:597)
	at org.apache.solr.core.CoreContainer$1.call(CoreContainer.java:258)
	at org.apache.solr.core.CoreContainer$1.call(CoreContainer.java:250)
	at java.util.concurrent.FutureTask.run(FutureTask.java:262)
	at java.util.concurrent.Executors$RunnableAdapter.call(Executors.java:471)
	at java.util.concurrent.FutureTask.run(FutureTask.java:262)
	at java.util.concurrent.ThreadPoolExecutor.runWorker(ThreadPoolExecutor.java:1145)
	at java.util.concurrent.ThreadPoolExecutor$Worker.run(ThreadPoolExecutor.java:615)
	... 1 more
Caused by: org.apache.lucene.store.LockObtainFailedException: Lock obtain timed out: org.apache.lucene.store.MockLockFactoryWrapper$MockLock@7e794a
	at org.apache.lucene.store.Lock.obtain(Lock.java:89)
	at org.apache.lucene.index.IndexWriter.<init>(IndexWriter.java:701)
	at org.apache.solr.update.SolrIndexWriter.<init>(SolrIndexWriter.java:77)
	at org.apache.solr.update.SolrIndexWriter.create(SolrIndexWriter.java:64)
	at org.apache.solr.core.SolrCore.initIndex(SolrCore.java:509)
	at org.apache.solr.core.SolrCore.<init>(SolrCore.java:759)
	... 11 more


REGRESSION:  org.apache.solr.core.TestMergePolicyConfig.testLogMergePolicyConfig

Error Message:
SolrCore 'collection1' is not available due to init failure: Lock obtain timed out: org.apache.lucene.store.MockLockFactoryWrapper$MockLock@13f9e40

Stack Trace:
org.apache.solr.common.SolrException: SolrCore 'collection1' is not available due to init failure: Lock obtain timed out: org.apache.lucene.store.MockLockFactoryWrapper$MockLock@13f9e40
	at __randomizedtesting.SeedInfo.seed([75213E37388FEB53:2BA9080FD11BB3D1]:0)
	at org.apache.solr.core.CoreContainer.getCore(CoreContainer.java:823)
	at org.apache.solr.util.TestHarness.getCore(TestHarness.java:201)
	at org.apache.solr.core.TestMergePolicyConfig.testLogMergePolicyConfig(TestMergePolicyConfig.java:130)
	at sun.reflect.NativeMethodAccessorImpl.invoke0(Native Method)
	at sun.reflect.NativeMethodAccessorImpl.invoke(NativeMethodAccessorImpl.java:57)
	at sun.reflect.DelegatingMethodAccessorImpl.invoke(DelegatingMethodAccessorImpl.java:43)
	at java.lang.reflect.Method.invoke(Method.java:606)
	at com.carrotsearch.randomizedtesting.RandomizedRunner.invoke(RandomizedRunner.java:1559)
	at com.carrotsearch.randomizedtesting.RandomizedRunner.access$600(RandomizedRunner.java:79)
	at com.carrotsearch.randomizedtesting.RandomizedRunner$6.evaluate(RandomizedRunner.java:737)
	at com.carrotsearch.randomizedtesting.RandomizedRunner$7.evaluate(RandomizedRunner.java:773)
	at com.carrotsearch.randomizedtesting.RandomizedRunner$8.evaluate(RandomizedRunner.java:787)
	at com.carrotsearch.randomizedtesting.rules.SystemPropertiesRestoreRule$1.evaluate(SystemPropertiesRestoreRule.java:53)
	at org.apache.lucene.util.TestRuleSetupTeardownChained$1.evaluate(TestRuleSetupTeardownChained.java:50)
	at org.apache.lucene.util.TestRuleFieldCacheSanity$1.evaluate(TestRuleFieldCacheSanity.java:51)
	at org.apache.lucene.util.AbstractBeforeAfterRule$1.evaluate(AbstractBeforeAfterRule.java:46)
	at com.carrotsearch.randomizedtesting.rules.SystemPropertiesInvariantRule$1.evaluate(SystemPropertiesInvariantRule.java:55)
	at org.apache.lucene.util.TestRuleThreadAndTestName$1.evaluate(TestRuleThreadAndTestName.java:49)
	at org.apache.lucene.util.TestRuleIgnoreAfterMaxFailures$1.evaluate(TestRuleIgnoreAfterMaxFailures.java:70)
	at org.apache.lucene.util.TestRuleMarkFailure$1.evaluate(TestRuleMarkFailure.java:48)
	at com.carrotsearch.randomizedtesting.rules.StatementAdapter.evaluate(StatementAdapter.java:36)
	at com.carrotsearch.randomizedtesting.ThreadLeakControl$StatementRunner.run(ThreadLeakControl.java:358)
	at com.carrotsearch.randomizedtesting.ThreadLeakControl.forkTimeoutingTask(ThreadLeakControl.java:782)
	at com.carrotsearch.randomizedtesting.ThreadLeakControl$3.evaluate(ThreadLeakControl.java:442)
	at com.carrotsearch.randomizedtesting.RandomizedRunner.runSingleTest(RandomizedRunner.java:746)
	at com.carrotsearch.randomizedtesting.RandomizedRunner$3.evaluate(RandomizedRunner.java:648)
	at com.carrotsearch.randomizedtesting.RandomizedRunner$4.evaluate(RandomizedRunner.java:682)
	at com.carrotsearch.randomizedtesting.RandomizedRunner$5.evaluate(RandomizedRunner.java:693)
	at com.carrotsearch.randomizedtesting.rules.StatementAdapter.evaluate(StatementAdapter.java:36)
	at com.carrotsearch.randomizedtesting.rules.SystemPropertiesRestoreRule$1.evaluate(SystemPropertiesRestoreRule.java:53)
	at org.apache.lucene.util.AbstractBeforeAfterRule$1.evaluate(AbstractBeforeAfterRule.java:46)
	at org.apache.lucene.util.TestRuleStoreClassName$1.evaluate(TestRuleStoreClassName.java:42)
	at com.carrotsearch.randomizedtesting.rules.SystemPropertiesInvariantRule$1.evaluate(SystemPropertiesInvariantRule.java:55)
	at com.carrotsearch.randomizedtesting.rules.NoShadowingOrOverridesOnMethodsRule$1.evaluate(NoShadowingOrOverridesOnMethodsRule.java:39)
	at com.carrotsearch.randomizedtesting.rules.NoShadowingOrOverridesOnMethodsRule$1.evaluate(NoShadowingOrOverridesOnMethodsRule.java:39)
	at com.carrotsearch.randomizedtesting.rules.StatementAdapter.evaluate(StatementAdapter.java:36)
	at org.apache.lucene.util.TestRuleAssertionsRequired$1.evaluate(TestRuleAssertionsRequired.java:43)
	at org.apache.lucene.util.TestRuleMarkFailure$1.evaluate(TestRuleMarkFailure.java:48)
	at org.apache.lucene.util.TestRuleIgnoreAfterMaxFailures$1.evaluate(TestRuleIgnoreAfterMaxFailures.java:70)
	at org.apache.lucene.util.TestRuleIgnoreTestSuites$1.evaluate(TestRuleIgnoreTestSuites.java:55)
	at com.carrotsearch.randomizedtesting.rules.StatementAdapter.evaluate(StatementAdapter.java:36)
	at com.carrotsearch.randomizedtesting.ThreadLeakControl$StatementRunner.run(ThreadLeakControl.java:358)
	at java.lang.Thread.run(Thread.java:744)
Caused by: org.apache.solr.common.SolrException: Lock obtain timed out: org.apache.lucene.store.MockLockFactoryWrapper$MockLock@13f9e40
	at org.apache.solr.core.SolrCore.<init>(SolrCore.java:842)
	at org.apache.solr.core.SolrCore.<init>(SolrCore.java:628)
	at org.apache.solr.core.CoreContainer.createFromLocal(CoreContainer.java:562)
	at org.apache.solr.core.CoreContainer.create(CoreContainer.java:597)
	at org.apache.solr.core.CoreContainer$1.call(CoreContainer.java:258)
	at org.apache.solr.core.CoreContainer$1.call(CoreContainer.java:250)
	at java.util.concurrent.FutureTask.run(FutureTask.java:262)
	at java.util.concurrent.Executors$RunnableAdapter.call(Executors.java:471)
	at java.util.concurrent.FutureTask.run(FutureTask.java:262)
	at java.util.concurrent.ThreadPoolExecutor.runWorker(ThreadPoolExecutor.java:1145)
	at java.util.concurrent.ThreadPoolExecutor$Worker.run(ThreadPoolExecutor.java:615)
	... 1 more
Caused by: org.apache.lucene.store.LockObtainFailedException: Lock obtain timed out: org.apache.lucene.store.MockLockFactoryWrapper$MockLock@13f9e40
	at org.apache.lucene.store.Lock.obtain(Lock.java:89)
	at org.apache.lucene.index.IndexWriter.<init>(IndexWriter.java:701)
	at org.apache.solr.update.SolrIndexWriter.<init>(SolrIndexWriter.java:77)
	at org.apache.solr.update.SolrIndexWriter.create(SolrIndexWriter.java:64)
	at org.apache.solr.core.SolrCore.initIndex(SolrCore.java:509)
	at org.apache.solr.core.SolrCore.<init>(SolrCore.java:759)
	... 11 more


REGRESSION:  org.apache.solr.core.TestMergePolicyConfig.testDefaultMergePolicyConfig

Error Message:
SolrCore 'collection1' is not available due to init failure: Lock obtain timed out: org.apache.lucene.store.MockLockFactoryWrapper$MockLock@d5c645

Stack Trace:
org.apache.solr.common.SolrException: SolrCore 'collection1' is not available due to init failure: Lock obtain timed out: org.apache.lucene.store.MockLockFactoryWrapper$MockLock@d5c645
	at __randomizedtesting.SeedInfo.seed([75213E37388FEB53:11CB8A1C68276FA4]:0)
	at org.apache.solr.core.CoreContainer.getCore(CoreContainer.java:823)
	at org.apache.solr.util.TestHarness.getCore(TestHarness.java:201)
	at org.apache.solr.core.TestMergePolicyConfig.testDefaultMergePolicyConfig(TestMergePolicyConfig.java:53)
	at sun.reflect.NativeMethodAccessorImpl.invoke0(Native Method)
	at sun.reflect.NativeMethodAccessorImpl.invoke(NativeMethodAccessorImpl.java:57)
	at sun.reflect.DelegatingMethodAccessorImpl.invoke(DelegatingMethodAccessorImpl.java:43)
	at java.lang.reflect.Method.invoke(Method.java:606)
	at com.carrotsearch.randomizedtesting.RandomizedRunner.invoke(RandomizedRunner.java:1559)
	at com.carrotsearch.randomizedtesting.RandomizedRunner.access$600(RandomizedRunner.java:79)
	at com.carrotsearch.randomizedtesting.RandomizedRunner$6.evaluate(RandomizedRunner.java:737)
	at com.carrotsearch.randomizedtesting.RandomizedRunner$7.evaluate(RandomizedRunner.java:773)
	at com.carrotsearch.randomizedtesting.RandomizedRunner$8.evaluate(RandomizedRunner.java:787)
	at com.carrotsearch.randomizedtesting.rules.SystemPropertiesRestoreRule$1.evaluate(SystemPropertiesRestoreRule.java:53)
	at org.apache.lucene.util.TestRuleSetupTeardownChained$1.evaluate(TestRuleSetupTeardownChained.java:50)
	at org.apache.lucene.util.TestRuleFieldCacheSanity$1.evaluate(TestRuleFieldCacheSanity.java:51)
	at org.apache.lucene.util.AbstractBeforeAfterRule$1.evaluate(AbstractBeforeAfterRule.java:46)
	at com.carrotsearch.randomizedtesting.rules.SystemPropertiesInvariantRule$1.evaluate(SystemPropertiesInvariantRule.java:55)
	at org.apache.lucene.util.TestRuleThreadAndTestName$1.evaluate(TestRuleThreadAndTestName.java:49)
	at org.apache.lucene.util.TestRuleIgnoreAfterMaxFailures$1.evaluate(TestRuleIgnoreAfterMaxFailures.java:70)
	at org.apache.lucene.util.TestRuleMarkFailure$1.evaluate(TestRuleMarkFailure.java:48)
	at com.carrotsearch.randomizedtesting.rules.StatementAdapter.evaluate(StatementAdapter.java:36)
	at com.carrotsearch.randomizedtesting.ThreadLeakControl$StatementRunner.run(ThreadLeakControl.java:358)
	at com.carrotsearch.randomizedtesting.ThreadLeakControl.forkTimeoutingTask(ThreadLeakControl.java:782)
	at com.carrotsearch.randomizedtesting.ThreadLeakControl$3.evaluate(ThreadLeakControl.java:442)
	at com.carrotsearch.randomizedtesting.RandomizedRunner.runSingleTest(RandomizedRunner.java:746)
	at com.carrotsearch.randomizedtesting.RandomizedRunner$3.evaluate(RandomizedRunner.java:648)
	at com.carrotsearch.randomizedtesting.RandomizedRunner$4.evaluate(RandomizedRunner.java:682)
	at com.carrotsearch.randomizedtesting.RandomizedRunner$5.evaluate(RandomizedRunner.java:693)
	at com.carrotsearch.randomizedtesting.rules.StatementAdapter.evaluate(StatementAdapter.java:36)
	at com.carrotsearch.randomizedtesting.rules.SystemPropertiesRestoreRule$1.evaluate(SystemPropertiesRestoreRule.java:53)
	at org.apache.lucene.util.AbstractBeforeAfterRule$1.evaluate(AbstractBeforeAfterRule.java:46)
	at org.apache.lucene.util.TestRuleStoreClassName$1.evaluate(TestRuleStoreClassName.java:42)
	at com.carrotsearch.randomizedtesting.rules.SystemPropertiesInvariantRule$1.evaluate(SystemPropertiesInvariantRule.java:55)
	at com.carrotsearch.randomizedtesting.rules.NoShadowingOrOverridesOnMethodsRule$1.evaluate(NoShadowingOrOverridesOnMethodsRule.java:39)
	at com.carrotsearch.randomizedtesting.rules.NoShadowingOrOverridesOnMethodsRule$1.evaluate(NoShadowingOrOverridesOnMethodsRule.java:39)
	at com.carrotsearch.randomizedtesting.rules.StatementAdapter.evaluate(StatementAdapter.java:36)
	at org.apache.lucene.util.TestRuleAssertionsRequired$1.evaluate(TestRuleAssertionsRequired.java:43)
	at org.apache.lucene.util.TestRuleMarkFailure$1.evaluate(TestRuleMarkFailure.java:48)
	at org.apache.lucene.util.TestRuleIgnoreAfterMaxFailures$1.evaluate(TestRuleIgnoreAfterMaxFailures.java:70)
	at org.apache.lucene.util.TestRuleIgnoreTestSuites$1.evaluate(TestRuleIgnoreTestSuites.java:55)
	at com.carrotsearch.randomizedtesting.rules.StatementAdapter.evaluate(StatementAdapter.java:36)
	at com.carrotsearch.randomizedtesting.ThreadLeakControl$StatementRunner.run(ThreadLeakControl.java:358)
	at java.lang.Thread.run(Thread.java:744)
Caused by: org.apache.solr.common.SolrException: Lock obtain timed out: org.apache.lucene.store.MockLockFactoryWrapper$MockLock@d5c645
	at org.apache.solr.core.SolrCore.<init>(SolrCore.java:842)
	at org.apache.solr.core.SolrCore.<init>(SolrCore.java:628)
	at org.apache.solr.core.CoreContainer.createFromLocal(CoreContainer.java:562)
	at org.apache.solr.core.CoreContainer.create(CoreContainer.java:597)
	at org.apache.solr.core.CoreContainer$1.call(CoreContainer.java:258)
	at org.apache.solr.core.CoreContainer$1.call(CoreContainer.java:250)
	at java.util.concurrent.FutureTask.run(FutureTask.java:262)
	at java.util.concurrent.Executors$RunnableAdapter.call(Executors.java:471)
	at java.util.concurrent.FutureTask.run(FutureTask.java:262)
	at java.util.concurrent.ThreadPoolExecutor.runWorker(ThreadPoolExecutor.java:1145)
	at java.util.concurrent.ThreadPoolExecutor$Worker.run(ThreadPoolExecutor.java:615)
	... 1 more
Caused by: org.apache.lucene.store.LockObtainFailedException: Lock obtain timed out: org.apache.lucene.store.MockLockFactoryWrapper$MockLock@d5c645
	at org.apache.lucene.store.Lock.obtain(Lock.java:89)
	at org.apache.lucene.index.IndexWriter.<init>(IndexWriter.java:701)
	at org.apache.solr.update.SolrIndexWriter.<init>(SolrIndexWriter.java:77)
	at org.apache.solr.update.SolrIndexWriter.create(SolrIndexWriter.java:64)
	at org.apache.solr.core.SolrCore.initIndex(SolrCore.java:509)
	at org.apache.solr.core.SolrCore.<init>(SolrCore.java:759)
	... 11 more


REGRESSION:  org.apache.solr.core.TestMergePolicyConfig.testTieredMergePolicyConfig

Error Message:
SolrCore 'collection1' is not available due to init failure: Lock obtain timed out: org.apache.lucene.store.MockLockFactoryWrapper$MockLock@1cd2a20

Stack Trace:
org.apache.solr.common.SolrException: SolrCore 'collection1' is not available due to init failure: Lock obtain timed out: org.apache.lucene.store.MockLockFactoryWrapper$MockLock@1cd2a20
	at __randomizedtesting.SeedInfo.seed([75213E37388FEB53:D7D923B366E21D38]:0)
	at org.apache.solr.core.CoreContainer.getCore(CoreContainer.java:823)
	at org.apache.solr.util.TestHarness.getCore(TestHarness.java:201)
	at org.apache.solr.core.TestMergePolicyConfig.testTieredMergePolicyConfig(TestMergePolicyConfig.java:89)
	at sun.reflect.NativeMethodAccessorImpl.invoke0(Native Method)
	at sun.reflect.NativeMethodAccessorImpl.invoke(NativeMethodAccessorImpl.java:57)
	at sun.reflect.DelegatingMethodAccessorImpl.invoke(DelegatingMethodAccessorImpl.java:43)
	at java.lang.reflect.Method.invoke(Method.java:606)
	at com.carrotsearch.randomizedtesting.RandomizedRunner.invoke(RandomizedRunner.java:1559)
	at com.carrotsearch.randomizedtesting.RandomizedRunner.access$600(RandomizedRunner.java:79)
	at com.carrotsearch.randomizedtesting.RandomizedRunner$6.evaluate(RandomizedRunner.java:737)
	at com.carrotsearch.randomizedtesting.RandomizedRunner$7.evaluate(RandomizedRunner.java:773)
	at com.carrotsearch.randomizedtesting.RandomizedRunner$8.evaluate(RandomizedRunner.java:787)
	at com.carrotsearch.randomizedtesting.rules.SystemPropertiesRestoreRule$1.evaluate(SystemPropertiesRestoreRule.java:53)
	at org.apache.lucene.util.TestRuleSetupTeardownChained$1.evaluate(TestRuleSetupTeardownChained.java:50)
	at org.apache.lucene.util.TestRuleFieldCacheSanity$1.evaluate(TestRuleFieldCacheSanity.java:51)
	at org.apache.lucene.util.AbstractBeforeAfterRule$1.evaluate(AbstractBeforeAfterRule.java:46)
	at com.carrotsearch.randomizedtesting.rules.SystemPropertiesInvariantRule$1.evaluate(SystemPropertiesInvariantRule.java:55)
	at org.apache.lucene.util.TestRuleThreadAndTestName$1.evaluate(TestRuleThreadAndTestName.java:49)
	at org.apache.lucene.util.TestRuleIgnoreAfterMaxFailures$1.evaluate(TestRuleIgnoreAfterMaxFailures.java:70)
	at org.apache.lucene.util.TestRuleMarkFailure$1.evaluate(TestRuleMarkFailure.java:48)
	at com.carrotsearch.randomizedtesting.rules.StatementAdapter.evaluate(StatementAdapter.java:36)
	at com.carrotsearch.randomizedtesting.ThreadLeakControl$StatementRunner.run(ThreadLeakControl.java:358)
	at com.carrotsearch.randomizedtesting.ThreadLeakControl.forkTimeoutingTask(ThreadLeakControl.java:782)
	at com.carrotsearch.randomizedtesting.ThreadLeakControl$3.evaluate(ThreadLeakControl.java:442)
	at com.carrotsearch.randomizedtesting.RandomizedRunner.runSingleTest(RandomizedRunner.java:746)
	at com.carrotsearch.randomizedtesting.RandomizedRunner$3.evaluate(RandomizedRunner.java:648)
	at com.carrotsearch.randomizedtesting.RandomizedRunner$4.evaluate(RandomizedRunner.java:682)
	at com.carrotsearch.randomizedtesting.RandomizedRunner$5.evaluate(RandomizedRunner.java:693)
	at com.carrotsearch.randomizedtesting.rules.StatementAdapter.evaluate(StatementAdapter.java:36)
	at com.carrotsearch.randomizedtesting.rules.SystemPropertiesRestoreRule$1.evaluate(SystemPropertiesRestoreRule.java:53)
	at org.apache.lucene.util.AbstractBeforeAfterRule$1.evaluate(AbstractBeforeAfterRule.java:46)
	at org.apache.lucene.util.TestRuleStoreClassName$1.evaluate(TestRuleStoreClassName.java:42)
	at com.carrotsearch.randomizedtesting.rules.SystemPropertiesInvariantRule$1.evaluate(SystemPropertiesInvariantRule.java:55)
	at com.carrotsearch.randomizedtesting.rules.NoShadowingOrOverridesOnMethodsRule$1.evaluate(NoShadowingOrOverridesOnMethodsRule.java:39)
	at com.carrotsearch.randomizedtesting.rules.NoShadowingOrOverridesOnMethodsRule$1.evaluate(NoShadowingOrOverridesOnMethodsRule.java:39)
	at com.carrotsearch.randomizedtesting.rules.StatementAdapter.evaluate(StatementAdapter.java:36)
	at org.apache.lucene.util.TestRuleAssertionsRequired$1.evaluate(TestRuleAssertionsRequired.java:43)
	at org.apache.lucene.util.TestRuleMarkFailure$1.evaluate(TestRuleMarkFailure.java:48)
	at org.apache.lucene.util.TestRuleIgnoreAfterMaxFailures$1.evaluate(TestRuleIgnoreAfterMaxFailures.java:70)
	at org.apache.lucene.util.TestRuleIgnoreTestSuites$1.evaluate(TestRuleIgnoreTestSuites.java:55)
	at com.carrotsearch.randomizedtesting.rules.StatementAdapter.evaluate(StatementAdapter.java:36)
	at com.carrotsearch.randomizedtesting.ThreadLeakControl$StatementRunner.run(ThreadLeakControl.java:358)
	at java.lang.Thread.run(Thread.java:744)
Caused by: org.apache.solr.common.SolrException: Lock obtain timed out: org.apache.lucene.store.MockLockFactoryWrapper$MockLock@1cd2a20
	at org.apache.solr.core.SolrCore.<init>(SolrCore.java:842)
	at org.apache.solr.core.SolrCore.<init>(SolrCore.java:628)
	at org.apache.solr.core.CoreContainer.createFromLocal(CoreContainer.java:562)
	at org.apache.solr.core.CoreContainer.create(CoreContainer.java:597)
	at org.apache.solr.core.CoreContainer$1.call(CoreContainer.java:258)
	at org.apache.solr.core.CoreContainer$1.call(CoreContainer.java:250)
	at java.util.concurrent.FutureTask.run(FutureTask.java:262)
	at java.util.concurrent.Executors$RunnableAdapter.call(Executors.java:471)
	at java.util.concurrent.FutureTask.run(FutureTask.java:262)
	at java.util.concurrent.ThreadPoolExecutor.runWorker(ThreadPoolExecutor.java:1145)
	at java.util.concurrent.ThreadPoolExecutor$Worker.run(ThreadPoolExecutor.java:615)
	... 1 more
Caused by: org.apache.lucene.store.LockObtainFailedException: Lock obtain timed out: org.apache.lucene.store.MockLockFactoryWrapper$MockLock@1cd2a20
	at org.apache.lucene.store.Lock.obtain(Lock.java:89)
	at org.apache.lucene.index.IndexWriter.<init>(IndexWriter.java:701)
	at org.apache.solr.update.SolrIndexWriter.<init>(SolrIndexWriter.java:77)
	at org.apache.solr.update.SolrIndexWriter.create(SolrIndexWriter.java:64)
	at org.apache.solr.core.SolrCore.initIndex(SolrCore.java:509)
	at org.apache.solr.core.SolrCore.<init>(SolrCore.java:759)
	... 11 more


FAILED:  org.apache.solr.handler.admin.ShowFileRequestHandlerTest.test404ViaHttp

Error Message:
expected:<404> but was:<500>

Stack Trace:
java.lang.AssertionError: expected:<404> but was:<500>
	at __randomizedtesting.SeedInfo.seed([75213E37388FEB53:A982882A16A3FF8F]:0)
	at org.junit.Assert.fail(Assert.java:93)
	at org.junit.Assert.failNotEquals(Assert.java:647)
	at org.junit.Assert.assertEquals(Assert.java:128)
	at org.junit.Assert.assertEquals(Assert.java:472)
	at org.junit.Assert.assertEquals(Assert.java:456)
	at org.apache.solr.handler.admin.ShowFileRequestHandlerTest.test404ViaHttp(ShowFileRequestHandlerTest.java:58)
	at sun.reflect.NativeMethodAccessorImpl.invoke0(Native Method)
	at sun.reflect.NativeMethodAccessorImpl.invoke(NativeMethodAccessorImpl.java:57)
	at sun.reflect.DelegatingMethodAccessorImpl.invoke(DelegatingMethodAccessorImpl.java:43)
	at java.lang.reflect.Method.invoke(Method.java:606)
	at com.carrotsearch.randomizedtesting.RandomizedRunner.invoke(RandomizedRunner.java:1559)
	at com.carrotsearch.randomizedtesting.RandomizedRunner.access$600(RandomizedRunner.java:79)
	at com.carrotsearch.randomizedtesting.RandomizedRunner$6.evaluate(RandomizedRunner.java:737)
	at com.carrotsearch.randomizedtesting.RandomizedRunner$7.evaluate(RandomizedRunner.java:773)
	at com.carrotsearch.randomizedtesting.RandomizedRunner$8.evaluate(RandomizedRunner.java:787)
	at com.carrotsearch.randomizedtesting.rules.SystemPropertiesRestoreRule$1.evaluate(SystemPropertiesRestoreRule.java:53)
	at org.apache.lucene.util.TestRuleSetupTeardownChained$1.evaluate(TestRuleSetupTeardownChained.java:50)
	at org.apache.lucene.util.TestRuleFieldCacheSanity$1.evaluate(TestRuleFieldCacheSanity.java:51)
	at org.apache.lucene.util.AbstractBeforeAfterRule$1.evaluate(AbstractBeforeAfterRule.java:46)
	at com.carrotsearch.randomizedtesting.rules.SystemPropertiesInvariantRule$1.evaluate(SystemPropertiesInvariantRule.java:55)
	at org.apache.lucene.util.TestRuleThreadAndTestName$1.evaluate(TestRuleThreadAndTestName.java:49)
	at org.apache.lucene.util.TestRuleIgnoreAfterMaxFailures$1.evaluate(TestRuleIgnoreAfterMaxFailures.java:70)
	at org.apache.lucene.util.TestRuleMarkFailure$1.evaluate(TestRuleMarkFailure.java:48)
	at com.carrotsearch.randomizedtesting.rules.StatementAdapter.evaluate(StatementAdapter.java:36)
	at com.carrotsearch.randomizedtesting.ThreadLeakControl$StatementRunner.run(ThreadLeakControl.java:358)
	at com.carrotsearch.randomizedtesting.ThreadLeakControl.forkTimeoutingTask(ThreadLeakControl.java:782)
	at com.carrotsearch.randomizedtesting.ThreadLeakControl$3.evaluate(ThreadLeakControl.java:442)
	at com.carrotsearch.randomizedtesting.RandomizedRunner.runSingleTest(RandomizedRunner.java:746)
	at com.carrotsearch.randomizedtesting.RandomizedRunner$3.evaluate(RandomizedRunner.java:648)
	at com.carrotsearch.randomizedtesting.RandomizedRunner$4.evaluate(RandomizedRunner.java:682)
	at com.carrotsearch.randomizedtesting.RandomizedRunner$5.evaluate(RandomizedRunner.java:693)
	at com.carrotsearch.randomizedtesting.rules.StatementAdapter.evaluate(StatementAdapter.java:36)
	at com.carrotsearch.randomizedtesting.rules.SystemPropertiesRestoreRule$1.evaluate(SystemPropertiesRestoreRule.java:53)
	at org.apache.lucene.util.AbstractBeforeAfterRule$1.evaluate(AbstractBeforeAfterRule.java:46)
	at org.apache.lucene.util.TestRuleStoreClassName$1.evaluate(TestRuleStoreClassName.java:42)
	at com.carrotsearch.randomizedtesting.rules.SystemPropertiesInvariantRule$1.evaluate(SystemPropertiesInvariantRule.java:55)
	at com.carrotsearch.randomizedtesting.rules.NoShadowingOrOverridesOnMethodsRule$1.evaluate(NoShadowingOrOverridesOnMethodsRule.java:39)
	at com.carrotsearch.randomizedtesting.rules.NoShadowingOrOverridesOnMethodsRule$1.evaluate(NoShadowingOrOverridesOnMethodsRule.java:39)
	at com.carrotsearch.randomizedtesting.rules.StatementAdapter.evaluate(StatementAdapter.java:36)
	at org.apache.lucene.util.TestRuleAssertionsRequired$1.evaluate(TestRuleAssertionsRequired.java:43)
	at org.apache.lucene.util.TestRuleMarkFailure$1.evaluate(TestRuleMarkFailure.java:48)
	at org.apache.lucene.util.TestRuleIgnoreAfterMaxFailures$1.evaluate(TestRuleIgnoreAfterMaxFailures.java:70)
	at org.apache.lucene.util.TestRuleIgnoreTestSuites$1.evaluate(TestRuleIgnoreTestSuites.java:55)
	at com.carrotsearch.randomizedtesting.rules.StatementAdapter.evaluate(StatementAdapter.java:36)
	at com.carrotsearch.randomizedtesting.ThreadLeakControl$StatementRunner.run(ThreadLeakControl.java:358)
	at java.lang.Thread.run(Thread.java:744)


FAILED:  org.apache.solr.handler.admin.ShowFileRequestHandlerTest.testDirList

Error Message:
Expected mime type application/octet-stream but got text/html. <html> <head> <meta http-equiv="Content-Type" content="text/html;charset=ISO-8859-1"/> <title>Error 500 {msg=SolrCore 'collection1' is not available due to init failure: Lock obtain timed out: org.apache.lucene.store.MockLockFactoryWrapper$MockLock@1a11e74,trace=org.apache.solr.common.SolrException: SolrCore 'collection1' is not available due to init failure: Lock obtain timed out: org.apache.lucene.store.MockLockFactoryWrapper$MockLock@1a11e74  at org.apache.solr.core.CoreContainer.getCore(CoreContainer.java:823)  at org.apache.solr.servlet.SolrDispatchFilter.doFilter(SolrDispatchFilter.java:295)  at org.apache.solr.servlet.SolrDispatchFilter.doFilter(SolrDispatchFilter.java:203)  at org.eclipse.jetty.servlet.ServletHandler$CachedChain.doFilter(ServletHandler.java:1419)  at org.apache.solr.client.solrj.embedded.JettySolrRunner$DebugFilter.doFilter(JettySolrRunner.java:136)  at org.eclipse.jetty.servlet.ServletHandler$CachedChain.doFilter(ServletHandler.java:1419)  at org.eclipse.jetty.servlet.ServletHandler.doHandle(ServletHandler.java:455)  at org.eclipse.jetty.server.session.SessionHandler.doHandle(SessionHandler.java:229)  at org.eclipse.jetty.server.handler.ScopedHandler.handle(ScopedHandler.java:137)  at org.eclipse.jetty.server.handler.GzipHandler.handle(GzipHandler.java:301)  at org.eclipse.jetty.server.handler.ContextHandler.doHandle(ContextHandler.java:1077)  at org.eclipse.jetty.servlet.ServletHandler.doScope(ServletHandler.java:384)  at org.eclipse.jetty.server.session.SessionHandler.doScope(SessionHandler.java:193)  at org.eclipse.jetty.server.handler.ContextHandler.doScope(ContextHandler.java:1009)  at org.eclipse.jetty.server.handler.ScopedHandler.handle(ScopedHandler.java:135)  at org.eclipse.jetty.server.handler.HandlerWrapper.handle(HandlerWrapper.java:116)  at org.eclipse.jetty.server.Server.handle(Server.java:368)  at org.eclipse.jetty.server.AbstractHttpConnection.handleRequest(AbstractHttpConnection.java:489)  at org.eclipse.jetty.server.AbstractHttpConnection.headerComplete(AbstractHttpConnection.java:942)  at org.eclipse.jetty.server.AbstractHttpConnection$RequestHandler.headerComplete(AbstractHttpConnection.java:1004)  at org.eclipse.jetty.http.HttpParser.parseNext(HttpParser.java:640)  at org.eclipse.jetty.http.HttpParser.parseAvailable(HttpParser.java:235)  at org.eclipse.jetty.server.AsyncHttpConnection.handle(AsyncHttpConnection.java:82)  at org.eclipse.jetty.io.nio.SelectChannelEndPoint.handle(SelectChannelEndPoint.java:628)  at org.eclipse.jetty.io.nio.SelectChannelEndPoint$1.run(SelectChannelEndPoint.java:52)  at org.eclipse.jetty.util.thread.QueuedThreadPool.runJob(QueuedThreadPool.java:608)  at org.eclipse.jetty.util.thread.QueuedThreadPool$3.run(QueuedThreadPool.java:543)  at java.lang.Thread.run(Thread.java:744) Caused by: org.apache.solr.common.SolrException: Lock obtain timed out: org.apache.lucene.store.MockLockFactoryWrapper$MockLock@1a11e74  at org.apache.solr.core.SolrCore.&lt;init&gt;(SolrCore.java:842)  at org.apache.solr.core.SolrCore.&lt;init&gt;(SolrCore.java:628)  at org.apache.solr.core.CoreContainer.createFromLocal(CoreContainer.java:562)  at org.apache.solr.core.CoreContainer.create(CoreContainer.java:597)  at org.apache.solr.core.CoreContainer$1.call(CoreContainer.java:258)  at org.apache.solr.core.CoreContainer$1.call(CoreContainer.java:250)  at java.util.concurrent.FutureTask.run(FutureTask.java:262)  at java.util.concurrent.Executors$RunnableAdapter.call(Executors.java:471)  at java.util.concurrent.FutureTask.run(FutureTask.java:262)  at java.util.concurrent.ThreadPoolExecutor.runWorker(ThreadPoolExecutor.java:1145)  at java.util.concurrent.ThreadPoolExecutor$Worker.run(ThreadPoolExecutor.java:615)  ... 1 more Caused by: org.apache.lucene.store.LockObtainFailedException: Lock obtain timed out: org.apache.lucene.store.MockLockFactoryWrapper$MockLock@1a11e74  at org.apache.lucene.store.Lock.obtain(Lock.java:89)  at org.apache.lucene.index.IndexWriter.&lt;init&gt;(IndexWriter.java:701)  at org.apache.solr.update.SolrIndexWriter.&lt;init&gt;(SolrIndexWriter.java:77)  at org.apache.solr.update.SolrIndexWriter.create(SolrIndexWriter.java:64)  at org.apache.solr.core.SolrCore.initIndex(SolrCore.java:509)  at org.apache.solr.core.SolrCore.&lt;init&gt;(SolrCore.java:759)  ... 11 more ,code=500}</title> </head> <body> <h2>HTTP ERROR: 500</h2> <p>Problem accessing /solr/collection1/admin/file. Reason: <pre>    {msg=SolrCore 'collection1' is not available due to init failure: Lock obtain timed out: org.apache.lucene.store.MockLockFactoryWrapper$MockLock@1a11e74,trace=org.apache.solr.common.SolrException: SolrCore 'collection1' is not available due to init failure: Lock obtain timed out: org.apache.lucene.store.MockLockFactoryWrapper$MockLock@1a11e74  at org.apache.solr.core.CoreContainer.getCore(CoreContainer.java:823)  at org.apache.solr.servlet.SolrDispatchFilter.doFilter(SolrDispatchFilter.java:295)  at org.apache.solr.servlet.SolrDispatchFilter.doFilter(SolrDispatchFilter.java:203)  at org.eclipse.jetty.servlet.ServletHandler$CachedChain.doFilter(ServletHandler.java:1419)  at org.apache.solr.client.solrj.embedded.JettySolrRunner$DebugFilter.doFilter(JettySolrRunner.java:136)  at org.eclipse.jetty.servlet.ServletHandler$CachedChain.doFilter(ServletHandler.java:1419)  at org.eclipse.jetty.servlet.ServletHandler.doHandle(ServletHandler.java:455)  at org.eclipse.jetty.server.session.SessionHandler.doHandle(SessionHandler.java:229)  at org.eclipse.jetty.server.handler.ScopedHandler.handle(ScopedHandler.java:137)  at org.eclipse.jetty.server.handler.GzipHandler.handle(GzipHandler.java:301)  at org.eclipse.jetty.server.handler.ContextHandler.doHandle(ContextHandler.java:1077)  at org.eclipse.jetty.servlet.ServletHandler.doScope(ServletHandler.java:384)  at org.eclipse.jetty.server.session.SessionHandler.doScope(SessionHandler.java:193)  at org.eclipse.jetty.server.handler.ContextHandler.doScope(ContextHandler.java:1009)  at org.eclipse.jetty.server.handler.ScopedHandler.handle(ScopedHandler.java:135)  at org.eclipse.jetty.server.handler.HandlerWrapper.handle(HandlerWrapper.java:116)  at org.eclipse.jetty.server.Server.handle(Server.java:368)  at org.eclipse.jetty.server.AbstractHttpConnection.handleRequest(AbstractHttpConnection.java:489)  at org.eclipse.jetty.server.AbstractHttpConnection.headerComplete(AbstractHttpConnection.java:942)  at org.eclipse.jetty.server.AbstractHttpConnection$RequestHandler.headerComplete(AbstractHttpConnection.java:1004)  at org.eclipse.jetty.http.HttpParser.parseNext(HttpParser.java:640)  at org.eclipse.jetty.http.HttpParser.parseAvailable(HttpParser.java:235)  at org.eclipse.jetty.server.AsyncHttpConnection.handle(AsyncHttpConnection.java:82)  at org.eclipse.jetty.io.nio.SelectChannelEndPoint.handle(SelectChannelEndPoint.java:628)  at org.eclipse.jetty.io.nio.SelectChannelEndPoint$1.run(SelectChannelEndPoint.java:52)  at org.eclipse.jetty.util.thread.QueuedThreadPool.runJob(QueuedThreadPool.java:608)  at org.eclipse.jetty.util.thread.QueuedThreadPool$3.run(QueuedThreadPool.java:543)  at java.lang.Thread.run(Thread.java:744) Caused by: org.apache.solr.common.SolrException: Lock obtain timed out: org.apache.lucene.store.MockLockFactoryWrapper$MockLock@1a11e74  at org.apache.solr.core.SolrCore.&lt;init&gt;(SolrCore.java:842)  at org.apache.solr.core.SolrCore.&lt;init&gt;(SolrCore.java:628)  at org.apache.solr.core.CoreContainer.createFromLocal(CoreContainer.java:562)  at org.apache.solr.core.CoreContainer.create(CoreContainer.java:597)  at org.apache.solr.core.CoreContainer$1.call(CoreContainer.java:258)  at org.apache.solr.core.CoreContainer$1.call(CoreContainer.java:250)  at java.util.concurrent.FutureTask.run(FutureTask.java:262)  at java.util.concurrent.Executors$RunnableAdapter.call(Executors.java:471)  at java.util.concurrent.FutureTask.run(FutureTask.java:262)  at java.util.concurrent.ThreadPoolExecutor.runWorker(ThreadPoolExecutor.java:1145)  at java.util.concurrent.ThreadPoolExecutor$Worker.run(ThreadPoolExecutor.java:615)  ... 1 more Caused by: org.apache.lucene.store.LockObtainFailedException: Lock obtain timed out: org.apache.lucene.store.MockLockFactoryWrapper$MockLock@1a11e74  at org.apache.lucene.store.Lock.obtain(Lock.java:89)  at org.apache.lucene.index.IndexWriter.&lt;init&gt;(IndexWriter.java:701)  at org.apache.solr.update.SolrIndexWriter.&lt;init&gt;(SolrIndexWriter.java:77)  at org.apache.solr.update.SolrIndexWriter.create(SolrIndexWriter.java:64)  at org.apache.solr.core.SolrCore.initIndex(SolrCore.java:509)  at org.apache.solr.core.SolrCore.&lt;init&gt;(SolrCore.java:759)  ... 11 more ,code=500}</pre></p> <hr /><i><small>Powered by Jetty://</small></i>                                                                                                                                                                                                                                                                                                                                                                                                                                                                                                                                                                                                                                                                                                                                                                                                                                                                                                                                                                                                                     </body> </html> 

Stack Trace:
org.apache.solr.client.solrj.impl.HttpSolrServer$RemoteSolrException: Expected mime type application/octet-stream but got text/html. <html>
<head>
<meta http-equiv="Content-Type" content="text/html;charset=ISO-8859-1"/>
<title>Error 500 {msg=SolrCore 'collection1' is not available due to init failure: Lock obtain timed out: org.apache.lucene.store.MockLockFactoryWrapper$MockLock@1a11e74,trace=org.apache.solr.common.SolrException: SolrCore 'collection1' is not available due to init failure: Lock obtain timed out: org.apache.lucene.store.MockLockFactoryWrapper$MockLock@1a11e74
	at org.apache.solr.core.CoreContainer.getCore(CoreContainer.java:823)
	at org.apache.solr.servlet.SolrDispatchFilter.doFilter(SolrDispatchFilter.java:295)
	at org.apache.solr.servlet.SolrDispatchFilter.doFilter(SolrDispatchFilter.java:203)
	at org.eclipse.jetty.servlet.ServletHandler$CachedChain.doFilter(ServletHandler.java:1419)
	at org.apache.solr.client.solrj.embedded.JettySolrRunner$DebugFilter.doFilter(JettySolrRunner.java:136)
	at org.eclipse.jetty.servlet.ServletHandler$CachedChain.doFilter(ServletHandler.java:1419)
	at org.eclipse.jetty.servlet.ServletHandler.doHandle(ServletHandler.java:455)
	at org.eclipse.jetty.server.session.SessionHandler.doHandle(SessionHandler.java:229)
	at org.eclipse.jetty.server.handler.ScopedHandler.handle(ScopedHandler.java:137)
	at org.eclipse.jetty.server.handler.GzipHandler.handle(GzipHandler.java:301)
	at org.eclipse.jetty.server.handler.ContextHandler.doHandle(ContextHandler.java:1077)
	at org.eclipse.jetty.servlet.ServletHandler.doScope(ServletHandler.java:384)
	at org.eclipse.jetty.server.session.SessionHandler.doScope(SessionHandler.java:193)
	at org.eclipse.jetty.server.handler.ContextHandler.doScope(ContextHandler.java:1009)
	at org.eclipse.jetty.server.handler.ScopedHandler.handle(ScopedHandler.java:135)
	at org.eclipse.jetty.server.handler.HandlerWrapper.handle(HandlerWrapper.java:116)
	at org.eclipse.jetty.server.Server.handle(Server.java:368)
	at org.eclipse.jetty.server.AbstractHttpConnection.handleRequest(AbstractHttpConnection.java:489)
	at org.eclipse.jetty.server.AbstractHttpConnection.headerComplete(AbstractHttpConnection.java:942)
	at org.eclipse.jetty.server.AbstractHttpConnection$RequestHandler.headerComplete(AbstractHttpConnection.java:1004)
	at org.eclipse.jetty.http.HttpParser.parseNext(HttpParser.java:640)
	at org.eclipse.jetty.http.HttpParser.parseAvailable(HttpParser.java:235)
	at org.eclipse.jetty.server.AsyncHttpConnection.handle(AsyncHttpConnection.java:82)
	at org.eclipse.jetty.io.nio.SelectChannelEndPoint.handle(SelectChannelEndPoint.java:628)
	at org.eclipse.jetty.io.nio.SelectChannelEndPoint$1.run(SelectChannelEndPoint.java:52)
	at org.eclipse.jetty.util.thread.QueuedThreadPool.runJob(QueuedThreadPool.java:608)
	at org.eclipse.jetty.util.thread.QueuedThreadPool$3.run(QueuedThreadPool.java:543)
	at java.lang.Thread.run(Thread.java:744)
Caused by: org.apache.solr.common.SolrException: Lock obtain timed out: org.apache.lucene.store.MockLockFactoryWrapper$MockLock@1a11e74
	at org.apache.solr.core.SolrCore.&lt;init&gt;(SolrCore.java:842)
	at org.apache.solr.core.SolrCore.&lt;init&gt;(SolrCore.java:628)
	at org.apache.solr.core.CoreContainer.createFromLocal(CoreContainer.java:562)
	at org.apache.solr.core.CoreContainer.create(CoreContainer.java:597)
	at org.apache.solr.core.CoreContainer$1.call(CoreContainer.java:258)
	at org.apache.solr.core.CoreContainer$1.call(CoreContainer.java:250)
	at java.util.concurrent.FutureTask.run(FutureTask.java:262)
	at java.util.concurrent.Executors$RunnableAdapter.call(Executors.java:471)
	at java.util.concurrent.FutureTask.run(FutureTask.java:262)
	at java.util.concurrent.ThreadPoolExecutor.runWorker(ThreadPoolExecutor.java:1145)
	at java.util.concurrent.ThreadPoolExecutor$Worker.run(ThreadPoolExecutor.java:615)
	... 1 more
Caused by: org.apache.lucene.store.LockObtainFailedException: Lock obtain timed out: org.apache.lucene.store.MockLockFactoryWrapper$MockLock@1a11e74
	at org.apache.lucene.store.Lock.obtain(Lock.java:89)
	at org.apache.lucene.index.IndexWriter.&lt;init&gt;(IndexWriter.java:701)
	at org.apache.solr.update.SolrIndexWriter.&lt;init&gt;(SolrIndexWriter.java:77)
	at org.apache.solr.update.SolrIndexWriter.create(SolrIndexWriter.java:64)
	at org.apache.solr.core.SolrCore.initIndex(SolrCore.java:509)
	at org.apache.solr.core.SolrCore.&lt;init&gt;(SolrCore.java:759)
	... 11 more
,code=500}</title>
</head>
<body>
<h2>HTTP ERROR: 500</h2>
<p>Problem accessing /solr/collection1/admin/file. Reason:
<pre>    {msg=SolrCore 'collection1' is not available due to init failure: Lock obtain timed out: org.apache.lucene.store.MockLockFactoryWrapper$MockLock@1a11e74,trace=org.apache.solr.common.SolrException: SolrCore 'collection1' is not available due to init failure: Lock obtain timed out: org.apache.lucene.store.MockLockFactoryWrapper$MockLock@1a11e74
	at org.apache.solr.core.CoreContainer.getCore(CoreContainer.java:823)
	at org.apache.solr.servlet.SolrDispatchFilter.doFilter(SolrDispatchFilter.java:295)
	at org.apache.solr.servlet.SolrDispatchFilter.doFilter(SolrDispatchFilter.java:203)
	at org.eclipse.jetty.servlet.ServletHandler$CachedChain.doFilter(ServletHandler.java:1419)
	at org.apache.solr.client.solrj.embedded.JettySolrRunner$DebugFilter.doFilter(JettySolrRunner.java:136)
	at org.eclipse.jetty.servlet.ServletHandler$CachedChain.doFilter(ServletHandler.java:1419)
	at org.eclipse.jetty.servlet.ServletHandler.doHandle(ServletHandler.java:455)
	at org.eclipse.jetty.server.session.SessionHandler.doHandle(SessionHandler.java:229)
	at org.eclipse.jetty.server.handler.ScopedHandler.handle(ScopedHandler.java:137)
	at org.eclipse.jetty.server.handler.GzipHandler.handle(GzipHandler.java:301)
	at org.eclipse.jetty.server.handler.ContextHandler.doHandle(ContextHandler.java:1077)
	at org.eclipse.jetty.servlet.ServletHandler.doScope(ServletHandler.java:384)
	at org.eclipse.jetty.server.session.SessionHandler.doScope(SessionHandler.java:193)
	at org.eclipse.jetty.server.handler.ContextHandler.doScope(ContextHandler.java:1009)
	at org.eclipse.jetty.server.handler.ScopedHandler.handle(ScopedHandler.java:135)
	at org.eclipse.jetty.server.handler.HandlerWrapper.handle(HandlerWrapper.java:116)
	at org.eclipse.jetty.server.Server.handle(Server.java:368)
	at org.eclipse.jetty.server.AbstractHttpConnection.handleRequest(AbstractHttpConnection.java:489)
	at org.eclipse.jetty.server.AbstractHttpConnection.headerComplete(AbstractHttpConnection.java:942)
	at org.eclipse.jetty.server.AbstractHttpConnection$RequestHandler.headerComplete(AbstractHttpConnection.java:1004)
	at org.eclipse.jetty.http.HttpParser.parseNext(HttpParser.java:640)
	at org.eclipse.jetty.http.HttpParser.parseAvailable(HttpParser.java:235)
	at org.eclipse.jetty.server.AsyncHttpConnection.handle(AsyncHttpConnection.java:82)
	at org.eclipse.jetty.io.nio.SelectChannelEndPoint.handle(SelectChannelEndPoint.java:628)
	at org.eclipse.jetty.io.nio.SelectChannelEndPoint$1.run(SelectChannelEndPoint.java:52)
	at org.eclipse.jetty.util.thread.QueuedThreadPool.runJob(QueuedThreadPool.java:608)
	at org.eclipse.jetty.util.thread.QueuedThreadPool$3.run(QueuedThreadPool.java:543)
	at java.lang.Thread.run(Thread.java:744)
Caused by: org.apache.solr.common.SolrException: Lock obtain timed out: org.apache.lucene.store.MockLockFactoryWrapper$MockLock@1a11e74
	at org.apache.solr.core.SolrCore.&lt;init&gt;(SolrCore.java:842)
	at org.apache.solr.core.SolrCore.&lt;init&gt;(SolrCore.java:628)
	at org.apache.solr.core.CoreContainer.createFromLocal(CoreContainer.java:562)
	at org.apache.solr.core.CoreContainer.create(CoreContainer.java:597)
	at org.apache.solr.core.CoreContainer$1.call(CoreContainer.java:258)
	at org.apache.solr.core.CoreContainer$1.call(CoreContainer.java:250)
	at java.util.concurrent.FutureTask.run(FutureTask.java:262)
	at java.util.concurrent.Executors$RunnableAdapter.call(Executors.java:471)
	at java.util.concurrent.FutureTask.run(FutureTask.java:262)
	at java.util.concurrent.ThreadPoolExecutor.runWorker(ThreadPoolExecutor.java:1145)
	at java.util.concurrent.ThreadPoolExecutor$Worker.run(ThreadPoolExecutor.java:615)
	... 1 more
Caused by: org.apache.lucene.store.LockObtainFailedException: Lock obtain timed out: org.apache.lucene.store.MockLockFactoryWrapper$MockLock@1a11e74
	at org.apache.lucene.store.Lock.obtain(Lock.java:89)
	at org.apache.lucene.index.IndexWriter.&lt;init&gt;(IndexWriter.java:701)
	at org.apache.solr.update.SolrIndexWriter.&lt;init&gt;(SolrIndexWriter.java:77)
	at org.apache.solr.update.SolrIndexWriter.create(SolrIndexWriter.java:64)
	at org.apache.solr.core.SolrCore.initIndex(SolrCore.java:509)
	at org.apache.solr.core.SolrCore.&lt;init&gt;(SolrCore.java:759)
	... 11 more
,code=500}</pre></p>
<hr /><i><small>Powered by Jetty://</small></i>
                                                
                                                
                                                
                                                
                                                
                                                
                                                
                                                
                                                
                                                
                                                
                                                
                                                
                                                
                                                
                                                
                                                
                                                
                                                
                                                
</body>
</html>

	at __randomizedtesting.SeedInfo.seed([75213E37388FEB53:9C192FC5F0D17169]:0)
	at org.apache.solr.client.solrj.impl.HttpSolrServer.request(HttpSolrServer.java:459)
	at org.apache.solr.client.solrj.impl.HttpSolrServer.request(HttpSolrServer.java:199)
	at org.apache.solr.client.solrj.request.QueryRequest.process(QueryRequest.java:90)
	at org.apache.solr.handler.admin.ShowFileRequestHandlerTest.testDirList(ShowFileRequestHandlerTest.java:89)
	at sun.reflect.NativeMethodAccessorImpl.invoke0(Native Method)
	at sun.reflect.NativeMethodAccessorImpl.invoke(NativeMethodAccessorImpl.java:57)
	at sun.reflect.DelegatingMethodAccessorImpl.invoke(DelegatingMethodAccessorImpl.java:43)
	at java.lang.reflect.Method.invoke(Method.java:606)
	at com.carrotsearch.randomizedtesting.RandomizedRunner.invoke(RandomizedRunner.java:1559)
	at com.carrotsearch.randomizedtesting.RandomizedRunner.access$600(RandomizedRunner.java:79)
	at com.carrotsearch.randomizedtesting.RandomizedRunner$6.evaluate(RandomizedRunner.java:737)
	at com.carrotsearch.randomizedtesting.RandomizedRunner$7.evaluate(RandomizedRunner.java:773)
	at com.carrotsearch.randomizedtesting.RandomizedRunner$8.evaluate(RandomizedRunner.java:787)
	at com.carrotsearch.randomizedtesting.rules.SystemPropertiesRestoreRule$1.evaluate(SystemPropertiesRestoreRule.java:53)
	at org.apache.lucene.util.TestRuleSetupTeardownChained$1.evaluate(TestRuleSetupTeardownChained.java:50)
	at org.apache.lucene.util.TestRuleFieldCacheSanity$1.evaluate(TestRuleFieldCacheSanity.java:51)
	at org.apache.lucene.util.AbstractBeforeAfterRule$1.evaluate(AbstractBeforeAfterRule.java:46)
	at com.carrotsearch.randomizedtesting.rules.SystemPropertiesInvariantRule$1.evaluate(SystemPropertiesInvariantRule.java:55)
	at org.apache.lucene.util.TestRuleThreadAndTestName$1.evaluate(TestRuleThreadAndTestName.java:49)
	at org.apache.lucene.util.TestRuleIgnoreAfterMaxFailures$1.evaluate(TestRuleIgnoreAfterMaxFailures.java:70)
	at org.apache.lucene.util.TestRuleMarkFailure$1.evaluate(TestRuleMarkFailure.java:48)
	at com.carrotsearch.randomizedtesting.rules.StatementAdapter.evaluate(StatementAdapter.java:36)
	at com.carrotsearch.randomizedtesting.ThreadLeakControl$StatementRunner.run(ThreadLeakControl.java:358)
	at com.carrotsearch.randomizedtesting.ThreadLeakControl.forkTimeoutingTask(ThreadLeakControl.java:782)
	at com.carrotsearch.randomizedtesting.ThreadLeakControl$3.evaluate(ThreadLeakControl.java:442)
	at com.carrotsearch.randomizedtesting.RandomizedRunner.runSingleTest(RandomizedRunner.java:746)
	at com.carrotsearch.randomizedtesting.RandomizedRunner$3.evaluate(RandomizedRunner.java:648)
	at com.carrotsearch.randomizedtesting.RandomizedRunner$4.evaluate(RandomizedRunner.java:682)
	at com.carrotsearch.randomizedtesting.RandomizedRunner$5.evaluate(RandomizedRunner.java:693)
	at com.carrotsearch.randomizedtesting.rules.StatementAdapter.evaluate(StatementAdapter.java:36)
	at com.carrotsearch.randomizedtesting.rules.SystemPropertiesRestoreRule$1.evaluate(SystemPropertiesRestoreRule.java:53)
	at org.apache.lucene.util.AbstractBeforeAfterRule$1.evaluate(AbstractBeforeAfterRule.java:46)
	at org.apache.lucene.util.TestRuleStoreClassName$1.evaluate(TestRuleStoreClassName.java:42)
	at com.carrotsearch.randomizedtesting.rules.SystemPropertiesInvariantRule$1.evaluate(SystemPropertiesInvariantRule.java:55)
	at com.carrotsearch.randomizedtesting.rules.NoShadowingOrOverridesOnMethodsRule$1.evaluate(NoShadowingOrOverridesOnMethodsRule.java:39)
	at com.carrotsearch.randomizedtesting.rules.NoShadowingOrOverridesOnMethodsRule$1.evaluate(NoShadowingOrOverridesOnMethodsRule.java:39)
	at com.carrotsearch.randomizedtesting.rules.StatementAdapter.evaluate(StatementAdapter.java:36)
	at org.apache.lucene.util.TestRuleAssertionsRequired$1.evaluate(TestRuleAssertionsRequired.java:43)
	at org.apache.lucene.util.TestRuleMarkFailure$1.evaluate(TestRuleMarkFailure.java:48)
	at org.apache.lucene.util.TestRuleIgnoreAfterMaxFailures$1.evaluate(TestRuleIgnoreAfterMaxFailures.java:70)
	at org.apache.lucene.util.TestRuleIgnoreTestSuites$1.evaluate(TestRuleIgnoreTestSuites.java:55)
	at com.carrotsearch.randomizedtesting.rules.StatementAdapter.evaluate(StatementAdapter.java:36)
	at com.carrotsearch.randomizedtesting.ThreadLeakControl$StatementRunner.run(ThreadLeakControl.java:358)
	at java.lang.Thread.run(Thread.java:744)


FAILED:  org.apache.solr.handler.admin.ShowFileRequestHandlerTest.testGetRawFile

Error Message:
{msg=SolrCore 'collection1' is not available due to init failure: Lock obtain timed out: org.apache.lucene.store.MockLockFactoryWrapper$MockLock@1a11e74,trace=org.apache.solr.common.SolrException: SolrCore 'collection1' is not available due to init failure: Lock obtain timed out: org.apache.lucene.store.MockLockFactoryWrapper$MockLock@1a11e74  at org.apache.solr.core.CoreContainer.getCore(CoreContainer.java:823)  at org.apache.solr.servlet.SolrDispatchFilter.doFilter(SolrDispatchFilter.java:295)  at org.apache.solr.servlet.SolrDispatchFilter.doFilter(SolrDispatchFilter.java:203)  at org.eclipse.jetty.servlet.ServletHandler$CachedChain.doFilter(ServletHandler.java:1419)  at org.apache.solr.client.solrj.embedded.JettySolrRunner$DebugFilter.doFilter(JettySolrRunner.java:136)  at org.eclipse.jetty.servlet.ServletHandler$CachedChain.doFilter(ServletHandler.java:1419)  at org.eclipse.jetty.servlet.ServletHandler.doHandle(ServletHandler.java:455)  at org.eclipse.jetty.server.session.SessionHandler.doHandle(SessionHa  request: http://127.0.0.1:53416/solr/collection1/admin/file?file=schema.xml&wt=mock&version=2.2

Stack Trace:
org.apache.solr.client.solrj.impl.HttpSolrServer$RemoteSolrException: {msg=SolrCore 'collection1' is not available due to init failure: Lock obtain timed out: org.apache.lucene.store.MockLockFactoryWrapper$MockLock@1a11e74,trace=org.apache.solr.common.SolrException: SolrCore 'collection1' is not available due to init failure: Lock obtain timed out: org.apache.lucene.store.MockLockFactoryWrapper$MockLock@1a11e74 	at org.apache.solr.core.CoreContainer.getCore(CoreContainer.java:823) 	at org.apache.solr.servlet.SolrDispatchFilter.doFilter(SolrDispatchFilter.java:295) 	at org.apache.solr.servlet.SolrDispatchFilter.doFilter(SolrDispatchFilter.java:203) 	at org.eclipse.jetty.servlet.ServletHandler$CachedChain.doFilter(ServletHandler.java:1419) 	at org.apache.solr.client.solrj.embedded.JettySolrRunner$DebugFilter.doFilter(JettySolrRunner.java:136) 	at org.eclipse.jetty.servlet.ServletHandler$CachedChain.doFilter(ServletHandler.java:1419) 	at org.eclipse.jetty.servlet.ServletHandler.doHandle(ServletHandler.java:455) 	at org.eclipse.jetty.server.session.SessionHandler.doHandle(SessionHa

request: http://127.0.0.1:53416/solr/collection1/admin/file?file=schema.xml&wt=mock&version=2.2
	at __randomizedtesting.SeedInfo.seed([75213E37388FEB53:AB2C96DDF2528F6A]:0)
	at org.apache.solr.client.solrj.impl.HttpSolrServer.request(HttpSolrServer.java:495)
	at org.apache.solr.client.solrj.impl.HttpSolrServer.request(HttpSolrServer.java:199)
	at org.apache.solr.handler.admin.ShowFileRequestHandlerTest.testGetRawFile(ShowFileRequestHandlerTest.java:123)
	at sun.reflect.NativeMethodAccessorImpl.invoke0(Native Method)
	at sun.reflect.NativeMethodAccessorImpl.invoke(NativeMethodAccessorImpl.java:57)
	at sun.reflect.DelegatingMethodAccessorImpl.invoke(DelegatingMethodAccessorImpl.java:43)
	at java.lang.reflect.Method.invoke(Method.java:606)
	at com.carrotsearch.randomizedtesting.RandomizedRunner.invoke(RandomizedRunner.java:1559)
	at com.carrotsearch.randomizedtesting.RandomizedRunner.access$600(RandomizedRunner.java:79)
	at com.carrotsearch.randomizedtesting.RandomizedRunner$6.evaluate(RandomizedRunner.java:737)
	at com.carrotsearch.randomizedtesting.RandomizedRunner$7.evaluate(RandomizedRunner.java:773)
	at com.carrotsearch.randomizedtesting.RandomizedRunner$8.evaluate(RandomizedRunner.java:787)
	at com.carrotsearch.randomizedtesting.rules.SystemPropertiesRestoreRule$1.evaluate(SystemPropertiesRestoreRule.java:53)
	at org.apache.lucene.util.TestRuleSetupTeardownChained$1.evaluate(TestRuleSetupTeardownChained.java:50)
	at org.apache.lucene.util.TestRuleFieldCacheSanity$1.evaluate(TestRuleFieldCacheSanity.java:51)
	at org.apache.lucene.util.AbstractBeforeAfterRule$1.evaluate(AbstractBeforeAfterRule.java:46)
	at com.carrotsearch.randomizedtesting.rules.SystemPropertiesInvariantRule$1.evaluate(SystemPropertiesInvariantRule.java:55)
	at org.apache.lucene.util.TestRuleThreadAndTestName$1.evaluate(TestRuleThreadAndTestName.java:49)
	at org.apache.lucene.util.TestRuleIgnoreAfterMaxFailures$1.evaluate(TestRuleIgnoreAfterMaxFailures.java:70)
	at org.apache.lucene.util.TestRuleMarkFailure$1.evaluate(TestRuleMarkFailure.java:48)
	at com.carrotsearch.randomizedtesting.rules.StatementAdapter.evaluate(StatementAdapter.java:36)
	at com.carrotsearch.randomizedtesting.ThreadLeakControl$StatementRunner.run(ThreadLeakControl.java:358)
	at com.carrotsearch.randomizedtesting.ThreadLeakControl.forkTimeoutingTask(ThreadLeakControl.java:782)
	at com.carrotsearch.randomizedtesting.ThreadLeakControl$3.evaluate(ThreadLeakControl.java:442)
	at com.carrotsearch.randomizedtesting.RandomizedRunner.runSingleTest(RandomizedRunner.java:746)
	at com.carrotsearch.randomizedtesting.RandomizedRunner$3.evaluate(RandomizedRunner.java:648)
	at com.carrotsearch.randomizedtesting.RandomizedRunner$4.evaluate(RandomizedRunner.java:682)
	at com.carrotsearch.randomizedtesting.RandomizedRunner$5.evaluate(RandomizedRunner.java:693)
	at com.carrotsearch.randomizedtesting.rules.StatementAdapter.evaluate(StatementAdapter.java:36)
	at com.carrotsearch.randomizedtesting.rules.SystemPropertiesRestoreRule$1.evaluate(SystemPropertiesRestoreRule.java:53)
	at org.apache.lucene.util.AbstractBeforeAfterRule$1.evaluate(AbstractBeforeAfterRule.java:46)
	at org.apache.lucene.util.TestRuleStoreClassName$1.evaluate(TestRuleStoreClassName.java:42)
	at com.carrotsearch.randomizedtesting.rules.SystemPropertiesInvariantRule$1.evaluate(SystemPropertiesInvariantRule.java:55)
	at com.carrotsearch.randomizedtesting.rules.NoShadowingOrOverridesOnMethodsRule$1.evaluate(NoShadowingOrOverridesOnMethodsRule.java:39)
	at com.carrotsearch.randomizedtesting.rules.NoShadowingOrOverridesOnMethodsRule$1.evaluate(NoShadowingOrOverridesOnMethodsRule.java:39)
	at com.carrotsearch.randomizedtesting.rules.StatementAdapter.evaluate(StatementAdapter.java:36)
	at org.apache.lucene.util.TestRuleAssertionsRequired$1.evaluate(TestRuleAssertionsRequired.java:43)
	at org.apache.lucene.util.TestRuleMarkFailure$1.evaluate(TestRuleMarkFailure.java:48)
	at org.apache.lucene.util.TestRuleIgnoreAfterMaxFailures$1.evaluate(TestRuleIgnoreAfterMaxFailures.java:70)
	at org.apache.lucene.util.TestRuleIgnoreTestSuites$1.evaluate(TestRuleIgnoreTestSuites.java:55)
	at com.carrotsearch.randomizedtesting.rules.StatementAdapter.evaluate(StatementAdapter.java:36)
	at com.carrotsearch.randomizedtesting.ThreadLeakControl$StatementRunner.run(ThreadLeakControl.java:358)
	at java.lang.Thread.run(Thread.java:744)


FAILED:  org.apache.solr.update.processor.AddSchemaFieldsUpdateProcessorFactoryTest.testSingleField

Error Message:
SolrCore 'collection1' is not available due to init failure: Lock obtain timed out: org.apache.lucene.store.MockLockFactoryWrapper$MockLock@e3afd5

Stack Trace:
org.apache.solr.common.SolrException: SolrCore 'collection1' is not available due to init failure: Lock obtain timed out: org.apache.lucene.store.MockLockFactoryWrapper$MockLock@e3afd5
	at __randomizedtesting.SeedInfo.seed([75213E37388FEB53:65C5882F58F01171]:0)
	at org.apache.solr.core.CoreContainer.getCore(CoreContainer.java:823)
	at org.apache.solr.util.TestHarness.getCore(TestHarness.java:201)
	at org.apache.solr.update.processor.AddSchemaFieldsUpdateProcessorFactoryTest.testSingleField(AddSchemaFieldsUpdateProcessorFactoryTest.java:71)
	at sun.reflect.NativeMethodAccessorImpl.invoke0(Native Method)
	at sun.reflect.NativeMethodAccessorImpl.invoke(NativeMethodAccessorImpl.java:57)
	at sun.reflect.DelegatingMethodAccessorImpl.invoke(DelegatingMethodAccessorImpl.java:43)
	at java.lang.reflect.Method.invoke(Method.java:606)
	at com.carrotsearch.randomizedtesting.RandomizedRunner.invoke(RandomizedRunner.java:1559)
	at com.carrotsearch.randomizedtesting.RandomizedRunner.access$600(RandomizedRunner.java:79)
	at com.carrotsearch.randomizedtesting.RandomizedRunner$6.evaluate(RandomizedRunner.java:737)
	at com.carrotsearch.randomizedtesting.RandomizedRunner$7.evaluate(RandomizedRunner.java:773)
	at com.carrotsearch.randomizedtesting.RandomizedRunner$8.evaluate(RandomizedRunner.java:787)
	at com.carrotsearch.randomizedtesting.rules.SystemPropertiesRestoreRule$1.evaluate(SystemPropertiesRestoreRule.java:53)
	at org.apache.lucene.util.TestRuleSetupTeardownChained$1.evaluate(TestRuleSetupTeardownChained.java:50)
	at org.apache.lucene.util.TestRuleFieldCacheSanity$1.evaluate(TestRuleFieldCacheSanity.java:51)
	at org.apache.lucene.util.AbstractBeforeAfterRule$1.evaluate(AbstractBeforeAfterRule.java:46)
	at com.carrotsearch.randomizedtesting.rules.SystemPropertiesInvariantRule$1.evaluate(SystemPropertiesInvariantRule.java:55)
	at org.apache.lucene.util.TestRuleThreadAndTestName$1.evaluate(TestRuleThreadAndTestName.java:49)
	at org.apache.lucene.util.TestRuleIgnoreAfterMaxFailures$1.evaluate(TestRuleIgnoreAfterMaxFailures.java:70)
	at org.apache.lucene.util.TestRuleMarkFailure$1.evaluate(TestRuleMarkFailure.java:48)
	at com.carrotsearch.randomizedtesting.rules.StatementAdapter.evaluate(StatementAdapter.java:36)
	at com.carrotsearch.randomizedtesting.ThreadLeakControl$StatementRunner.run(ThreadLeakControl.java:358)
	at com.carrotsearch.randomizedtesting.ThreadLeakControl.forkTimeoutingTask(ThreadLeakControl.java:782)
	at com.carrotsearch.randomizedtesting.ThreadLeakControl$3.evaluate(ThreadLeakControl.java:442)
	at com.carrotsearch.randomizedtesting.RandomizedRunner.runSingleTest(RandomizedRunner.java:746)
	at com.carrotsearch.randomizedtesting.RandomizedRunner$3.evaluate(RandomizedRunner.java:648)
	at com.carrotsearch.randomizedtesting.RandomizedRunner$4.evaluate(RandomizedRunner.java:682)
	at com.carrotsearch.randomizedtesting.RandomizedRunner$5.evaluate(RandomizedRunner.java:693)
	at com.carrotsearch.randomizedtesting.rules.StatementAdapter.evaluate(StatementAdapter.java:36)
	at com.carrotsearch.randomizedtesting.rules.SystemPropertiesRestoreRule$1.evaluate(SystemPropertiesRestoreRule.java:53)
	at org.apache.lucene.util.AbstractBeforeAfterRule$1.evaluate(AbstractBeforeAfterRule.java:46)
	at org.apache.lucene.util.TestRuleStoreClassName$1.evaluate(TestRuleStoreClassName.java:42)
	at com.carrotsearch.randomizedtesting.rules.SystemPropertiesInvariantRule$1.evaluate(SystemPropertiesInvariantRule.java:55)
	at com.carrotsearch.randomizedtesting.rules.NoShadowingOrOverridesOnMethodsRule$1.evaluate(NoShadowingOrOverridesOnMethodsRule.java:39)
	at com.carrotsearch.randomizedtesting.rules.NoShadowingOrOverridesOnMethodsRule$1.evaluate(NoShadowingOrOverridesOnMethodsRule.java:39)
	at com.carrotsearch.randomizedtesting.rules.StatementAdapter.evaluate(StatementAdapter.java:36)
	at org.apache.lucene.util.TestRuleAssertionsRequired$1.evaluate(TestRuleAssertionsRequired.java:43)
	at org.apache.lucene.util.TestRuleMarkFailure$1.evaluate(TestRuleMarkFailure.java:48)
	at org.apache.lucene.util.TestRuleIgnoreAfterMaxFailures$1.evaluate(TestRuleIgnoreAfterMaxFailures.java:70)
	at org.apache.lucene.util.TestRuleIgnoreTestSuites$1.evaluate(TestRuleIgnoreTestSuites.java:55)
	at com.carrotsearch.randomizedtesting.rules.StatementAdapter.evaluate(StatementAdapter.java:36)
	at com.carrotsearch.randomizedtesting.ThreadLeakControl$StatementRunner.run(ThreadLeakControl.java:358)
	at java.lang.Thread.run(Thread.java:744)
Caused by: org.apache.solr.common.SolrException: Lock obtain timed out: org.apache.lucene.store.MockLockFactoryWrapper$MockLock@e3afd5
	at org.apache.solr.core.SolrCore.<init>(SolrCore.java:842)
	at org.apache.solr.core.SolrCore.<init>(SolrCore.java:628)
	at org.apache.solr.core.CoreContainer.createFromLocal(CoreContainer.java:562)
	at org.apache.solr.core.CoreContainer.create(CoreContainer.java:597)
	at org.apache.solr.core.CoreContainer$1.call(CoreContainer.java:258)
	at org.apache.solr.core.CoreContainer$1.call(CoreContainer.java:250)
	at java.util.concurrent.FutureTask.run(FutureTask.java:262)
	at java.util.concurrent.Executors$RunnableAdapter.call(Executors.java:471)
	at java.util.concurrent.FutureTask.run(FutureTask.java:262)
	at java.util.concurrent.ThreadPoolExecutor.runWorker(ThreadPoolExecutor.java:1145)
	at java.util.concurrent.ThreadPoolExecutor$Worker.run(ThreadPoolExecutor.java:615)
	... 1 more
Caused by: org.apache.lucene.store.LockObtainFailedException: Lock obtain timed out: org.apache.lucene.store.MockLockFactoryWrapper$MockLock@e3afd5
	at org.apache.lucene.store.Lock.obtain(Lock.java:89)
	at org.apache.lucene.index.IndexWriter.<init>(IndexWriter.java:701)
	at org.apache.solr.update.SolrIndexWriter.<init>(SolrIndexWriter.java:77)
	at org.apache.solr.update.SolrIndexWriter.create(SolrIndexWriter.java:64)
	at org.apache.solr.core.SolrCore.initIndex(SolrCore.java:509)
	at org.apache.solr.core.SolrCore.<init>(SolrCore.java:759)
	... 11 more


FAILED:  org.apache.solr.update.processor.AddSchemaFieldsUpdateProcessorFactoryTest.testSingleFieldDefaultFieldTypeRoundTrip

Error Message:
SolrCore 'collection1' is not available due to init failure: Lock obtain timed out: org.apache.lucene.store.MockLockFactoryWrapper$MockLock@932a1b

Stack Trace:
org.apache.solr.common.SolrException: SolrCore 'collection1' is not available due to init failure: Lock obtain timed out: org.apache.lucene.store.MockLockFactoryWrapper$MockLock@932a1b
	at __randomizedtesting.SeedInfo.seed([75213E37388FEB53:E040775716251E46]:0)
	at org.apache.solr.core.CoreContainer.getCore(CoreContainer.java:823)
	at org.apache.solr.util.TestHarness.getCore(TestHarness.java:201)
	at org.apache.solr.update.processor.AddSchemaFieldsUpdateProcessorFactoryTest.testSingleFieldDefaultFieldTypeRoundTrip(AddSchemaFieldsUpdateProcessorFactoryTest.java:117)
	at sun.reflect.NativeMethodAccessorImpl.invoke0(Native Method)
	at sun.reflect.NativeMethodAccessorImpl.invoke(NativeMethodAccessorImpl.java:57)
	at sun.reflect.DelegatingMethodAccessorImpl.invoke(DelegatingMethodAccessorImpl.java:43)
	at java.lang.reflect.Method.invoke(Method.java:606)
	at com.carrotsearch.randomizedtesting.RandomizedRunner.invoke(RandomizedRunner.java:1559)
	at com.carrotsearch.randomizedtesting.RandomizedRunner.access$600(RandomizedRunner.java:79)
	at com.carrotsearch.randomizedtesting.RandomizedRunner$6.evaluate(RandomizedRunner.java:737)
	at com.carrotsearch.randomizedtesting.RandomizedRunner$7.evaluate(RandomizedRunner.java:773)
	at com.carrotsearch.randomizedtesting.RandomizedRunner$8.evaluate(RandomizedRunner.java:787)
	at com.carrotsearch.randomizedtesting.rules.SystemPropertiesRestoreRule$1.evaluate(SystemPropertiesRestoreRule.java:53)
	at org.apache.lucene.util.TestRuleSetupTeardownChained$1.evaluate(TestRuleSetupTeardownChained.java:50)
	at org.apache.lucene.util.TestRuleFieldCacheSanity$1.evaluate(TestRuleFieldCacheSanity.java:51)
	at org.apache.lucene.util.AbstractBeforeAfterRule$1.evaluate(AbstractBeforeAfterRule.java:46)
	at com.carrotsearch.randomizedtesting.rules.SystemPropertiesInvariantRule$1.evaluate(SystemPropertiesInvariantRule.java:55)
	at org.apache.lucene.util.TestRuleThreadAndTestName$1.evaluate(TestRuleThreadAndTestName.java:49)
	at org.apache.lucene.util.TestRuleIgnoreAfterMaxFailures$1.evaluate(TestRuleIgnoreAfterMaxFailures.java:70)
	at org.apache.lucene.util.TestRuleMarkFailure$1.evaluate(TestRuleMarkFailure.java:48)
	at com.carrotsearch.randomizedtesting.rules.StatementAdapter.evaluate(StatementAdapter.java:36)
	at com.carrotsearch.randomizedtesting.ThreadLeakControl$StatementRunner.run(ThreadLeakControl.java:358)
	at com.carrotsearch.randomizedtesting.ThreadLeakControl.forkTimeoutingTask(ThreadLeakControl.java:782)
	at com.carrotsearch.randomizedtesting.ThreadLeakControl$3.evaluate(ThreadLeakControl.java:442)
	at com.carrotsearch.randomizedtesting.RandomizedRunner.runSingleTest(RandomizedRunner.java:746)
	at com.carrotsearch.randomizedtesting.RandomizedRunner$3.evaluate(RandomizedRunner.java:648)
	at com.carrotsearch.randomizedtesting.RandomizedRunner$4.evaluate(RandomizedRunner.java:682)
	at com.carrotsearch.randomizedtesting.RandomizedRunner$5.evaluate(RandomizedRunner.java:693)
	at com.carrotsearch.randomizedtesting.rules.StatementAdapter.evaluate(StatementAdapter.java:36)
	at com.carrotsearch.randomizedtesting.rules.SystemPropertiesRestoreRule$1.evaluate(SystemPropertiesRestoreRule.java:53)
	at org.apache.lucene.util.AbstractBeforeAfterRule$1.evaluate(AbstractBeforeAfterRule.java:46)
	at org.apache.lucene.util.TestRuleStoreClassName$1.evaluate(TestRuleStoreClassName.java:42)
	at com.carrotsearch.randomizedtesting.rules.SystemPropertiesInvariantRule$1.evaluate(SystemPropertiesInvariantRule.java:55)
	at com.carrotsearch.randomizedtesting.rules.NoShadowingOrOverridesOnMethodsRule$1.evaluate(NoShadowingOrOverridesOnMethodsRule.java:39)
	at com.carrotsearch.randomizedtesting.rules.NoShadowingOrOverridesOnMethodsRule$1.evaluate(NoShadowingOrOverridesOnMethodsRule.java:39)
	at com.carrotsearch.randomizedtesting.rules.StatementAdapter.evaluate(StatementAdapter.java:36)
	at org.apache.lucene.util.TestRuleAssertionsRequired$1.evaluate(TestRuleAssertionsRequired.java:43)
	at org.apache.lucene.util.TestRuleMarkFailure$1.evaluate(TestRuleMarkFailure.java:48)
	at org.apache.lucene.util.TestRuleIgnoreAfterMaxFailures$1.evaluate(TestRuleIgnoreAfterMaxFailures.java:70)
	at org.apache.lucene.util.TestRuleIgnoreTestSuites$1.evaluate(TestRuleIgnoreTestSuites.java:55)
	at com.carrotsearch.randomizedtesting.rules.StatementAdapter.evaluate(StatementAdapter.java:36)
	at com.carrotsearch.randomizedtesting.ThreadLeakControl$StatementRunner.run(ThreadLeakControl.java:358)
	at java.lang.Thread.run(Thread.java:744)
Caused by: org.apache.solr.common.SolrException: Lock obtain timed out: org.apache.lucene.store.MockLockFactoryWrapper$MockLock@932a1b
	at org.apache.solr.core.SolrCore.<init>(SolrCore.java:842)
	at org.apache.solr.core.SolrCore.<init>(SolrCore.java:628)
	at org.apache.solr.core.CoreContainer.createFromLocal(CoreContainer.java:562)
	at org.apache.solr.core.CoreContainer.create(CoreContainer.java:597)
	at org.apache.solr.core.CoreContainer$1.call(CoreContainer.java:258)
	at org.apache.solr.core.CoreContainer$1.call(CoreContainer.java:250)
	at java.util.concurrent.FutureTask.run(FutureTask.java:262)
	at java.util.concurrent.Executors$RunnableAdapter.call(Executors.java:471)
	at java.util.concurrent.FutureTask.run(FutureTask.java:262)
	at java.util.concurrent.ThreadPoolExecutor.runWorker(ThreadPoolExecutor.java:1145)
	at java.util.concurrent.ThreadPoolExecutor$Worker.run(ThreadPoolExecutor.java:615)
	... 1 more
Caused by: org.apache.lucene.store.LockObtainFailedException: Lock obtain timed out: org.apache.lucene.store.MockLockFactoryWrapper$MockLock@932a1b
	at org.apache.lucene.store.Lock.obtain(Lock.java:89)
	at org.apache.lucene.index.IndexWriter.<init>(IndexWriter.java:701)
	at org.apache.solr.update.SolrIndexWriter.<init>(SolrIndexWriter.java:77)
	at org.apache.solr.update.SolrIndexWriter.create(SolrIndexWriter.java:64)
	at org.apache.solr.core.SolrCore.initIndex(SolrCore.java:509)
	at org.apache.solr.core.SolrCore.<init>(SolrCore.java:759)
	... 11 more


FAILED:  org.apache.solr.update.processor.AddSchemaFieldsUpdateProcessorFactoryTest.testMultipleFieldsRoundTrip

Error Message:
SolrCore 'collection1' is not available due to init failure: Lock obtain timed out: org.apache.lucene.store.MockLockFactoryWrapper$MockLock@fd379f

Stack Trace:
org.apache.solr.common.SolrException: SolrCore 'collection1' is not available due to init failure: Lock obtain timed out: org.apache.lucene.store.MockLockFactoryWrapper$MockLock@fd379f
	at __randomizedtesting.SeedInfo.seed([75213E37388FEB53:9CE294063AA0FB34]:0)
	at org.apache.solr.core.CoreContainer.getCore(CoreContainer.java:823)
	at org.apache.solr.util.TestHarness.getCore(TestHarness.java:201)
	at org.apache.solr.update.processor.AddSchemaFieldsUpdateProcessorFactoryTest.testMultipleFieldsRoundTrip(AddSchemaFieldsUpdateProcessorFactoryTest.java:138)
	at sun.reflect.NativeMethodAccessorImpl.invoke0(Native Method)
	at sun.reflect.NativeMethodAccessorImpl.invoke(NativeMethodAccessorImpl.java:57)
	at sun.reflect.DelegatingMethodAccessorImpl.invoke(DelegatingMethodAccessorImpl.java:43)
	at java.lang.reflect.Method.invoke(Method.java:606)
	at com.carrotsearch.randomizedtesting.RandomizedRunner.invoke(RandomizedRunner.java:1559)
	at com.carrotsearch.randomizedtesting.RandomizedRunner.access$600(RandomizedRunner.java:79)
	at com.carrotsearch.randomizedtesting.RandomizedRunner$6.evaluate(RandomizedRunner.java:737)
	at com.carrotsearch.randomizedtesting.RandomizedRunner$7.evaluate(RandomizedRunner.java:773)
	at com.carrotsearch.randomizedtesting.RandomizedRunner$8.evaluate(RandomizedRunner.java:787)
	at com.carrotsearch.randomizedtesting.rules.SystemPropertiesRestoreRule$1.evaluate(SystemPropertiesRestoreRule.java:53)
	at org.apache.lucene.util.TestRuleSetupTeardownChained$1.evaluate(TestRuleSetupTeardownChained.java:50)
	at org.apache.lucene.util.TestRuleFieldCacheSanity$1.evaluate(TestRuleFieldCacheSanity.java:51)
	at org.apache.lucene.util.AbstractBeforeAfterRule$1.evaluate(AbstractBeforeAfterRule.java:46)
	at com.carrotsearch.randomizedtesting.rules.SystemPropertiesInvariantRule$1.evaluate(SystemPropertiesInvariantRule.java:55)
	at org.apache.lucene.util.TestRuleThreadAndTestName$1.evaluate(TestRuleThreadAndTestName.java:49)
	at org.apache.lucene.util.TestRuleIgnoreAfterMaxFailures$1.evaluate(TestRuleIgnoreAfterMaxFailures.java:70)
	at org.apache.lucene.util.TestRuleMarkFailure$1.evaluate(TestRuleMarkFailure.java:48)
	at com.carrotsearch.randomizedtesting.rules.StatementAdapter.evaluate(StatementAdapter.java:36)
	at com.carrotsearch.randomizedtesting.ThreadLeakControl$StatementRunner.run(ThreadLeakControl.java:358)
	at com.carrotsearch.randomizedtesting.ThreadLeakControl.forkTimeoutingTask(ThreadLeakControl.java:782)
	at com.carrotsearch.randomizedtesting.ThreadLeakControl$3.evaluate(ThreadLeakControl.java:442)
	at com.carrotsearch.randomizedtesting.RandomizedRunner.runSingleTest(RandomizedRunner.java:746)
	at com.carrotsearch.randomizedtesting.RandomizedRunner$3.evaluate(RandomizedRunner.java:648)
	at com.carrotsearch.randomizedtesting.RandomizedRunner$4.evaluate(RandomizedRunner.java:682)
	at com.carrotsearch.randomizedtesting.RandomizedRunner$5.evaluate(RandomizedRunner.java:693)
	at com.carrotsearch.randomizedtesting.rules.StatementAdapter.evaluate(StatementAdapter.java:36)
	at com.carrotsearch.randomizedtesting.rules.SystemPropertiesRestoreRule$1.evaluate(SystemPropertiesRestoreRule.java:53)
	at org.apache.lucene.util.AbstractBeforeAfterRule$1.evaluate(AbstractBeforeAfterRule.java:46)
	at org.apache.lucene.util.TestRuleStoreClassName$1.evaluate(TestRuleStoreClassName.java:42)
	at com.carrotsearch.randomizedtesting.rules.SystemPropertiesInvariantRule$1.evaluate(SystemPropertiesInvariantRule.java:55)
	at com.carrotsearch.randomizedtesting.rules.NoShadowingOrOverridesOnMethodsRule$1.evaluate(NoShadowingOrOverridesOnMethodsRule.java:39)
	at com.carrotsearch.randomizedtesting.rules.NoShadowingOrOverridesOnMethodsRule$1.evaluate(NoShadowingOrOverridesOnMethodsRule.java:39)
	at com.carrotsearch.randomizedtesting.rules.StatementAdapter.evaluate(StatementAdapter.java:36)
	at org.apache.lucene.util.TestRuleAssertionsRequired$1.evaluate(TestRuleAssertionsRequired.java:43)
	at org.apache.lucene.util.TestRuleMarkFailure$1.evaluate(TestRuleMarkFailure.java:48)
	at org.apache.lucene.util.TestRuleIgnoreAfterMaxFailures$1.evaluate(TestRuleIgnoreAfterMaxFailures.java:70)
	at org.apache.lucene.util.TestRuleIgnoreTestSuites$1.evaluate(TestRuleIgnoreTestSuites.java:55)
	at com.carrotsearch.randomizedtesting.rules.StatementAdapter.evaluate(StatementAdapter.java:36)
	at com.carrotsearch.randomizedtesting.ThreadLeakControl$StatementRunner.run(ThreadLeakControl.java:358)
	at java.lang.Thread.run(Thread.java:744)
Caused by: org.apache.solr.common.SolrException: Lock obtain timed out: org.apache.lucene.store.MockLockFactoryWrapper$MockLock@fd379f
	at org.apache.solr.core.SolrCore.<init>(SolrCore.java:842)
	at org.apache.solr.core.SolrCore.<init>(SolrCore.java:628)
	at org.apache.solr.core.CoreContainer.createFromLocal(CoreContainer.java:562)
	at org.apache.solr.core.CoreContainer.create(CoreContainer.java:597)
	at org.apache.solr.core.CoreContainer$1.call(CoreContainer.java:258)
	at org.apache.solr.core.CoreContainer$1.call(CoreContainer.java:250)
	at java.util.concurrent.FutureTask.run(FutureTask.java:262)
	at java.util.concurrent.Executors$RunnableAdapter.call(Executors.java:471)
	at java.util.concurrent.FutureTask.run(FutureTask.java:262)
	at java.util.concurrent.ThreadPoolExecutor.runWorker(ThreadPoolExecutor.java:1145)
	at java.util.concurrent.ThreadPoolExecutor$Worker.run(ThreadPoolExecutor.java:615)
	... 1 more
Caused by: org.apache.lucene.store.LockObtainFailedException: Lock obtain timed out: org.apache.lucene.store.MockLockFactoryWrapper$MockLock@fd379f
	at org.apache.lucene.store.Lock.obtain(Lock.java:89)
	at org.apache.lucene.index.IndexWriter.<init>(IndexWriter.java:701)
	at org.apache.solr.update.SolrIndexWriter.<init>(SolrIndexWriter.java:77)
	at org.apache.solr.update.SolrIndexWriter.create(SolrIndexWriter.java:64)
	at org.apache.solr.core.SolrCore.initIndex(SolrCore.java:509)
	at org.apache.solr.core.SolrCore.<init>(SolrCore.java:759)
	... 11 more


FAILED:  org.apache.solr.update.processor.AddSchemaFieldsUpdateProcessorFactoryTest.testSingleFieldRoundTrip

Error Message:
SolrCore 'collection1' is not available due to init failure: Lock obtain timed out: org.apache.lucene.store.MockLockFactoryWrapper$MockLock@a57f8c

Stack Trace:
org.apache.solr.common.SolrException: SolrCore 'collection1' is not available due to init failure: Lock obtain timed out: org.apache.lucene.store.MockLockFactoryWrapper$MockLock@a57f8c
	at __randomizedtesting.SeedInfo.seed([75213E37388FEB53:D2F0A14B4EA0DB99]:0)
	at org.apache.solr.core.CoreContainer.getCore(CoreContainer.java:823)
	at org.apache.solr.util.TestHarness.getCore(TestHarness.java:201)
	at org.apache.solr.update.processor.AddSchemaFieldsUpdateProcessorFactoryTest.testSingleFieldRoundTrip(AddSchemaFieldsUpdateProcessorFactoryTest.java:85)
	at sun.reflect.NativeMethodAccessorImpl.invoke0(Native Method)
	at sun.reflect.NativeMethodAccessorImpl.invoke(NativeMethodAccessorImpl.java:57)
	at sun.reflect.DelegatingMethodAccessorImpl.invoke(DelegatingMethodAccessorImpl.java:43)
	at java.lang.reflect.Method.invoke(Method.java:606)
	at com.carrotsearch.randomizedtesting.RandomizedRunner.invoke(RandomizedRunner.java:1559)
	at com.carrotsearch.randomizedtesting.RandomizedRunner.access$600(RandomizedRunner.java:79)
	at com.carrotsearch.randomizedtesting.RandomizedRunner$6.evaluate(RandomizedRunner.java:737)
	at com.carrotsearch.randomizedtesting.RandomizedRunner$7.evaluate(RandomizedRunner.java:773)
	at com.carrotsearch.randomizedtesting.RandomizedRunner$8.evaluate(RandomizedRunner.java:787)
	at com.carrotsearch.randomizedtesting.rules.SystemPropertiesRestoreRule$1.evaluate(SystemPropertiesRestoreRule.java:53)
	at org.apache.lucene.util.TestRuleSetupTeardownChained$1.evaluate(TestRuleSetupTeardownChained.java:50)
	at org.apache.lucene.util.TestRuleFieldCacheSanity$1.evaluate(TestRuleFieldCacheSanity.java:51)
	at org.apache.lucene.util.AbstractBeforeAfterRule$1.evaluate(AbstractBeforeAfterRule.java:46)
	at com.carrotsearch.randomizedtesting.rules.SystemPropertiesInvariantRule$1.evaluate(SystemPropertiesInvariantRule.java:55)
	at org.apache.lucene.util.TestRuleThreadAndTestName$1.evaluate(TestRuleThreadAndTestName.java:49)
	at org.apache.lucene.util.TestRuleIgnoreAfterMaxFailures$1.evaluate(TestRuleIgnoreAfterMaxFailures.java:70)
	at org.apache.lucene.util.TestRuleMarkFailure$1.evaluate(TestRuleMarkFailure.java:48)
	at com.carrotsearch.randomizedtesting.rules.StatementAdapter.evaluate(StatementAdapter.java:36)
	at com.carrotsearch.randomizedtesting.ThreadLeakControl$StatementRunner.run(ThreadLeakControl.java:358)
	at com.carrotsearch.randomizedtesting.ThreadLeakControl.forkTimeoutingTask(ThreadLeakControl.java:782)
	at com.carrotsearch.randomizedtesting.ThreadLeakControl$3.evaluate(ThreadLeakControl.java:442)
	at com.carrotsearch.randomizedtesting.RandomizedRunner.runSingleTest(RandomizedRunner.java:746)
	at com.carrotsearch.randomizedtesting.RandomizedRunner$3.evaluate(RandomizedRunner.java:648)
	at com.carrotsearch.randomizedtesting.RandomizedRunner$4.evaluate(RandomizedRunner.java:682)
	at com.carrotsearch.randomizedtesting.RandomizedRunner$5.evaluate(RandomizedRunner.java:693)
	at com.carrotsearch.randomizedtesting.rules.StatementAdapter.evaluate(StatementAdapter.java:36)
	at com.carrotsearch.randomizedtesting.rules.SystemPropertiesRestoreRule$1.evaluate(SystemPropertiesRestoreRule.java:53)
	at org.apache.lucene.util.AbstractBeforeAfterRule$1.evaluate(AbstractBeforeAfterRule.java:46)
	at org.apache.lucene.util.TestRuleStoreClassName$1.evaluate(TestRuleStoreClassName.java:42)
	at com.carrotsearch.randomizedtesting.rules.SystemPropertiesInvariantRule$1.evaluate(SystemPropertiesInvariantRule.java:55)
	at com.carrotsearch.randomizedtesting.rules.NoShadowingOrOverridesOnMethodsRule$1.evaluate(NoShadowingOrOverridesOnMethodsRule.java:39)
	at com.carrotsearch.randomizedtesting.rules.NoShadowingOrOverridesOnMethodsRule$1.evaluate(NoShadowingOrOverridesOnMethodsRule.java:39)
	at com.carrotsearch.randomizedtesting.rules.StatementAdapter.evaluate(StatementAdapter.java:36)
	at org.apache.lucene.util.TestRuleAssertionsRequired$1.evaluate(TestRuleAssertionsRequired.java:43)
	at org.apache.lucene.util.TestRuleMarkFailure$1.evaluate(TestRuleMarkFailure.java:48)
	at org.apache.lucene.util.TestRuleIgnoreAfterMaxFailures$1.evaluate(TestRuleIgnoreAfterMaxFailures.java:70)
	at org.apache.lucene.util.TestRuleIgnoreTestSuites$1.evaluate(TestRuleIgnoreTestSuites.java:55)
	at com.carrotsearch.randomizedtesting.rules.StatementAdapter.evaluate(StatementAdapter.java:36)
	at com.carrotsearch.randomizedtesting.ThreadLeakControl$StatementRunner.run(ThreadLeakControl.java:358)
	at java.lang.Thread.run(Thread.java:744)
Caused by: org.apache.solr.common.SolrException: Lock obtain timed out: org.apache.lucene.store.MockLockFactoryWrapper$MockLock@a57f8c
	at org.apache.solr.core.SolrCore.<init>(SolrCore.java:842)
	at org.apache.solr.core.SolrCore.<init>(SolrCore.java:628)
	at org.apache.solr.core.CoreContainer.createFromLocal(CoreContainer.java:562)
	at org.apache.solr.core.CoreContainer.create(CoreContainer.java:597)
	at org.apache.solr.core.CoreContainer$1.call(CoreContainer.java:258)
	at org.apache.solr.core.CoreContainer$1.call(CoreContainer.java:250)
	at java.util.concurrent.FutureTask.run(FutureTask.java:262)
	at java.util.concurrent.Executors$RunnableAdapter.call(Executors.java:471)
	at java.util.concurrent.FutureTask.run(FutureTask.java:262)
	at java.util.concurrent.ThreadPoolExecutor.runWorker(ThreadPoolExecutor.java:1145)
	at java.util.concurrent.ThreadPoolExecutor$Worker.run(ThreadPoolExecutor.java:615)
	... 1 more
Caused by: org.apache.lucene.store.LockObtainFailedException: Lock obtain timed out: org.apache.lucene.store.MockLockFactoryWrapper$MockLock@a57f8c
	at org.apache.lucene.store.Lock.obtain(Lock.java:89)
	at org.apache.lucene.index.IndexWriter.<init>(IndexWriter.java:701)
	at org.apache.solr.update.SolrIndexWriter.<init>(SolrIndexWriter.java:77)
	at org.apache.solr.update.SolrIndexWriter.create(SolrIndexWriter.java:64)
	at org.apache.solr.core.SolrCore.initIndex(SolrCore.java:509)
	at org.apache.solr.core.SolrCore.<init>(SolrCore.java:759)
	... 11 more


FAILED:  org.apache.solr.update.processor.AddSchemaFieldsUpdateProcessorFactoryTest.testSingleFieldMixedFieldTypesRoundTrip

Error Message:
SolrCore 'collection1' is not available due to init failure: Lock obtain timed out: org.apache.lucene.store.MockLockFactoryWrapper$MockLock@190e33f

Stack Trace:
org.apache.solr.common.SolrException: SolrCore 'collection1' is not available due to init failure: Lock obtain timed out: org.apache.lucene.store.MockLockFactoryWrapper$MockLock@190e33f
	at __randomizedtesting.SeedInfo.seed([75213E37388FEB53:DE8A9A6289A8B74]:0)
	at org.apache.solr.core.CoreContainer.getCore(CoreContainer.java:823)
	at org.apache.solr.util.TestHarness.getCore(TestHarness.java:201)
	at org.apache.solr.update.processor.AddSchemaFieldsUpdateProcessorFactoryTest.testSingleFieldMixedFieldTypesRoundTrip(AddSchemaFieldsUpdateProcessorFactoryTest.java:99)
	at sun.reflect.NativeMethodAccessorImpl.invoke0(Native Method)
	at sun.reflect.NativeMethodAccessorImpl.invoke(NativeMethodAccessorImpl.java:57)
	at sun.reflect.DelegatingMethodAccessorImpl.invoke(DelegatingMethodAccessorImpl.java:43)
	at java.lang.reflect.Method.invoke(Method.java:606)
	at com.carrotsearch.randomizedtesting.RandomizedRunner.invoke(RandomizedRunner.java:1559)
	at com.carrotsearch.randomizedtesting.RandomizedRunner.access$600(RandomizedRunner.java:79)
	at com.carrotsearch.randomizedtesting.RandomizedRunner$6.evaluate(RandomizedRunner.java:737)
	at com.carrotsearch.randomizedtesting.RandomizedRunner$7.evaluate(RandomizedRunner.java:773)
	at com.carrotsearch.randomizedtesting.RandomizedRunner$8.evaluate(RandomizedRunner.java:787)
	at com.carrotsearch.randomizedtesting.rules.SystemPropertiesRestoreRule$1.evaluate(SystemPropertiesRestoreRule.java:53)
	at org.apache.lucene.util.TestRuleSetupTeardownChained$1.evaluate(TestRuleSetupTeardownChained.java:50)
	at org.apache.lucene.util.TestRuleFieldCacheSanity$1.evaluate(TestRuleFieldCacheSanity.java:51)
	at org.apache.lucene.util.AbstractBeforeAfterRule$1.evaluate(AbstractBeforeAfterRule.java:46)
	at com.carrotsearch.randomizedtesting.rules.SystemPropertiesInvariantRule$1.evaluate(SystemPropertiesInvariantRule.java:55)
	at org.apache.lucene.util.TestRuleThreadAndTestName$1.evaluate(TestRuleThreadAndTestName.java:49)
	at org.apache.lucene.util.TestRuleIgnoreAfterMaxFailures$1.evaluate(TestRuleIgnoreAfterMaxFailures.java:70)
	at org.apache.lucene.util.TestRuleMarkFailure$1.evaluate(TestRuleMarkFailure.java:48)
	at com.carrotsearch.randomizedtesting.rules.StatementAdapter.evaluate(StatementAdapter.java:36)
	at com.carrotsearch.randomizedtesting.ThreadLeakControl$StatementRunner.run(ThreadLeakControl.java:358)
	at com.carrotsearch.randomizedtesting.ThreadLeakControl.forkTimeoutingTask(ThreadLeakControl.java:782)
	at com.carrotsearch.randomizedtesting.ThreadLeakControl$3.evaluate(ThreadLeakControl.java:442)
	at com.carrotsearch.randomizedtesting.RandomizedRunner.runSingleTest(RandomizedRunner.java:746)
	at com.carrotsearch.randomizedtesting.RandomizedRunner$3.evaluate(RandomizedRunner.java:648)
	at com.carrotsearch.randomizedtesting.RandomizedRunner$4.evaluate(RandomizedRunner.java:682)
	at com.carrotsearch.randomizedtesting.RandomizedRunner$5.evaluate(RandomizedRunner.java:693)
	at com.carrotsearch.randomizedtesting.rules.StatementAdapter.evaluate(StatementAdapter.java:36)
	at com.carrotsearch.randomizedtesting.rules.SystemPropertiesRestoreRule$1.evaluate(SystemPropertiesRestoreRule.java:53)
	at org.apache.lucene.util.AbstractBeforeAfterRule$1.evaluate(AbstractBeforeAfterRule.java:46)
	at org.apache.lucene.util.TestRuleStoreClassName$1.evaluate(TestRuleStoreClassName.java:42)
	at com.carrotsearch.randomizedtesting.rules.SystemPropertiesInvariantRule$1.evaluate(SystemPropertiesInvariantRule.java:55)
	at com.carrotsearch.randomizedtesting.rules.NoShadowingOrOverridesOnMethodsRule$1.evaluate(NoShadowingOrOverridesOnMethodsRule.java:39)
	at com.carrotsearch.randomizedtesting.rules.NoShadowingOrOverridesOnMethodsRule$1.evaluate(NoShadowingOrOverridesOnMethodsRule.java:39)
	at com.carrotsearch.randomizedtesting.rules.StatementAdapter.evaluate(StatementAdapter.java:36)
	at org.apache.lucene.util.TestRuleAssertionsRequired$1.evaluate(TestRuleAssertionsRequired.java:43)
	at org.apache.lucene.util.TestRuleMarkFailure$1.evaluate(TestRuleMarkFailure.java:48)
	at org.apache.lucene.util.TestRuleIgnoreAfterMaxFailures$1.evaluate(TestRuleIgnoreAfterMaxFailures.java:70)
	at org.apache.lucene.util.TestRuleIgnoreTestSuites$1.evaluate(TestRuleIgnoreTestSuites.java:55)
	at com.carrotsearch.randomizedtesting.rules.StatementAdapter.evaluate(StatementAdapter.java:36)
	at com.carrotsearch.randomizedtesting.ThreadLeakControl$StatementRunner.run(ThreadLeakControl.java:358)
	at java.lang.Thread.run(Thread.java:744)
Caused by: org.apache.solr.common.SolrException: Lock obtain timed out: org.apache.lucene.store.MockLockFactoryWrapper$MockLock@190e33f


[...truncated too long message...]

r.java:1145)
   [junit4]    > 	at java.util.concurrent.ThreadPoolExecutor$Worker.run(ThreadPoolExecutor.java:615)
   [junit4]    > 	... 1 more
   [junit4]    > Caused by: org.apache.lucene.store.LockObtainFailedException: Lock obtain timed out: org.apache.lucene.store.MockLockFactoryWrapper$MockLock@1d5bd1f
   [junit4]    > 	at org.apache.lucene.store.Lock.obtain(Lock.java:89)
   [junit4]    > 	at org.apache.lucene.index.IndexWriter.<init>(IndexWriter.java:701)
   [junit4]    > 	at org.apache.solr.update.SolrIndexWriter.<init>(SolrIndexWriter.java:77)
   [junit4]    > 	at org.apache.solr.update.SolrIndexWriter.create(SolrIndexWriter.java:64)
   [junit4]    > 	at org.apache.solr.core.SolrCore.initIndex(SolrCore.java:509)
   [junit4]    > 	at org.apache.solr.core.SolrCore.<init>(SolrCore.java:759)
   [junit4]    > 	... 11 more
   [junit4]   2> 1505627 T6881 oas.SolrTestCaseJ4.setUp ###Starting testParseFrenchDate
   [junit4]   2> 1505628 T6881 oas.SolrTestCaseJ4.tearDown ###Ending testParseFrenchDate
   [junit4]   2> NOTE: reproduce with: ant test  -Dtestcase=ParsingFieldUpdateProcessorsTest -Dtests.method=testParseFrenchDate -Dtests.seed=75213E37388FEB53 -Dtests.multiplier=3 -Dtests.slow=true -Dtests.locale=ro_RO -Dtests.timezone=Africa/Freetown -Dtests.file.encoding=UTF-8
   [junit4] ERROR   0.01s J0 | ParsingFieldUpdateProcessorsTest.testParseFrenchDate <<<
   [junit4]    > Throwable #1: org.apache.solr.common.SolrException: SolrCore 'collection1' is not available due to init failure: Lock obtain timed out: org.apache.lucene.store.MockLockFactoryWrapper$MockLock@1d5bd1f
   [junit4]    > 	at __randomizedtesting.SeedInfo.seed([75213E37388FEB53:3CBA489FF39DC362]:0)
   [junit4]    > 	at org.apache.solr.core.CoreContainer.getCore(CoreContainer.java:823)
   [junit4]    > 	at org.apache.solr.util.TestHarness.getCore(TestHarness.java:201)
   [junit4]    > 	at org.apache.solr.update.processor.ParsingFieldUpdateProcessorsTest.testParseFrenchDate(ParsingFieldUpdateProcessorsTest.java:226)
   [junit4]    > 	at java.lang.Thread.run(Thread.java:744)
   [junit4]    > Caused by: org.apache.solr.common.SolrException: Lock obtain timed out: org.apache.lucene.store.MockLockFactoryWrapper$MockLock@1d5bd1f
   [junit4]    > 	at org.apache.solr.core.SolrCore.<init>(SolrCore.java:842)
   [junit4]    > 	at org.apache.solr.core.SolrCore.<init>(SolrCore.java:628)
   [junit4]    > 	at org.apache.solr.core.CoreContainer.createFromLocal(CoreContainer.java:562)
   [junit4]    > 	at org.apache.solr.core.CoreContainer.create(CoreContainer.java:597)
   [junit4]    > 	at org.apache.solr.core.CoreContainer$1.call(CoreContainer.java:258)
   [junit4]    > 	at org.apache.solr.core.CoreContainer$1.call(CoreContainer.java:250)
   [junit4]    > 	at java.util.concurrent.FutureTask.run(FutureTask.java:262)
   [junit4]    > 	at java.util.concurrent.Executors$RunnableAdapter.call(Executors.java:471)
   [junit4]    > 	at java.util.concurrent.FutureTask.run(FutureTask.java:262)
   [junit4]    > 	at java.util.concurrent.ThreadPoolExecutor.runWorker(ThreadPoolExecutor.java:1145)
   [junit4]    > 	at java.util.concurrent.ThreadPoolExecutor$Worker.run(ThreadPoolExecutor.java:615)
   [junit4]    > 	... 1 more
   [junit4]    > Caused by: org.apache.lucene.store.LockObtainFailedException: Lock obtain timed out: org.apache.lucene.store.MockLockFactoryWrapper$MockLock@1d5bd1f
   [junit4]    > 	at org.apache.lucene.store.Lock.obtain(Lock.java:89)
   [junit4]    > 	at org.apache.lucene.index.IndexWriter.<init>(IndexWriter.java:701)
   [junit4]    > 	at org.apache.solr.update.SolrIndexWriter.<init>(SolrIndexWriter.java:77)
   [junit4]    > 	at org.apache.solr.update.SolrIndexWriter.create(SolrIndexWriter.java:64)
   [junit4]    > 	at org.apache.solr.core.SolrCore.initIndex(SolrCore.java:509)
   [junit4]    > 	at org.apache.solr.core.SolrCore.<init>(SolrCore.java:759)
   [junit4]    > 	... 11 more
   [junit4]   2> 1505632 T6881 oas.SolrTestCaseJ4.deleteCore ###deleteCore
   [junit4]   2> 1505632 T6881 oasc.CoreContainer.shutdown Shutting down CoreContainer instance=9844618
   [junit4]   2> NOTE: test params are: codec=Lucene45, sim=RandomSimilarityProvider(queryNorm=true,coord=yes): {}, locale=ro_RO, timezone=Africa/Freetown
   [junit4]   2> NOTE: Linux 3.8.0-35-generic i386/Oracle Corporation 1.7.0_51 (32-bit)/cpus=8,threads=1,free=163430736,total=536870912
   [junit4]   2> NOTE: All tests run in this JVM: [SampleTest, TestCollationFieldDocValues, ConnectionManagerTest, AutoCommitTest, TestDocBasedVersionConstraints, TestValueSourceCache, TestFunctionQuery, DocumentBuilderTest, TestSolrXMLSerializer, AddSchemaFieldsUpdateProcessorFactoryTest, CopyFieldTest, CacheHeaderTest, CoreAdminCreateDiscoverTest, TestGroupingSearch, OverseerCollectionProcessorTest, MoreLikeThisHandlerTest, TestMergePolicyConfig, SolrTestCaseJ4Test, ExternalFileFieldSortTest, CSVRequestHandlerTest, HdfsSyncSliceTest, DistributedSpellCheckComponentTest, TestOverriddenPrefixQueryForCustomFieldType, SimpleFacetsTest, DirectUpdateHandlerOptimizeTest, SOLR749Test, TestJoin, CoreAdminHandlerTest, FastVectorHighlighterTest, ZkCLITest, TestSolrDeletionPolicy1, WordBreakSolrSpellCheckerTest, TermVectorComponentTest, TestNonNRTOpen, BinaryUpdateRequestHandlerTest, SliceStateTest, TestLMDirichletSimilarityFactory, StatelessScriptUpdateProcessorFactoryTest, CustomCollectionTest, UpdateRequestProcessorFactoryTest, CircularListTest, ShardSplitTest, TestModifyConfFiles, SolrInfoMBeanTest, InfoHandlerTest, SoftAutoCommitTest, TestCharFilters, FieldMutatingUpdateProcessorTest, TestSuggestSpellingConverter, SchemaVersionSpecificBehaviorTest, QueryElevationComponentTest, OverseerTest, TestSchemaVersionResource, TestRemoteStreaming, SyncSliceTest, IndexSchemaTest, SystemInfoHandlerTest, TriLevelCompositeIdRoutingTest, TestSearchPerf, DeleteShardTest, ShardRoutingTest, TestSolrXmlPersistence, ResponseLogComponentTest, DistributedDebugComponentTest, TestElisionMultitermQuery, TermsComponentTest, TestSolrQueryParser, LoggingHandlerTest, QueryResultKeyTest, HdfsBasicDistributedZk2Test, SearchHandlerTest, HdfsChaosMonkeySafeLeaderTest, TestSolrQueryParserResource, TestLFUCache, SolrXmlInZkTest, BasicDistributedZkTest, ZkControllerTest, TestSolrIndexConfig, TestNoOpRegenerator, DOMUtilTest, SuggesterFSTTest, LeaderElectionTest, PolyFieldTest, RecoveryZkTest, TestTrie, HdfsCollectionsAPIDistributedZkTest, TestPerFieldSimilarity, BasicDistributedZk2Test, UnloadDistributedZkTest, LeaderElectionIntegrationTest, FullSolrCloudDistribCmdsTest, ClusterStateUpdateTest, TestZkChroot, ShardRoutingCustomTest, SliceStateUpdateTest, TestDistributedGrouping, TestFaceting, TermVectorComponentDistributedTest, TestStressVersions, TestCoreContainer, SolrCoreTest, PeerSyncTest, BadIndexSchemaTest, BasicFunctionalityTest, TestLazyCores, HighlighterTest, ShowFileRequestHandlerTest, AnalysisAfterCoreReloadTest, TestExtendedDismaxParser, SolrRequestParserTest, DocValuesTest, SuggesterTest, SpatialFilterTest, TestPseudoReturnFields, TestWordDelimiterFilterFactory, DefaultValueUpdateProcessorTest, DocValuesMultiTest, DebugComponentTest, TestSurroundQueryParser, DisMaxRequestHandlerTest, TestQueryUtils, StandardRequestHandlerTest, TestReversedWildcardFilterFactory, TestQueryTypes, FileBasedSpellCheckerTest, RequiredFieldsTest, RegexBoostProcessorTest, ReturnFieldsTest, MBeansHandlerTest, TestAnalyzedSuggestions, TestPartialUpdateDeduplication, PingRequestHandlerTest, CoreContainerCoreInitFailuresTest, AlternateDirectoryTest, TestStressRecovery, ZkNodePropsTest, TestCursorMarkWithoutUniqueKey, TestDistributedMissingSort, AbstractAnalyticsStatsTest, NoFacetTest, ExpressionTest, QueryFacetTest, RangeFacetTest, FunctionTest, AliasIntegrationTest, AssignTest, DeleteReplicaTest, TestDistribDocBasedVersion, HdfsBasicDistributedZkTest, HdfsRecoveryZkTest, StressHdfsTest, CachingDirectoryFactoryTest, TestInfoStreamLogging, TestNRTOpen, TestReloadAndDeleteDocs, TestShardHandlerFactory, TestSolrXml, TestSolrXmlPersistor, CoreMergeIndexesAdminHandlerTest, DistributedSuggestComponentTest, SuggestComponentTest, TestCopyFieldCollectionResource, TestFieldTypeCollectionResource, TestManagedSchemaFieldResource, TestManagedSchema, CursorMarkTest, TestCollapseQParserPlugin, TestCustomSort, TestMaxScoreQueryParser, TestRecoveryHdfs, TestSimpleQParserPlugin, BJQParserTest, TestAnalyzeInfixSuggestions, TestFileDictionaryLookup, TestFreeTextSuggestions, TestHighFrequencyDictionaryFactory, BlockCacheTest, BlockDirectoryTest, ParsingFieldUpdateProcessorsTest]
   [junit4] Completed on J0 in 2.55s, 33 tests, 33 errors <<< FAILURES!

[...truncated 19 lines...]
BUILD FAILED
/mnt/ssd/jenkins/workspace/Lucene-Solr-trunk-Linux/build.xml:453: The following error occurred while executing this line:
/mnt/ssd/jenkins/workspace/Lucene-Solr-trunk-Linux/build.xml:433: The following error occurred while executing this line:
/mnt/ssd/jenkins/workspace/Lucene-Solr-trunk-Linux/build.xml:39: The following error occurred while executing this line:
/mnt/ssd/jenkins/workspace/Lucene-Solr-trunk-Linux/extra-targets.xml:37: The following error occurred while executing this line:
/mnt/ssd/jenkins/workspace/Lucene-Solr-trunk-Linux/solr/build.xml:189: The following error occurred while executing this line:
/mnt/ssd/jenkins/workspace/Lucene-Solr-trunk-Linux/solr/common-build.xml:491: The following error occurred while executing this line:
/mnt/ssd/jenkins/workspace/Lucene-Solr-trunk-Linux/lucene/common-build.xml:1268: The following error occurred while executing this line:
/mnt/ssd/jenkins/workspace/Lucene-Solr-trunk-Linux/lucene/common-build.xml:901: There were test failures: 365 suites, 1590 tests, 45 errors, 1 failure, 35 ignored (7 assumptions)

Total time: 49 minutes 46 seconds
Build step 'Invoke Ant' marked build as failure
Description set: Java: 32bit/jdk1.7.0_51 -server -XX:+UseG1GC
Archiving artifacts
Recording test results
Email was triggered for: Failure
Sending email for trigger: Failure