You are viewing a plain text version of this content. The canonical link for it is here.
Posted to java-dev@axis.apache.org by Apache Jenkins Server <je...@builds.apache.org> on 2014/02/05 16:05:26 UTC

Build failed in Jenkins: axis-trunk » MTOM Stub Sample #250

See <https://builds.apache.org/job/axis-trunk/org.apache.axis$mtomstub-sample/250/>

------------------------------------------
[INFO]                                                                         
[INFO] ------------------------------------------------------------------------
[INFO] Building MTOM Stub Sample 1.4.1-SNAPSHOT
[INFO] ------------------------------------------------------------------------
[INFO] 
[INFO] --- maven-clean-plugin:2.4.1:clean (default-clean) @ mtomstub-sample ---
[INFO] 
[INFO] --- maven-enforcer-plugin:1.1.1:enforce (default) @ mtomstub-sample ---
[INFO] 
[INFO] --- maven-remote-resources-plugin:1.1:process (default) @ mtomstub-sample ---
[INFO] 
[INFO] --- maven-resources-plugin:2.4.3:resources (default-resources) @ mtomstub-sample ---
[INFO] Using 'UTF-8' encoding to copy filtered resources.
[INFO] Copying 1 resource
[INFO] Copying 3 resources
[INFO] 
[INFO] --- maven-compiler-plugin:2.3.2:compile (default-compile) @ mtomstub-sample ---
[INFO] Compiling 3 source files to <https://builds.apache.org/job/axis-trunk/org.apache.axis$mtomstub-sample/ws/target/classes>
[INFO] -------------------------------------------------------------
[ERROR] COMPILATION ERROR : 
[INFO] -------------------------------------------------------------
[ERROR] <https://builds.apache.org/job/axis-trunk/org.apache.axis$mtomstub-sample/ws/src/main/java/samples/mtomstub/service/DownloadFile.java>:[3,17] package javax.jws does not exist
[ERROR] <https://builds.apache.org/job/axis-trunk/org.apache.axis$mtomstub-sample/ws/src/main/java/samples/mtomstub/service/DownloadFile.java>:[4,25] package javax.xml.ws.soap does not exist
[ERROR] <https://builds.apache.org/job/axis-trunk/org.apache.axis$mtomstub-sample/ws/src/main/java/samples/mtomstub/service/DownloadFileImpl.java>:[4,17] package javax.jws does not exist
[ERROR] <https://builds.apache.org/job/axis-trunk/org.apache.axis$mtomstub-sample/ws/src/main/java/samples/mtomstub/service/DownloadFile.java>:[6,1] cannot find symbol
symbol: class WebService
@WebService
[ERROR] <https://builds.apache.org/job/axis-trunk/org.apache.axis$mtomstub-sample/ws/src/main/java/samples/mtomstub/service/DownloadFile.java>:[7,1] cannot find symbol
symbol: class MTOM
@MTOM
[ERROR] <https://builds.apache.org/job/axis-trunk/org.apache.axis$mtomstub-sample/ws/src/main/java/samples/mtomstub/service/DownloadFileImpl.java>:[7,1] cannot find symbol
symbol: class WebService
@WebService(endpointInterface="samples.mtomstub.service.DownloadFile", serviceName = "DownloadFileWS")
[INFO] 6 errors 
[INFO] -------------------------------------------------------------

---------------------------------------------------------------------
To unsubscribe, e-mail: java-dev-unsubscribe@axis.apache.org
For additional commands, e-mail: java-dev-help@axis.apache.org


Jenkins build is back to normal : axis-trunk » MTOM Stub Sample #251

Posted by Apache Jenkins Server <je...@builds.apache.org>.
See <https://builds.apache.org/job/axis-trunk/org.apache.axis$mtomstub-sample/251/>


---------------------------------------------------------------------
To unsubscribe, e-mail: java-dev-unsubscribe@axis.apache.org
For additional commands, e-mail: java-dev-help@axis.apache.org