You are viewing a plain text version of this content. The canonical link for it is here.
Posted to yarn-dev@hadoop.apache.org by Apache Jenkins Server <je...@builds.apache.org> on 2015/03/17 01:30:30 UTC

Failed: YARN-3288 PreCommit Build #6989

Jira: https://issues.apache.org/jira/browse/YARN-3288
Build: https://builds.apache.org/job/PreCommit-YARN-Build/6989/

###################################################################################
########################## LAST 60 LINES OF THE CONSOLE ###########################
[...truncated 23 lines...]

======================================================================
======================================================================
    Testing patch for YARN-3288.
======================================================================
======================================================================


HEAD is now at 5608520 YARN-3339. TestDockerContainerExecutor should pull a single image and not the entire centos repository. (Ravindra Kumar Naik via raviprak)
Previous HEAD position was 5608520... YARN-3339. TestDockerContainerExecutor should pull a single image and not the entire centos repository. (Ravindra Kumar Naik via raviprak)
Switched to branch 'trunk'
Your branch is behind 'origin/trunk' by 5 commits, and can be fast-forwarded.
  (use "git pull" to update your local branch)
First, rewinding head to replay your work on top of it...
Fast-forwarded trunk to 56085203c43b8f2561bf3745910e03f8ac176a67.
YARN-3288 patch is being downloaded at Tue Mar 17 00:30:24 UTC 2015 from
http://issues.apache.org/jira/secure/attachment/12703208/YARN-3288.01.patch
cp: cannot stat '/home/jenkins/buildSupport/lib/*': No such file or directory
The patch does not appear to apply with p0 to p2
PATCH APPLICATION FAILED




{color:red}-1 overall{color}.  Here are the results of testing the latest attachment 
  http://issues.apache.org/jira/secure/attachment/12703208/YARN-3288.01.patch
  against trunk revision 5608520.

    {color:red}-1 patch{color}.  The patch command could not apply the patch.

Console output: https://builds.apache.org/job/PreCommit-YARN-Build/6989//console

This message is automatically generated.


======================================================================
======================================================================
    Adding comment to Jira.
======================================================================
======================================================================


Comment added.
c0e626a44ddffba53036b5074212ab066af3b9ac logged out


======================================================================
======================================================================
    Finished build.
======================================================================
======================================================================


Build step 'Execute shell' marked build as failure
Archiving artifacts
[description-setter] Could not determine description.
Recording test results
Email was triggered for: Failure
Sending email for trigger: Failure



###################################################################################
############################## FAILED TESTS (if any) ##############################
No tests ran.

Failed: YARN-3305 PreCommit Build #6990

Posted by Apache Jenkins Server <je...@builds.apache.org>.
Jira: https://issues.apache.org/jira/browse/YARN-3305
Build: https://builds.apache.org/job/PreCommit-YARN-Build/6990/

###################################################################################
########################## LAST 60 LINES OF THE CONSOLE ###########################
[...truncated 3474 lines...]
  http://issues.apache.org/jira/secure/attachment/12704939/0003-YARN-3305.patch
  against trunk revision 5608520.

    {color:green}+1 @author{color}.  The patch does not contain any @author tags.

    {color:green}+1 tests included{color}.  The patch appears to include 3 new or modified test files.

    {color:green}+1 javac{color}.  The applied patch does not increase the total number of javac compiler warnings.

    {color:green}+1 javadoc{color}.  There were no new javadoc warning messages.

    {color:green}+1 eclipse:eclipse{color}.  The patch built with eclipse:eclipse.

    {color:red}-1 findbugs{color}.  The patch appears to introduce 5 new Findbugs (version 2.0.3) warnings.

    {color:green}+1 release audit{color}.  The applied patch does not increase the total number of release audit warnings.

    {color:red}-1 core tests{color}.  The patch failed these unit tests in hadoop-yarn-project/hadoop-yarn/hadoop-yarn-server/hadoop-yarn-server-resourcemanager:

                  org.apache.hadoop.yarn.server.resourcemanager.TestRMRestart

Test results: https://builds.apache.org/job/PreCommit-YARN-Build/6990//testReport/
Findbugs warnings: https://builds.apache.org/job/PreCommit-YARN-Build/6990//artifact/patchprocess/newPatchFindbugsWarningshadoop-yarn-server-resourcemanager.html
Console output: https://builds.apache.org/job/PreCommit-YARN-Build/6990//console

This message is automatically generated.


======================================================================
======================================================================
    Adding comment to Jira.
======================================================================
======================================================================


Comment added.
c83e77e4cd23fe2e1ae369b37fdc2931463293c7 logged out


======================================================================
======================================================================
    Finished build.
======================================================================
======================================================================


Build step 'Execute shell' marked build as failure
Archiving artifacts
Sending artifact delta relative to PreCommit-YARN-Build #6986
Archived 15 artifacts
Archive block size is 32768
Received 52 blocks and 7380822 bytes
Compression is 18.8%
Took 1.6 sec
[description-setter] Could not determine description.
Recording test results
Publish JUnit test result report is waiting for a checkpoint on PreCommit-YARN-Build #6988
Email was triggered for: Failure
Sending email for trigger: Failure



###################################################################################
############################## FAILED TESTS (if any) ##############################
1 tests failed.
FAILED:  org.apache.hadoop.yarn.server.resourcemanager.TestRMRestart.testRMRestartGetApplicationList[1]

Error Message:

rMAppManager.logApplicationSummary(
    isA(org.apache.hadoop.yarn.api.records.ApplicationId)
);
Wanted 3 times:
-> at org.apache.hadoop.yarn.server.resourcemanager.TestRMRestart.testRMRestartGetApplicationList(TestRMRestart.java:969)
But was 2 times:
-> at org.apache.hadoop.yarn.server.resourcemanager.RMAppManager.handle(RMAppManager.java:66)


Stack Trace:
org.mockito.exceptions.verification.TooLittleActualInvocations: 
rMAppManager.logApplicationSummary(
    isA(org.apache.hadoop.yarn.api.records.ApplicationId)
);
Wanted 3 times:
-> at org.apache.hadoop.yarn.server.resourcemanager.TestRMRestart.testRMRestartGetApplicationList(TestRMRestart.java:969)
But was 2 times:
-> at org.apache.hadoop.yarn.server.resourcemanager.RMAppManager.handle(RMAppManager.java:66)

	at org.apache.hadoop.yarn.server.resourcemanager.TestRMRestart.testRMRestartGetApplicationList(TestRMRestart.java:969)