You are viewing a plain text version of this content. The canonical link for it is here.
Posted to builds@beam.apache.org by Apache Jenkins Server <je...@builds.apache.org> on 2020/05/24 13:06:22 UTC
Build failed in Jenkins: beam_PostCommit_Python35 #2487
See <https://builds.apache.org/job/beam_PostCommit_Python35/2487/display/redirect>
Changes:
------------------------------------------
[...truncated 11.09 MB...]
File "/usr/local/lib/python3.5/site-packages/dataflow_worker/executor.py", line 179, in execute
op.start()
File "dataflow_worker/shuffle_operations.py", line 63, in dataflow_worker.shuffle_operations.GroupedShuffleReadOperation.start
File "dataflow_worker/shuffle_operations.py", line 64, in dataflow_worker.shuffle_operations.GroupedShuffleReadOperation.start
File "dataflow_worker/shuffle_operations.py", line 79, in dataflow_worker.shuffle_operations.GroupedShuffleReadOperation.start
File "dataflow_worker/shuffle_operations.py", line 80, in dataflow_worker.shuffle_operations.GroupedShuffleReadOperation.start
File "dataflow_worker/shuffle_operations.py", line 84, in dataflow_worker.shuffle_operations.GroupedShuffleReadOperation.start
File "apache_beam/runners/worker/operations.py", line 332, in apache_beam.runners.worker.operations.Operation.output
File "apache_beam/runners/worker/operations.py", line 195, in apache_beam.runners.worker.operations.SingletonConsumerSet.receive
File "dataflow_worker/shuffle_operations.py", line 261, in dataflow_worker.shuffle_operations.BatchGroupAlsoByWindowsOperation.process
File "dataflow_worker/shuffle_operations.py", line 268, in dataflow_worker.shuffle_operations.BatchGroupAlsoByWindowsOperation.process
File "apache_beam/runners/worker/operations.py", line 332, in apache_beam.runners.worker.operations.Operation.output
File "apache_beam/runners/worker/operations.py", line 195, in apache_beam.runners.worker.operations.SingletonConsumerSet.receive
File "apache_beam/runners/worker/operations.py", line 670, in apache_beam.runners.worker.operations.DoOperation.process
File "apache_beam/runners/worker/operations.py", line 671, in apache_beam.runners.worker.operations.DoOperation.process
File "apache_beam/runners/common.py", line 963, in apache_beam.runners.common.DoFnRunner.process
File "apache_beam/runners/common.py", line 1030, in apache_beam.runners.common.DoFnRunner._reraise_augmented
File "apache_beam/runners/common.py", line 961, in apache_beam.runners.common.DoFnRunner.process
File "apache_beam/runners/common.py", line 726, in apache_beam.runners.common.PerWindowInvoker.invoke_process
File "apache_beam/runners/common.py", line 812, in apache_beam.runners.common.PerWindowInvoker._invoke_process_per_window
File "apache_beam/runners/common.py", line 1122, in apache_beam.runners.common._OutputProcessor.process_outputs
File "apache_beam/runners/worker/operations.py", line 195, in apache_beam.runners.worker.operations.SingletonConsumerSet.receive
File "apache_beam/runners/worker/operations.py", line 670, in apache_beam.runners.worker.operations.DoOperation.process
File "apache_beam/runners/worker/operations.py", line 671, in apache_beam.runners.worker.operations.DoOperation.process
File "apache_beam/runners/common.py", line 963, in apache_beam.runners.common.DoFnRunner.process
File "apache_beam/runners/common.py", line 1030, in apache_beam.runners.common.DoFnRunner._reraise_augmented
File "apache_beam/runners/common.py", line 961, in apache_beam.runners.common.DoFnRunner.process
File "apache_beam/runners/common.py", line 553, in apache_beam.runners.common.SimpleInvoker.invoke_process
File "apache_beam/runners/common.py", line 1122, in apache_beam.runners.common._OutputProcessor.process_outputs
File "apache_beam/runners/worker/operations.py", line 195, in apache_beam.runners.worker.operations.SingletonConsumerSet.receive
File "apache_beam/runners/worker/operations.py", line 670, in apache_beam.runners.worker.operations.DoOperation.process
File "apache_beam/runners/worker/operations.py", line 671, in apache_beam.runners.worker.operations.DoOperation.process
File "apache_beam/runners/common.py", line 963, in apache_beam.runners.common.DoFnRunner.process
File "apache_beam/runners/common.py", line 1045, in apache_beam.runners.common.DoFnRunner._reraise_augmented
File "/usr/local/lib/python3.5/site-packages/future/utils/__init__.py", line 446, in raise_with_traceback
raise exc.with_traceback(traceback)
File "apache_beam/runners/common.py", line 961, in apache_beam.runners.common.DoFnRunner.process
File "apache_beam/runners/common.py", line 554, in apache_beam.runners.common.SimpleInvoker.invoke_process
File "<https://builds.apache.org/job/beam_PostCommit_Python35/ws/src/sdks/python/apache_beam/transforms/core.py",> line 1511, in <lambda>
wrapper = lambda x: [fn(x)]
File "<https://builds.apache.org/job/beam_PostCommit_Python35/ws/src/sdks/python/apache_beam/testing/util.py",> line 218, in _matches
hamcrest_assert(actual, contains_inanyorder(*expected_list))
File "/usr/local/lib/python3.5/site-packages/hamcrest/core/assert_that.py", line 44, in assert_that
_assert_match(actual=arg1, matcher=arg2, reason=arg3)
File "/usr/local/lib/python3.5/site-packages/hamcrest/core/assert_that.py", line 60, in _assert_match
raise AssertionError(description)
RuntimeError: AssertionError:
Expected: a sequence over [(a sequence containing 'bicycle' and a sequence containing 'dinosaur')] in any order
but: not matched: <['land vehicle', 'animal']> [while running 'assert_that/Match']
apache_beam.runners.dataflow.dataflow_runner: INFO: 2020-05-24T12:57:31.945Z: JOB_MESSAGE_ERROR: Traceback (most recent call last):
File "apache_beam/runners/common.py", line 961, in apache_beam.runners.common.DoFnRunner.process
File "apache_beam/runners/common.py", line 554, in apache_beam.runners.common.SimpleInvoker.invoke_process
File "<https://builds.apache.org/job/beam_PostCommit_Python35/ws/src/sdks/python/apache_beam/transforms/core.py",> line 1511, in <lambda>
wrapper = lambda x: [fn(x)]
File "<https://builds.apache.org/job/beam_PostCommit_Python35/ws/src/sdks/python/apache_beam/testing/util.py",> line 218, in _matches
hamcrest_assert(actual, contains_inanyorder(*expected_list))
File "/usr/local/lib/python3.5/site-packages/hamcrest/core/assert_that.py", line 44, in assert_that
_assert_match(actual=arg1, matcher=arg2, reason=arg3)
File "/usr/local/lib/python3.5/site-packages/hamcrest/core/assert_that.py", line 60, in _assert_match
raise AssertionError(description)
AssertionError:
Expected: a sequence over [(a sequence containing 'bicycle' and a sequence containing 'dinosaur')] in any order
but: not matched: <['land vehicle', 'animal']>
During handling of the above exception, another exception occurred:
Traceback (most recent call last):
File "/usr/local/lib/python3.5/site-packages/dataflow_worker/batchworker.py", line 647, in do_work
work_executor.execute()
File "/usr/local/lib/python3.5/site-packages/dataflow_worker/executor.py", line 179, in execute
op.start()
File "dataflow_worker/shuffle_operations.py", line 63, in dataflow_worker.shuffle_operations.GroupedShuffleReadOperation.start
File "dataflow_worker/shuffle_operations.py", line 64, in dataflow_worker.shuffle_operations.GroupedShuffleReadOperation.start
File "dataflow_worker/shuffle_operations.py", line 79, in dataflow_worker.shuffle_operations.GroupedShuffleReadOperation.start
File "dataflow_worker/shuffle_operations.py", line 80, in dataflow_worker.shuffle_operations.GroupedShuffleReadOperation.start
File "dataflow_worker/shuffle_operations.py", line 84, in dataflow_worker.shuffle_operations.GroupedShuffleReadOperation.start
File "apache_beam/runners/worker/operations.py", line 332, in apache_beam.runners.worker.operations.Operation.output
File "apache_beam/runners/worker/operations.py", line 195, in apache_beam.runners.worker.operations.SingletonConsumerSet.receive
File "dataflow_worker/shuffle_operations.py", line 261, in dataflow_worker.shuffle_operations.BatchGroupAlsoByWindowsOperation.process
File "dataflow_worker/shuffle_operations.py", line 268, in dataflow_worker.shuffle_operations.BatchGroupAlsoByWindowsOperation.process
File "apache_beam/runners/worker/operations.py", line 332, in apache_beam.runners.worker.operations.Operation.output
File "apache_beam/runners/worker/operations.py", line 195, in apache_beam.runners.worker.operations.SingletonConsumerSet.receive
File "apache_beam/runners/worker/operations.py", line 670, in apache_beam.runners.worker.operations.DoOperation.process
File "apache_beam/runners/worker/operations.py", line 671, in apache_beam.runners.worker.operations.DoOperation.process
File "apache_beam/runners/common.py", line 963, in apache_beam.runners.common.DoFnRunner.process
File "apache_beam/runners/common.py", line 1030, in apache_beam.runners.common.DoFnRunner._reraise_augmented
File "apache_beam/runners/common.py", line 961, in apache_beam.runners.common.DoFnRunner.process
File "apache_beam/runners/common.py", line 726, in apache_beam.runners.common.PerWindowInvoker.invoke_process
File "apache_beam/runners/common.py", line 812, in apache_beam.runners.common.PerWindowInvoker._invoke_process_per_window
File "apache_beam/runners/common.py", line 1122, in apache_beam.runners.common._OutputProcessor.process_outputs
File "apache_beam/runners/worker/operations.py", line 195, in apache_beam.runners.worker.operations.SingletonConsumerSet.receive
File "apache_beam/runners/worker/operations.py", line 670, in apache_beam.runners.worker.operations.DoOperation.process
File "apache_beam/runners/worker/operations.py", line 671, in apache_beam.runners.worker.operations.DoOperation.process
File "apache_beam/runners/common.py", line 963, in apache_beam.runners.common.DoFnRunner.process
File "apache_beam/runners/common.py", line 1030, in apache_beam.runners.common.DoFnRunner._reraise_augmented
File "apache_beam/runners/common.py", line 961, in apache_beam.runners.common.DoFnRunner.process
File "apache_beam/runners/common.py", line 553, in apache_beam.runners.common.SimpleInvoker.invoke_process
File "apache_beam/runners/common.py", line 1122, in apache_beam.runners.common._OutputProcessor.process_outputs
File "apache_beam/runners/worker/operations.py", line 195, in apache_beam.runners.worker.operations.SingletonConsumerSet.receive
File "apache_beam/runners/worker/operations.py", line 670, in apache_beam.runners.worker.operations.DoOperation.process
File "apache_beam/runners/worker/operations.py", line 671, in apache_beam.runners.worker.operations.DoOperation.process
File "apache_beam/runners/common.py", line 963, in apache_beam.runners.common.DoFnRunner.process
File "apache_beam/runners/common.py", line 1045, in apache_beam.runners.common.DoFnRunner._reraise_augmented
File "/usr/local/lib/python3.5/site-packages/future/utils/__init__.py", line 446, in raise_with_traceback
raise exc.with_traceback(traceback)
File "apache_beam/runners/common.py", line 961, in apache_beam.runners.common.DoFnRunner.process
File "apache_beam/runners/common.py", line 554, in apache_beam.runners.common.SimpleInvoker.invoke_process
File "<https://builds.apache.org/job/beam_PostCommit_Python35/ws/src/sdks/python/apache_beam/transforms/core.py",> line 1511, in <lambda>
wrapper = lambda x: [fn(x)]
File "<https://builds.apache.org/job/beam_PostCommit_Python35/ws/src/sdks/python/apache_beam/testing/util.py",> line 218, in _matches
hamcrest_assert(actual, contains_inanyorder(*expected_list))
File "/usr/local/lib/python3.5/site-packages/hamcrest/core/assert_that.py", line 44, in assert_that
_assert_match(actual=arg1, matcher=arg2, reason=arg3)
File "/usr/local/lib/python3.5/site-packages/hamcrest/core/assert_that.py", line 60, in _assert_match
raise AssertionError(description)
RuntimeError: AssertionError:
Expected: a sequence over [(a sequence containing 'bicycle' and a sequence containing 'dinosaur')] in any order
but: not matched: <['land vehicle', 'animal']> [while running 'assert_that/Match']
apache_beam.runners.dataflow.dataflow_runner: INFO: 2020-05-24T12:57:31.968Z: JOB_MESSAGE_BASIC: Finished operation assert_that/Group/GroupByKey/Read+assert_that/Group/GroupByKey/GroupByWindow+assert_that/Group/Map(_merge_tagged_vals_under_key)+assert_that/Unkey+assert_that/Match
apache_beam.runners.dataflow.dataflow_runner: INFO: 2020-05-24T12:57:32.046Z: JOB_MESSAGE_DEBUG: Executing failure step failure40
apache_beam.runners.dataflow.dataflow_runner: INFO: 2020-05-24T12:57:32.077Z: JOB_MESSAGE_ERROR: Workflow failed. Causes: S10:assert_that/Group/GroupByKey/Read+assert_that/Group/GroupByKey/GroupByWindow+assert_that/Group/Map(_merge_tagged_vals_under_key)+assert_that/Unkey+assert_that/Match failed., The job failed because a work item has failed 4 times. Look in previous log entries for the cause of each one of the 4 failures. For more information, see https://cloud.google.com/dataflow/docs/guides/common-errors. The work item was attempted on these workers:
beamapp-jenkins-052412501-05240550-7h4k-harness-8fs3
Root cause: Work item failed.,
beamapp-jenkins-052412501-05240550-7h4k-harness-8fs3
Root cause: Work item failed.,
beamapp-jenkins-052412501-05240550-7h4k-harness-8fs3
Root cause: Work item failed.,
beamapp-jenkins-052412501-05240550-7h4k-harness-8fs3
Root cause: Work item failed.
apache_beam.runners.dataflow.dataflow_runner: INFO: 2020-05-24T12:57:32.198Z: JOB_MESSAGE_DETAILED: Cleaning up.
apache_beam.runners.dataflow.dataflow_runner: INFO: 2020-05-24T12:57:32.248Z: JOB_MESSAGE_DEBUG: Starting worker pool teardown.
apache_beam.runners.dataflow.dataflow_runner: INFO: 2020-05-24T12:57:32.281Z: JOB_MESSAGE_BASIC: Stopping worker pool...
apache_beam.runners.dataflow.dataflow_runner: INFO: 2020-05-24T12:58:16.353Z: JOB_MESSAGE_DETAILED: Autoscaling: Resized worker pool from 1 to 0.
apache_beam.runners.dataflow.dataflow_runner: INFO: 2020-05-24T12:58:16.392Z: JOB_MESSAGE_BASIC: Worker pool stopped.
apache_beam.runners.dataflow.dataflow_runner: INFO: 2020-05-24T12:58:16.429Z: JOB_MESSAGE_DEBUG: Tearing down pending resources...
apache_beam.runners.dataflow.dataflow_runner: INFO: Job 2020-05-24_05_50_26-8271604561214763400 is in state JOB_STATE_FAILED
--------------------- >> end captured logging << ---------------------
Worker logs: https://console.cloud.google.com/dataflow/jobs/us-central1/2020-05-24_05_02_50-10859204456667931386?project=apache-beam-testing
Worker logs: https://console.cloud.google.com/dataflow/jobs/us-central1/2020-05-24_05_16_25-9032496278375557119?project=apache-beam-testing
Worker logs: https://console.cloud.google.com/dataflow/jobs/us-central1/2020-05-24_05_23_18-18381822809648250104?project=apache-beam-testing
Worker logs: https://console.cloud.google.com/dataflow/jobs/us-central1/2020-05-24_05_30_03-17604650513431759404?project=apache-beam-testing
Worker logs: https://console.cloud.google.com/dataflow/jobs/us-central1/2020-05-24_05_37_36-10043596172263271199?project=apache-beam-testing
Worker logs: https://console.cloud.google.com/dataflow/jobs/us-central1/2020-05-24_05_44_50-3525475497767788356?project=apache-beam-testing
Worker logs: https://console.cloud.google.com/dataflow/jobs/us-central1/2020-05-24_05_51_44-15944100871835327216?project=apache-beam-testing
Worker logs: https://console.cloud.google.com/dataflow/jobs/us-central1/2020-05-24_05_02_45-6031807523209199231?project=apache-beam-testing
Worker logs: https://console.cloud.google.com/dataflow/jobs/us-central1/2020-05-24_05_24_20-14266739537617723563?project=apache-beam-testing
Worker logs: https://console.cloud.google.com/dataflow/jobs/us-central1/2020-05-24_05_32_07-12586546710573285445?project=apache-beam-testing
Worker logs: https://console.cloud.google.com/dataflow/jobs/us-central1/2020-05-24_05_39_08-1864834656884799365?project=apache-beam-testing
Worker logs: https://console.cloud.google.com/dataflow/jobs/us-central1/2020-05-24_05_45_54-979402234668208831?project=apache-beam-testing
Worker logs: https://console.cloud.google.com/dataflow/jobs/us-central1/2020-05-24_05_52_30-5951619114995458318?project=apache-beam-testing
Worker logs: https://console.cloud.google.com/dataflow/jobs/us-central1/2020-05-24_05_59_26-5602755608022133909?project=apache-beam-testing
Worker logs: https://console.cloud.google.com/dataflow/jobs/us-central1/2020-05-24_05_02_46-4995674860567042337?project=apache-beam-testing
Worker logs: https://console.cloud.google.com/dataflow/jobs/us-central1/2020-05-24_05_21_26-12650399943482331068?project=apache-beam-testing
Worker logs: https://console.cloud.google.com/dataflow/jobs/us-central1/2020-05-24_05_28_28-4334315582015365621?project=apache-beam-testing
Worker logs: https://console.cloud.google.com/dataflow/jobs/us-central1/2020-05-24_05_36_09-13288846379814474597?project=apache-beam-testing
Worker logs: https://console.cloud.google.com/dataflow/jobs/us-central1/2020-05-24_05_43_49-3923017530956435870?project=apache-beam-testing
Worker logs: https://console.cloud.google.com/dataflow/jobs/us-central1/2020-05-24_05_50_57-8989261455911856866?project=apache-beam-testing
Worker logs: https://console.cloud.google.com/dataflow/jobs/us-central1/2020-05-24_05_02_49-1299742276431525121?project=apache-beam-testing
Worker logs: https://console.cloud.google.com/dataflow/jobs/us-central1/2020-05-24_05_14_15-11619451034101056017?project=apache-beam-testing
Worker logs: https://console.cloud.google.com/dataflow/jobs/us-central1/2020-05-24_05_21_28-7284359180190692762?project=apache-beam-testing
Worker logs: https://console.cloud.google.com/dataflow/jobs/us-central1/2020-05-24_05_28_56-2571159315624223871?project=apache-beam-testing
Worker logs: https://console.cloud.google.com/dataflow/jobs/us-central1/2020-05-24_05_36_21-17165254624376844553?project=apache-beam-testing
Worker logs: https://console.cloud.google.com/dataflow/jobs/us-central1/2020-05-24_05_43_19-10961507250138567001?project=apache-beam-testing
Worker logs: https://console.cloud.google.com/dataflow/jobs/us-central1/2020-05-24_05_50_26-8271604561214763400?project=apache-beam-testing
Worker logs: https://console.cloud.google.com/dataflow/jobs/us-central1/2020-05-24_05_02_46-14822865619185567567?project=apache-beam-testing
Worker logs: https://console.cloud.google.com/dataflow/jobs/us-central1/2020-05-24_05_10_43-2369534183525515588?project=apache-beam-testing
Worker logs: https://console.cloud.google.com/dataflow/jobs/us-central1/2020-05-24_05_18_19-18179581288143960912?project=apache-beam-testing
Worker logs: https://console.cloud.google.com/dataflow/jobs/us-central1/2020-05-24_05_25_57-10089729951583117822?project=apache-beam-testing
Worker logs: https://console.cloud.google.com/dataflow/jobs/us-central1/2020-05-24_05_33_20-983060344235884488?project=apache-beam-testing
Worker logs: https://console.cloud.google.com/dataflow/jobs/us-central1/2020-05-24_05_40_19-875574270421186355?project=apache-beam-testing
Worker logs: https://console.cloud.google.com/dataflow/jobs/us-central1/2020-05-24_05_47_18-15528222706579452770?project=apache-beam-testing
Worker logs: https://console.cloud.google.com/dataflow/jobs/us-central1/2020-05-24_05_02_46-12959908690800480587?project=apache-beam-testing
Worker logs: https://console.cloud.google.com/dataflow/jobs/us-central1/2020-05-24_05_10_41-16238348561408522034?project=apache-beam-testing
Worker logs: https://console.cloud.google.com/dataflow/jobs/us-central1/2020-05-24_05_18_58-11746788212882655147?project=apache-beam-testing
Worker logs: https://console.cloud.google.com/dataflow/jobs/us-central1/2020-05-24_05_27_56-4846534406011784812?project=apache-beam-testing
Worker logs: https://console.cloud.google.com/dataflow/jobs/us-central1/2020-05-24_05_35_38-4295437445490973986?project=apache-beam-testing
Worker logs: https://console.cloud.google.com/dataflow/jobs/us-central1/2020-05-24_05_43_13-16316363139417224440?project=apache-beam-testing
Worker logs: https://console.cloud.google.com/dataflow/jobs/us-central1/2020-05-24_05_51_25-12568199560877116241?project=apache-beam-testing
Worker logs: https://console.cloud.google.com/dataflow/jobs/us-central1/2020-05-24_05_02_44-8219106557517498251?project=apache-beam-testing
Worker logs: https://console.cloud.google.com/dataflow/jobs/us-central1/2020-05-24_05_10_09-5119977007841274264?project=apache-beam-testing
Worker logs: https://console.cloud.google.com/dataflow/jobs/us-central1/2020-05-24_05_18_00-3079786298822422981?project=apache-beam-testing
Worker logs: https://console.cloud.google.com/dataflow/jobs/us-central1/2020-05-24_05_24_56-17629334998584446670?project=apache-beam-testing
Worker logs: https://console.cloud.google.com/dataflow/jobs/us-central1/2020-05-24_05_31_48-5533478061320171823?project=apache-beam-testing
Worker logs: https://console.cloud.google.com/dataflow/jobs/us-central1/2020-05-24_05_39_19-15851369901542206586?project=apache-beam-testing
Worker logs: https://console.cloud.google.com/dataflow/jobs/us-central1/2020-05-24_05_46_48-2308544109131261309?project=apache-beam-testing
Worker logs: https://console.cloud.google.com/dataflow/jobs/us-central1/2020-05-24_05_54_16-14829752764680796667?project=apache-beam-testing
Worker logs: https://console.cloud.google.com/dataflow/jobs/us-central1/2020-05-24_05_02_47-12107173228559219808?project=apache-beam-testing
Worker logs: https://console.cloud.google.com/dataflow/jobs/us-central1/2020-05-24_05_12_56-10717653946375085332?project=apache-beam-testing
Worker logs: https://console.cloud.google.com/dataflow/jobs/us-central1/2020-05-24_05_22_44-12569720047276693678?project=apache-beam-testing
Worker logs: https://console.cloud.google.com/dataflow/jobs/us-central1/2020-05-24_05_29_47-835562124302825115?project=apache-beam-testing
Worker logs: https://console.cloud.google.com/dataflow/jobs/us-central1/2020-05-24_05_36_48-12918673569911976025?project=apache-beam-testing
Worker logs: https://console.cloud.google.com/dataflow/jobs/us-central1/2020-05-24_05_53_05-4722736820341541632?project=apache-beam-testing
----------------------------------------------------------------------
XML: nosetests-postCommitIT-df-py35.xml
----------------------------------------------------------------------
XML: <https://builds.apache.org/job/beam_PostCommit_Python35/ws/src/sdks/python/nosetests.xml>
----------------------------------------------------------------------
Ran 63 tests in 3839.631s
FAILED (SKIP=7, errors=1)
> Task :sdks:python:test-suites:dataflow:py35:postCommitIT FAILED
FAILURE: Build completed with 2 failures.
1: Task failed with an exception.
-----------
* Where:
Script '<https://builds.apache.org/job/beam_PostCommit_Python35/ws/src/sdks/python/test-suites/direct/common.gradle'> line: 48
* What went wrong:
Execution failed for task ':sdks:python:test-suites:direct:py35:postCommitIT'.
> Process 'command 'sh'' finished with non-zero exit value 1
* Try:
Run with --stacktrace option to get the stack trace. Run with --info or --debug option to get more log output. Run with --scan to get full insights.
==============================================================================
2: Task failed with an exception.
-----------
* Where:
Script '<https://builds.apache.org/job/beam_PostCommit_Python35/ws/src/sdks/python/test-suites/dataflow/common.gradle'> line: 50
* What went wrong:
Execution failed for task ':sdks:python:test-suites:dataflow:py35:postCommitIT'.
> Process 'command 'sh'' finished with non-zero exit value 1
* Try:
Run with --stacktrace option to get the stack trace. Run with --info or --debug option to get more log output. Run with --scan to get full insights.
==============================================================================
* Get more help at https://help.gradle.org
Deprecated Gradle features were used in this build, making it incompatible with Gradle 6.0.
Use '--warning-mode all' to show the individual deprecation warnings.
See https://docs.gradle.org/5.2.1/userguide/command_line_interface.html#sec:command_line_warnings
BUILD FAILED in 1h 5m 54s
86 actionable tasks: 63 executed, 23 from cache
Publishing build scan...
https://gradle.com/s/op4qnvapyfgwi
Build step 'Invoke Gradle script' changed build result to FAILURE
Build step 'Invoke Gradle script' marked build as failure
---------------------------------------------------------------------
To unsubscribe, e-mail: builds-unsubscribe@beam.apache.org
For additional commands, e-mail: builds-help@beam.apache.org
Jenkins build is back to normal : beam_PostCommit_Python35 #2489
Posted by Apache Jenkins Server <je...@builds.apache.org>.
See <https://builds.apache.org/job/beam_PostCommit_Python35/2489/display/redirect>
---------------------------------------------------------------------
To unsubscribe, e-mail: builds-unsubscribe@beam.apache.org
For additional commands, e-mail: builds-help@beam.apache.org
Build failed in Jenkins: beam_PostCommit_Python35 #2488
Posted by Apache Jenkins Server <je...@builds.apache.org>.
See <https://builds.apache.org/job/beam_PostCommit_Python35/2488/display/redirect>
Changes:
------------------------------------------
[...truncated 11.00 MB...]
File "<https://builds.apache.org/job/beam_PostCommit_Python35/ws/src/sdks/python/apache_beam/testing/util.py",> line 218, in _matches
hamcrest_assert(actual, contains_inanyorder(*expected_list))
File "/usr/local/lib/python3.5/site-packages/hamcrest/core/assert_that.py", line 44, in assert_that
_assert_match(actual=arg1, matcher=arg2, reason=arg3)
File "/usr/local/lib/python3.5/site-packages/hamcrest/core/assert_that.py", line 60, in _assert_match
raise AssertionError(description)
AssertionError:
Expected: a sequence over [(a sequence containing 'bicycle' and a sequence containing 'dinosaur')] in any order
but: not matched: <['animal', 'land vehicle']>
During handling of the above exception, another exception occurred:
Traceback (most recent call last):
File "/usr/local/lib/python3.5/site-packages/dataflow_worker/batchworker.py", line 647, in do_work
work_executor.execute()
File "/usr/local/lib/python3.5/site-packages/dataflow_worker/executor.py", line 179, in execute
op.start()
File "dataflow_worker/shuffle_operations.py", line 63, in dataflow_worker.shuffle_operations.GroupedShuffleReadOperation.start
File "dataflow_worker/shuffle_operations.py", line 64, in dataflow_worker.shuffle_operations.GroupedShuffleReadOperation.start
File "dataflow_worker/shuffle_operations.py", line 79, in dataflow_worker.shuffle_operations.GroupedShuffleReadOperation.start
File "dataflow_worker/shuffle_operations.py", line 80, in dataflow_worker.shuffle_operations.GroupedShuffleReadOperation.start
File "dataflow_worker/shuffle_operations.py", line 84, in dataflow_worker.shuffle_operations.GroupedShuffleReadOperation.start
File "apache_beam/runners/worker/operations.py", line 332, in apache_beam.runners.worker.operations.Operation.output
File "apache_beam/runners/worker/operations.py", line 195, in apache_beam.runners.worker.operations.SingletonConsumerSet.receive
File "dataflow_worker/shuffle_operations.py", line 261, in dataflow_worker.shuffle_operations.BatchGroupAlsoByWindowsOperation.process
File "dataflow_worker/shuffle_operations.py", line 268, in dataflow_worker.shuffle_operations.BatchGroupAlsoByWindowsOperation.process
File "apache_beam/runners/worker/operations.py", line 332, in apache_beam.runners.worker.operations.Operation.output
File "apache_beam/runners/worker/operations.py", line 195, in apache_beam.runners.worker.operations.SingletonConsumerSet.receive
File "apache_beam/runners/worker/operations.py", line 670, in apache_beam.runners.worker.operations.DoOperation.process
File "apache_beam/runners/worker/operations.py", line 671, in apache_beam.runners.worker.operations.DoOperation.process
File "apache_beam/runners/common.py", line 963, in apache_beam.runners.common.DoFnRunner.process
File "apache_beam/runners/common.py", line 1030, in apache_beam.runners.common.DoFnRunner._reraise_augmented
File "apache_beam/runners/common.py", line 961, in apache_beam.runners.common.DoFnRunner.process
File "apache_beam/runners/common.py", line 726, in apache_beam.runners.common.PerWindowInvoker.invoke_process
File "apache_beam/runners/common.py", line 812, in apache_beam.runners.common.PerWindowInvoker._invoke_process_per_window
File "apache_beam/runners/common.py", line 1122, in apache_beam.runners.common._OutputProcessor.process_outputs
File "apache_beam/runners/worker/operations.py", line 195, in apache_beam.runners.worker.operations.SingletonConsumerSet.receive
File "apache_beam/runners/worker/operations.py", line 670, in apache_beam.runners.worker.operations.DoOperation.process
File "apache_beam/runners/worker/operations.py", line 671, in apache_beam.runners.worker.operations.DoOperation.process
File "apache_beam/runners/common.py", line 963, in apache_beam.runners.common.DoFnRunner.process
File "apache_beam/runners/common.py", line 1030, in apache_beam.runners.common.DoFnRunner._reraise_augmented
File "apache_beam/runners/common.py", line 961, in apache_beam.runners.common.DoFnRunner.process
File "apache_beam/runners/common.py", line 553, in apache_beam.runners.common.SimpleInvoker.invoke_process
File "apache_beam/runners/common.py", line 1122, in apache_beam.runners.common._OutputProcessor.process_outputs
File "apache_beam/runners/worker/operations.py", line 195, in apache_beam.runners.worker.operations.SingletonConsumerSet.receive
File "apache_beam/runners/worker/operations.py", line 670, in apache_beam.runners.worker.operations.DoOperation.process
File "apache_beam/runners/worker/operations.py", line 671, in apache_beam.runners.worker.operations.DoOperation.process
File "apache_beam/runners/common.py", line 963, in apache_beam.runners.common.DoFnRunner.process
File "apache_beam/runners/common.py", line 1045, in apache_beam.runners.common.DoFnRunner._reraise_augmented
File "/usr/local/lib/python3.5/site-packages/future/utils/__init__.py", line 446, in raise_with_traceback
raise exc.with_traceback(traceback)
File "apache_beam/runners/common.py", line 961, in apache_beam.runners.common.DoFnRunner.process
File "apache_beam/runners/common.py", line 554, in apache_beam.runners.common.SimpleInvoker.invoke_process
File "<https://builds.apache.org/job/beam_PostCommit_Python35/ws/src/sdks/python/apache_beam/transforms/core.py",> line 1511, in <lambda>
wrapper = lambda x: [fn(x)]
File "<https://builds.apache.org/job/beam_PostCommit_Python35/ws/src/sdks/python/apache_beam/testing/util.py",> line 218, in _matches
hamcrest_assert(actual, contains_inanyorder(*expected_list))
File "/usr/local/lib/python3.5/site-packages/hamcrest/core/assert_that.py", line 44, in assert_that
_assert_match(actual=arg1, matcher=arg2, reason=arg3)
File "/usr/local/lib/python3.5/site-packages/hamcrest/core/assert_that.py", line 60, in _assert_match
raise AssertionError(description)
RuntimeError: AssertionError:
Expected: a sequence over [(a sequence containing 'bicycle' and a sequence containing 'dinosaur')] in any order
but: not matched: <['animal', 'land vehicle']> [while running 'assert_that/Match']
apache_beam.runners.dataflow.dataflow_runner: INFO: 2020-05-24T18:56:48.605Z: JOB_MESSAGE_ERROR: Traceback (most recent call last):
File "apache_beam/runners/common.py", line 961, in apache_beam.runners.common.DoFnRunner.process
File "apache_beam/runners/common.py", line 554, in apache_beam.runners.common.SimpleInvoker.invoke_process
File "<https://builds.apache.org/job/beam_PostCommit_Python35/ws/src/sdks/python/apache_beam/transforms/core.py",> line 1511, in <lambda>
wrapper = lambda x: [fn(x)]
File "<https://builds.apache.org/job/beam_PostCommit_Python35/ws/src/sdks/python/apache_beam/testing/util.py",> line 218, in _matches
hamcrest_assert(actual, contains_inanyorder(*expected_list))
File "/usr/local/lib/python3.5/site-packages/hamcrest/core/assert_that.py", line 44, in assert_that
_assert_match(actual=arg1, matcher=arg2, reason=arg3)
File "/usr/local/lib/python3.5/site-packages/hamcrest/core/assert_that.py", line 60, in _assert_match
raise AssertionError(description)
AssertionError:
Expected: a sequence over [(a sequence containing 'bicycle' and a sequence containing 'dinosaur')] in any order
but: not matched: <['animal', 'land vehicle']>
During handling of the above exception, another exception occurred:
Traceback (most recent call last):
File "/usr/local/lib/python3.5/site-packages/dataflow_worker/batchworker.py", line 647, in do_work
work_executor.execute()
File "/usr/local/lib/python3.5/site-packages/dataflow_worker/executor.py", line 179, in execute
op.start()
File "dataflow_worker/shuffle_operations.py", line 63, in dataflow_worker.shuffle_operations.GroupedShuffleReadOperation.start
File "dataflow_worker/shuffle_operations.py", line 64, in dataflow_worker.shuffle_operations.GroupedShuffleReadOperation.start
File "dataflow_worker/shuffle_operations.py", line 79, in dataflow_worker.shuffle_operations.GroupedShuffleReadOperation.start
File "dataflow_worker/shuffle_operations.py", line 80, in dataflow_worker.shuffle_operations.GroupedShuffleReadOperation.start
File "dataflow_worker/shuffle_operations.py", line 84, in dataflow_worker.shuffle_operations.GroupedShuffleReadOperation.start
File "apache_beam/runners/worker/operations.py", line 332, in apache_beam.runners.worker.operations.Operation.output
File "apache_beam/runners/worker/operations.py", line 195, in apache_beam.runners.worker.operations.SingletonConsumerSet.receive
File "dataflow_worker/shuffle_operations.py", line 261, in dataflow_worker.shuffle_operations.BatchGroupAlsoByWindowsOperation.process
File "dataflow_worker/shuffle_operations.py", line 268, in dataflow_worker.shuffle_operations.BatchGroupAlsoByWindowsOperation.process
File "apache_beam/runners/worker/operations.py", line 332, in apache_beam.runners.worker.operations.Operation.output
File "apache_beam/runners/worker/operations.py", line 195, in apache_beam.runners.worker.operations.SingletonConsumerSet.receive
File "apache_beam/runners/worker/operations.py", line 670, in apache_beam.runners.worker.operations.DoOperation.process
File "apache_beam/runners/worker/operations.py", line 671, in apache_beam.runners.worker.operations.DoOperation.process
File "apache_beam/runners/common.py", line 963, in apache_beam.runners.common.DoFnRunner.process
File "apache_beam/runners/common.py", line 1030, in apache_beam.runners.common.DoFnRunner._reraise_augmented
File "apache_beam/runners/common.py", line 961, in apache_beam.runners.common.DoFnRunner.process
File "apache_beam/runners/common.py", line 726, in apache_beam.runners.common.PerWindowInvoker.invoke_process
File "apache_beam/runners/common.py", line 812, in apache_beam.runners.common.PerWindowInvoker._invoke_process_per_window
File "apache_beam/runners/common.py", line 1122, in apache_beam.runners.common._OutputProcessor.process_outputs
File "apache_beam/runners/worker/operations.py", line 195, in apache_beam.runners.worker.operations.SingletonConsumerSet.receive
File "apache_beam/runners/worker/operations.py", line 670, in apache_beam.runners.worker.operations.DoOperation.process
File "apache_beam/runners/worker/operations.py", line 671, in apache_beam.runners.worker.operations.DoOperation.process
File "apache_beam/runners/common.py", line 963, in apache_beam.runners.common.DoFnRunner.process
File "apache_beam/runners/common.py", line 1030, in apache_beam.runners.common.DoFnRunner._reraise_augmented
File "apache_beam/runners/common.py", line 961, in apache_beam.runners.common.DoFnRunner.process
File "apache_beam/runners/common.py", line 553, in apache_beam.runners.common.SimpleInvoker.invoke_process
File "apache_beam/runners/common.py", line 1122, in apache_beam.runners.common._OutputProcessor.process_outputs
File "apache_beam/runners/worker/operations.py", line 195, in apache_beam.runners.worker.operations.SingletonConsumerSet.receive
File "apache_beam/runners/worker/operations.py", line 670, in apache_beam.runners.worker.operations.DoOperation.process
File "apache_beam/runners/worker/operations.py", line 671, in apache_beam.runners.worker.operations.DoOperation.process
File "apache_beam/runners/common.py", line 963, in apache_beam.runners.common.DoFnRunner.process
File "apache_beam/runners/common.py", line 1045, in apache_beam.runners.common.DoFnRunner._reraise_augmented
File "/usr/local/lib/python3.5/site-packages/future/utils/__init__.py", line 446, in raise_with_traceback
raise exc.with_traceback(traceback)
File "apache_beam/runners/common.py", line 961, in apache_beam.runners.common.DoFnRunner.process
File "apache_beam/runners/common.py", line 554, in apache_beam.runners.common.SimpleInvoker.invoke_process
File "<https://builds.apache.org/job/beam_PostCommit_Python35/ws/src/sdks/python/apache_beam/transforms/core.py",> line 1511, in <lambda>
wrapper = lambda x: [fn(x)]
File "<https://builds.apache.org/job/beam_PostCommit_Python35/ws/src/sdks/python/apache_beam/testing/util.py",> line 218, in _matches
hamcrest_assert(actual, contains_inanyorder(*expected_list))
File "/usr/local/lib/python3.5/site-packages/hamcrest/core/assert_that.py", line 44, in assert_that
_assert_match(actual=arg1, matcher=arg2, reason=arg3)
File "/usr/local/lib/python3.5/site-packages/hamcrest/core/assert_that.py", line 60, in _assert_match
raise AssertionError(description)
RuntimeError: AssertionError:
Expected: a sequence over [(a sequence containing 'bicycle' and a sequence containing 'dinosaur')] in any order
but: not matched: <['animal', 'land vehicle']> [while running 'assert_that/Match']
apache_beam.runners.dataflow.dataflow_runner: INFO: 2020-05-24T18:56:48.633Z: JOB_MESSAGE_BASIC: Finished operation assert_that/Group/GroupByKey/Read+assert_that/Group/GroupByKey/GroupByWindow+assert_that/Group/Map(_merge_tagged_vals_under_key)+assert_that/Unkey+assert_that/Match
apache_beam.runners.dataflow.dataflow_runner: INFO: 2020-05-24T18:56:48.719Z: JOB_MESSAGE_DEBUG: Executing failure step failure40
apache_beam.runners.dataflow.dataflow_runner: INFO: 2020-05-24T18:56:48.759Z: JOB_MESSAGE_ERROR: Workflow failed. Causes: S10:assert_that/Group/GroupByKey/Read+assert_that/Group/GroupByKey/GroupByWindow+assert_that/Group/Map(_merge_tagged_vals_under_key)+assert_that/Unkey+assert_that/Match failed., The job failed because a work item has failed 4 times. Look in previous log entries for the cause of each one of the 4 failures. For more information, see https://cloud.google.com/dataflow/docs/guides/common-errors. The work item was attempted on these workers:
beamapp-jenkins-052418494-05241149-625k-harness-m22j
Root cause: Work item failed.,
beamapp-jenkins-052418494-05241149-625k-harness-m22j
Root cause: Work item failed.,
beamapp-jenkins-052418494-05241149-625k-harness-m22j
Root cause: Work item failed.,
beamapp-jenkins-052418494-05241149-625k-harness-m22j
Root cause: Work item failed.
apache_beam.runners.dataflow.dataflow_runner: INFO: 2020-05-24T18:56:48.894Z: JOB_MESSAGE_DETAILED: Cleaning up.
apache_beam.runners.dataflow.dataflow_runner: INFO: 2020-05-24T18:56:48.957Z: JOB_MESSAGE_DEBUG: Starting worker pool teardown.
apache_beam.runners.dataflow.dataflow_runner: INFO: 2020-05-24T18:56:48.993Z: JOB_MESSAGE_BASIC: Stopping worker pool...
apache_beam.runners.dataflow.dataflow_runner: INFO: 2020-05-24T18:57:31.709Z: JOB_MESSAGE_DETAILED: Autoscaling: Resized worker pool from 1 to 0.
apache_beam.runners.dataflow.dataflow_runner: INFO: 2020-05-24T18:57:31.758Z: JOB_MESSAGE_BASIC: Worker pool stopped.
apache_beam.runners.dataflow.dataflow_runner: INFO: 2020-05-24T18:57:31.798Z: JOB_MESSAGE_DEBUG: Tearing down pending resources...
apache_beam.runners.dataflow.dataflow_runner: INFO: Job 2020-05-24_11_49_54-7716705715491484889 is in state JOB_STATE_FAILED
--------------------- >> end captured logging << ---------------------
Worker logs: https://console.cloud.google.com/dataflow/jobs/us-central1/2020-05-24_11_02_48-8395966994420642043?project=apache-beam-testing
Worker logs: https://console.cloud.google.com/dataflow/jobs/us-central1/2020-05-24_11_16_13-2769162171213588859?project=apache-beam-testing
Worker logs: https://console.cloud.google.com/dataflow/jobs/us-central1/2020-05-24_11_23_05-510121697055298312?project=apache-beam-testing
Worker logs: https://console.cloud.google.com/dataflow/jobs/us-central1/2020-05-24_11_30_09-7706515217070108169?project=apache-beam-testing
Worker logs: https://console.cloud.google.com/dataflow/jobs/us-central1/2020-05-24_11_38_17-11038536770137289292?project=apache-beam-testing
Worker logs: https://console.cloud.google.com/dataflow/jobs/us-central1/2020-05-24_11_45_32-9409212574881171546?project=apache-beam-testing
Worker logs: https://console.cloud.google.com/dataflow/jobs/us-central1/2020-05-24_11_53_11-2461162679701186269?project=apache-beam-testing
Worker logs: https://console.cloud.google.com/dataflow/jobs/us-central1/2020-05-24_11_02_45-2472546178892800815?project=apache-beam-testing
Worker logs: https://console.cloud.google.com/dataflow/jobs/us-central1/2020-05-24_11_25_04-6820684758088802210?project=apache-beam-testing
Worker logs: https://console.cloud.google.com/dataflow/jobs/us-central1/2020-05-24_11_31_59-13431907284166397757?project=apache-beam-testing
Worker logs: https://console.cloud.google.com/dataflow/jobs/us-central1/2020-05-24_11_38_55-8899037527371028422?project=apache-beam-testing
Worker logs: https://console.cloud.google.com/dataflow/jobs/us-central1/2020-05-24_11_45_27-6151190347035026695?project=apache-beam-testing
Worker logs: https://console.cloud.google.com/dataflow/jobs/us-central1/2020-05-24_11_52_13-13511522492591271816?project=apache-beam-testing
Worker logs: https://console.cloud.google.com/dataflow/jobs/us-central1/2020-05-24_11_02_47-493010554026338948?project=apache-beam-testing
Worker logs: https://console.cloud.google.com/dataflow/jobs/us-central1/2020-05-24_11_14_06-13615393630858625560?project=apache-beam-testing
Worker logs: https://console.cloud.google.com/dataflow/jobs/us-central1/2020-05-24_11_21_24-7708305653737691902?project=apache-beam-testing
Worker logs: https://console.cloud.google.com/dataflow/jobs/us-central1/2020-05-24_11_28_17-11921890831639415281?project=apache-beam-testing
Worker logs: https://console.cloud.google.com/dataflow/jobs/us-central1/2020-05-24_11_35_28-7121484227128938795?project=apache-beam-testing
Worker logs: https://console.cloud.google.com/dataflow/jobs/us-central1/2020-05-24_11_42_43-16243150087664327956?project=apache-beam-testing
Worker logs: https://console.cloud.google.com/dataflow/jobs/us-central1/2020-05-24_11_50_24-5618499967441829254?project=apache-beam-testing
Worker logs: https://console.cloud.google.com/dataflow/jobs/us-central1/2020-05-24_11_02_44-5497367776504609988?project=apache-beam-testing
Worker logs: https://console.cloud.google.com/dataflow/jobs/us-central1/2020-05-24_11_20_22-14371339198073162324?project=apache-beam-testing
Worker logs: https://console.cloud.google.com/dataflow/jobs/us-central1/2020-05-24_11_27_46-8378004220245395878?project=apache-beam-testing
Worker logs: https://console.cloud.google.com/dataflow/jobs/us-central1/2020-05-24_11_35_10-14878306813045082065?project=apache-beam-testing
Worker logs: https://console.cloud.google.com/dataflow/jobs/us-central1/2020-05-24_11_42_46-5434790828188046930?project=apache-beam-testing
Worker logs: https://console.cloud.google.com/dataflow/jobs/us-central1/2020-05-24_11_49_38-7881393487944584707?project=apache-beam-testing
Worker logs: https://console.cloud.google.com/dataflow/jobs/us-central1/2020-05-24_11_02_45-17064900354640934428?project=apache-beam-testing
Worker logs: https://console.cloud.google.com/dataflow/jobs/us-central1/2020-05-24_11_10_23-18232346799357918095?project=apache-beam-testing
Worker logs: https://console.cloud.google.com/dataflow/jobs/us-central1/2020-05-24_11_18_17-9152053345566746104?project=apache-beam-testing
Worker logs: https://console.cloud.google.com/dataflow/jobs/us-central1/2020-05-24_11_25_30-8790922068388569741?project=apache-beam-testing
Worker logs: https://console.cloud.google.com/dataflow/jobs/us-central1/2020-05-24_11_32_15-6171928272060781203?project=apache-beam-testing
Worker logs: https://console.cloud.google.com/dataflow/jobs/us-central1/2020-05-24_11_39_03-13974106279280653952?project=apache-beam-testing
Worker logs: https://console.cloud.google.com/dataflow/jobs/us-central1/2020-05-24_11_46_00-10071007413144584068?project=apache-beam-testing
Worker logs: https://console.cloud.google.com/dataflow/jobs/us-central1/2020-05-24_11_52_43-1118686646074147191?project=apache-beam-testing
Worker logs: https://console.cloud.google.com/dataflow/jobs/us-central1/2020-05-24_11_02_44-599071668873205456?project=apache-beam-testing
Worker logs: https://console.cloud.google.com/dataflow/jobs/us-central1/2020-05-24_11_09_47-16141465998800029672?project=apache-beam-testing
Worker logs: https://console.cloud.google.com/dataflow/jobs/us-central1/2020-05-24_11_17_27-16799217220592174826?project=apache-beam-testing
Worker logs: https://console.cloud.google.com/dataflow/jobs/us-central1/2020-05-24_11_24_25-10116463389050860372?project=apache-beam-testing
Worker logs: https://console.cloud.google.com/dataflow/jobs/us-central1/2020-05-24_11_31_34-16775781985304389440?project=apache-beam-testing
Worker logs: https://console.cloud.google.com/dataflow/jobs/us-central1/2020-05-24_11_39_05-1750936819184785515?project=apache-beam-testing
Worker logs: https://console.cloud.google.com/dataflow/jobs/us-central1/2020-05-24_11_46_48-1513986153977372677?project=apache-beam-testing
Worker logs: https://console.cloud.google.com/dataflow/jobs/us-central1/2020-05-24_11_02_44-5081335558370946933?project=apache-beam-testing
Worker logs: https://console.cloud.google.com/dataflow/jobs/us-central1/2020-05-24_11_10_29-6612293173489327315?project=apache-beam-testing
Worker logs: https://console.cloud.google.com/dataflow/jobs/us-central1/2020-05-24_11_18_26-9235784212026040966?project=apache-beam-testing
Worker logs: https://console.cloud.google.com/dataflow/jobs/us-central1/2020-05-24_11_26_45-14816733653582292802?project=apache-beam-testing
Worker logs: https://console.cloud.google.com/dataflow/jobs/us-central1/2020-05-24_11_34_00-9421640794187055769?project=apache-beam-testing
Worker logs: https://console.cloud.google.com/dataflow/jobs/us-central1/2020-05-24_11_41_57-2743604333298697971?project=apache-beam-testing
Worker logs: https://console.cloud.google.com/dataflow/jobs/us-central1/2020-05-24_11_49_54-7716705715491484889?project=apache-beam-testing
Worker logs: https://console.cloud.google.com/dataflow/jobs/us-central1/2020-05-24_11_02_45-4170738897674915937?project=apache-beam-testing
Worker logs: https://console.cloud.google.com/dataflow/jobs/us-central1/2020-05-24_11_11_32-10819213412343672168?project=apache-beam-testing
Worker logs: https://console.cloud.google.com/dataflow/jobs/us-central1/2020-05-24_11_21_16-1739093817783525559?project=apache-beam-testing
Worker logs: https://console.cloud.google.com/dataflow/jobs/us-central1/2020-05-24_11_28_19-1731707251933703050?project=apache-beam-testing
Worker logs: https://console.cloud.google.com/dataflow/jobs/us-central1/2020-05-24_11_35_15-2967446228704959662?project=apache-beam-testing
Worker logs: https://console.cloud.google.com/dataflow/jobs/us-central1/2020-05-24_11_51_39-13201087886071228780?project=apache-beam-testing
Worker logs: https://console.cloud.google.com/dataflow/jobs/us-central1/2020-05-24_11_58_30-10917613220693875773?project=apache-beam-testing
----------------------------------------------------------------------
XML: nosetests-postCommitIT-df-py35.xml
----------------------------------------------------------------------
XML: <https://builds.apache.org/job/beam_PostCommit_Python35/ws/src/sdks/python/nosetests.xml>
----------------------------------------------------------------------
Ran 63 tests in 3807.659s
FAILED (SKIP=7, errors=1)
> Task :sdks:python:test-suites:dataflow:py35:postCommitIT FAILED
FAILURE: Build failed with an exception.
* Where:
Script '<https://builds.apache.org/job/beam_PostCommit_Python35/ws/src/sdks/python/test-suites/dataflow/common.gradle'> line: 50
* What went wrong:
Execution failed for task ':sdks:python:test-suites:dataflow:py35:postCommitIT'.
> Process 'command 'sh'' finished with non-zero exit value 1
* Try:
Run with --stacktrace option to get the stack trace. Run with --info or --debug option to get more log output. Run with --scan to get full insights.
* Get more help at https://help.gradle.org
Deprecated Gradle features were used in this build, making it incompatible with Gradle 6.0.
Use '--warning-mode all' to show the individual deprecation warnings.
See https://docs.gradle.org/5.2.1/userguide/command_line_interface.html#sec:command_line_warnings
BUILD FAILED in 1h 5m 18s
86 actionable tasks: 63 executed, 23 from cache
Publishing build scan...
https://gradle.com/s/hlt52nmbieqsi
Build step 'Invoke Gradle script' changed build result to FAILURE
Build step 'Invoke Gradle script' marked build as failure
---------------------------------------------------------------------
To unsubscribe, e-mail: builds-unsubscribe@beam.apache.org
For additional commands, e-mail: builds-help@beam.apache.org