You are viewing a plain text version of this content. The canonical link for it is here.
Posted to builds@beam.apache.org by Apache Jenkins Server <je...@builds.apache.org> on 2023/02/27 05:54:45 UTC

Build failed in Jenkins: beam_PostCommit_Python37 #6378

See <https://ci-beam.apache.org/job/beam_PostCommit_Python37/6378/display/redirect>

Changes:


------------------------------------------
[...truncated 17.21 MB...]

apache_beam/dataframe/io_it_test.py: 2 warnings
apache_beam/io/gcp/bigquery_json_it_test.py: 1 warning
apache_beam/io/gcp/bigquery_read_it_test.py: 9 warnings
  <https://ci-beam.apache.org/job/beam_PostCommit_Python37/ws/src/sdks/python/apache_beam/io/gcp/bigquery.py>:2557: BeamDeprecationWarning: options is deprecated since First stable release. References to <pipeline>.options will not be supported
    | _PassThroughThenCleanupTempDatasets(project_to_cleanup_pcoll))

apache_beam/examples/dataframe/flight_delays_it_test.py::FlightDelaysTest::test_flight_delays
  <https://ci-beam.apache.org/job/beam_PostCommit_Python37/ws/src/sdks/python/apache_beam/examples/dataframe/flight_delays.py>:47: FutureWarning: Dropping of nuisance columns in DataFrame reductions (with 'numeric_only=None') is deprecated; in a future version this will raise TypeError.  Select only valid columns before calling the reduction.
    return airline_df[at_top_airports].mean()

apache_beam/examples/dataframe/flight_delays_it_test.py::FlightDelaysTest::test_flight_delays
apache_beam/examples/dataframe/taxiride_it_test.py::TaxirideIT::test_aggregation
apache_beam/examples/dataframe/taxiride_it_test.py::TaxirideIT::test_enrich
  <https://ci-beam.apache.org/job/beam_PostCommit_Python37/ws/src/sdks/python/apache_beam/dataframe/io.py>:664: FutureWarning: WriteToFiles is experimental.
    sink=lambda _: _WriteToPandasFileSink(

apache_beam/examples/dataframe/flight_delays_it_test.py::FlightDelaysTest::test_flight_delays
apache_beam/examples/dataframe/taxiride_it_test.py::TaxirideIT::test_aggregation
apache_beam/examples/dataframe/taxiride_it_test.py::TaxirideIT::test_enrich
  <https://ci-beam.apache.org/job/beam_PostCommit_Python37/ws/src/sdks/python/apache_beam/io/fileio.py>:593: BeamDeprecationWarning: options is deprecated since First stable release. References to <pipeline>.options will not be supported
    p.options.view_as(GoogleCloudOptions).temp_location or

apache_beam/io/gcp/bigquery_test.py::BigQueryStreamingInsertTransformIntegrationTests::test_multiple_destinations_transform
  <https://ci-beam.apache.org/job/beam_PostCommit_Python37/ws/src/sdks/python/apache_beam/io/gcp/bigquery_test.py>:1690: BeamDeprecationWarning: options is deprecated since First stable release. References to <pipeline>.options will not be supported
    streaming = self.test_pipeline.options.view_as(StandardOptions).streaming

apache_beam/io/gcp/bigquery_read_it_test.py::ReadTests::test_native_source
  <https://ci-beam.apache.org/job/beam_PostCommit_Python37/ws/src/sdks/python/apache_beam/io/gcp/bigquery_read_it_test.py>:170: BeamDeprecationWarning: BigQuerySource is deprecated since 2.25.0. Use ReadFromBigQuery instead.
    beam.io.BigQuerySource(query=self.query, use_standard_sql=True)))

apache_beam/ml/inference/sklearn_inference_it_test.py::SklearnInference::test_sklearn_regression
  <https://ci-beam.apache.org/job/beam_PostCommit_Python37/ws/src/sdks/python/apache_beam/examples/inference/sklearn_japanese_housing_regression.py>:129: FutureWarning: SklearnModelHandlerPandas is experimental. No backwards-compatibility guarantees.
    model_file_type=ModelFileType.PICKLE, model_uri=model_filename)

apache_beam/ml/inference/sklearn_inference_it_test.py::SklearnInference::test_sklearn_regression
  <https://ci-beam.apache.org/job/beam_PostCommit_Python37/ws/src/build/gradleenv/-1734967052/lib/python3.7/site-packages/dill/_dill.py>:472: FutureWarning: SklearnModelHandlerPandas is experimental. No backwards-compatibility guarantees.
    obj = StockUnpickler.load(self)

apache_beam/ml/gcp/cloud_dlp_it_test.py::CloudDLPIT::test_deidentification
  <https://ci-beam.apache.org/job/beam_PostCommit_Python37/ws/src/sdks/python/apache_beam/ml/gcp/cloud_dlp_it_test.py>:77: FutureWarning: MaskDetectedDetails is experimental.
    inspection_config=INSPECT_CONFIG))

apache_beam/ml/gcp/cloud_dlp_it_test.py::CloudDLPIT::test_inspection
  <https://ci-beam.apache.org/job/beam_PostCommit_Python37/ws/src/sdks/python/apache_beam/ml/gcp/cloud_dlp_it_test.py>:87: FutureWarning: InspectForDetails is experimental.
    | beam.ParDo(extract_inspection_results).with_outputs(

apache_beam/io/gcp/bigquery_read_it_test.py::ReadNewTypesTests::test_native_source
  <https://ci-beam.apache.org/job/beam_PostCommit_Python37/ws/src/sdks/python/apache_beam/io/gcp/bigquery_read_it_test.py>:693: BeamDeprecationWarning: BigQuerySource is deprecated since 2.25.0. Use ReadFromBigQuery instead.
    beam.io.BigQuerySource(query=self.query, use_standard_sql=True)))

apache_beam/io/gcp/bigquery_read_it_test.py::ReadAllBQTests::test_read_queries
  <https://ci-beam.apache.org/job/beam_PostCommit_Python37/ws/src/sdks/python/apache_beam/io/gcp/bigquery_read_it_test.py>:808: FutureWarning: ReadAllFromBigQuery is experimental.
    | beam.io.ReadAllFromBigQuery())

apache_beam/io/gcp/bigquery_read_it_test.py::ReadAllBQTests::test_read_queries
  <https://ci-beam.apache.org/job/beam_PostCommit_Python37/ws/src/sdks/python/apache_beam/io/gcp/bigquery.py>:2658: BeamDeprecationWarning: options is deprecated since First stable release. References to <pipeline>.options will not be supported
    job_name = pcoll.pipeline.options.view_as(GoogleCloudOptions).job_name

apache_beam/io/gcp/bigquery_read_it_test.py::ReadAllBQTests::test_read_queries
  <https://ci-beam.apache.org/job/beam_PostCommit_Python37/ws/src/sdks/python/apache_beam/io/gcp/bigquery.py>:2659: BeamDeprecationWarning: options is deprecated since First stable release. References to <pipeline>.options will not be supported
    project = pcoll.pipeline.options.view_as(GoogleCloudOptions).project

apache_beam/io/gcp/bigquery_read_it_test.py::ReadAllBQTests::test_read_queries
  <https://ci-beam.apache.org/job/beam_PostCommit_Python37/ws/src/sdks/python/apache_beam/io/gcp/bigquery.py>:2672: BeamDeprecationWarning: options is deprecated since First stable release. References to <pipeline>.options will not be supported
    options=pcoll.pipeline.options,

-- Docs: https://docs.pytest.org/en/stable/how-to/capture-warnings.html
- generated xml file: <https://ci-beam.apache.org/job/beam_PostCommit_Python37/ws/src/sdks/python/pytest_postCommitIT-df-py37.xml> -
========== 85 passed, 28 skipped, 576 warnings in 14251.84s (3:57:31) ==========

> Task :sdks:python:test-suites:dataflow:py37:spannerioIT
>>> RUNNING integration tests with pipeline options: --runner=TestDataflowRunner --project=apache-beam-testing --region=us-central1 --staging_location=gs://temp-storage-for-end-to-end-tests/staging-it --temp_location=gs://temp-storage-for-end-to-end-tests/temp-it --output=gs://temp-storage-for-end-to-end-tests/py-it-cloud/output --sdk_location=<https://ci-beam.apache.org/job/beam_PostCommit_Python37/ws/src/sdks/python/build/apache-beam.tar.gz> --requirements_file=postcommit_requirements.txt --num_workers=1 --sleep_secs=20 --kms_key_name=projects/apache-beam-testing/locations/global/keyRings/beam-it/cryptoKeys/test --dataflow_kms_key=projects/apache-beam-testing/locations/global/keyRings/beam-it/cryptoKeys/test
>>>   pytest options: --capture=no --timeout=4500 --color=yes --log-cli-level=INFO --numprocesses=8 --dist=loadfile
>>>   collect markers: -m=spannerio_it
============================= test session starts ==============================
platform linux -- Python 3.7.12, pytest-7.2.1, pluggy-1.0.0
rootdir: <https://ci-beam.apache.org/job/beam_PostCommit_Python37/ws/src/sdks/python,> configfile: pytest.ini
plugins: xdist-2.5.0, timeout-2.1.0, forked-1.6.0, hypothesis-6.68.2, requests-mock-1.10.0
timeout: 4500.0s
timeout method: signal
timeout func_only: False
gw0 I / gw1 I / gw2 I / gw3 I / gw4 I / gw5 I / gw6 I / gw7 I
[gw0] Python 3.7.12 (default, Jan 15 2022, 18:42:10)  -- [GCC 9.3.0]
[gw1] Python 3.7.12 (default, Jan 15 2022, 18:42:10)  -- [GCC 9.3.0]
[gw2] Python 3.7.12 (default, Jan 15 2022, 18:42:10)  -- [GCC 9.3.0]
[gw3] Python 3.7.12 (default, Jan 15 2022, 18:42:10)  -- [GCC 9.3.0]
[gw5] Python 3.7.12 (default, Jan 15 2022, 18:42:10)  -- [GCC 9.3.0]
[gw6] Python 3.7.12 (default, Jan 15 2022, 18:42:10)  -- [GCC 9.3.0]
[gw4] Python 3.7.12 (default, Jan 15 2022, 18:42:10)  -- [GCC 9.3.0]
[gw7] Python 3.7.12 (default, Jan 15 2022, 18:42:10)  -- [GCC 9.3.0]
gw0 [15] / gw1 [15] / gw2 [15] / gw3 [15] / gw4 [15] / gw5 [15] / gw6 [15] / gw7 [15]

scheduling tests via LoadFileScheduling

apache_beam/io/gcp/experimental/spannerio_write_it_test.py::SpannerWriteIntegrationTest::test_metrics_error_call 
apache_beam/io/gcp/experimental/spannerio_read_it_test.py::SpannerReadIntegrationTest::test_read_via_sql 
[gw1] SKIPPED apache_beam/io/gcp/experimental/spannerio_write_it_test.py::SpannerWriteIntegrationTest::test_metrics_error_call 
apache_beam/io/gcp/experimental/spannerio_write_it_test.py::SpannerWriteIntegrationTest::test_metrics_ok_call 
[gw1] SKIPPED apache_beam/io/gcp/experimental/spannerio_write_it_test.py::SpannerWriteIntegrationTest::test_metrics_ok_call 
apache_beam/io/gcp/experimental/spannerio_write_it_test.py::SpannerWriteIntegrationTest::test_spanner_error 
[gw1] PASSED apache_beam/io/gcp/experimental/spannerio_write_it_test.py::SpannerWriteIntegrationTest::test_spanner_error 
apache_beam/io/gcp/experimental/spannerio_write_it_test.py::SpannerWriteIntegrationTest::test_spanner_update 
[gw0] PASSED apache_beam/io/gcp/experimental/spannerio_read_it_test.py::SpannerReadIntegrationTest::test_read_via_sql 
apache_beam/io/gcp/experimental/spannerio_read_it_test.py::SpannerReadIntegrationTest::test_read_via_table 
[gw1] PASSED apache_beam/io/gcp/experimental/spannerio_write_it_test.py::SpannerWriteIntegrationTest::test_spanner_update 
apache_beam/io/gcp/experimental/spannerio_write_it_test.py::SpannerWriteIntegrationTest::test_write_batches 
[gw0] PASSED apache_beam/io/gcp/experimental/spannerio_read_it_test.py::SpannerReadIntegrationTest::test_read_via_table 
apache_beam/io/gcp/experimental/spannerio_read_it_test.py::SpannerReadIntegrationTest::test_sql_metrics_error_call 
[gw0] SKIPPED apache_beam/io/gcp/experimental/spannerio_read_it_test.py::SpannerReadIntegrationTest::test_sql_metrics_error_call 
apache_beam/io/gcp/experimental/spannerio_read_it_test.py::SpannerReadIntegrationTest::test_sql_metrics_ok_call 
[gw0] SKIPPED apache_beam/io/gcp/experimental/spannerio_read_it_test.py::SpannerReadIntegrationTest::test_sql_metrics_ok_call 
apache_beam/io/gcp/experimental/spannerio_read_it_test.py::SpannerReadIntegrationTest::test_table_metrics_error_call 
[gw0] SKIPPED apache_beam/io/gcp/experimental/spannerio_read_it_test.py::SpannerReadIntegrationTest::test_table_metrics_error_call 
apache_beam/io/gcp/experimental/spannerio_read_it_test.py::SpannerReadIntegrationTest::test_table_metrics_ok_call 
[gw0] SKIPPED apache_beam/io/gcp/experimental/spannerio_read_it_test.py::SpannerReadIntegrationTest::test_table_metrics_ok_call 
apache_beam/io/gcp/experimental/spannerio_read_it_test.py::SpannerReadIntegrationTest::test_transaction_sql_metrics_error_call 
[gw0] SKIPPED apache_beam/io/gcp/experimental/spannerio_read_it_test.py::SpannerReadIntegrationTest::test_transaction_sql_metrics_error_call 
apache_beam/io/gcp/experimental/spannerio_read_it_test.py::SpannerReadIntegrationTest::test_transaction_sql_metrics_ok_call 
[gw0] SKIPPED apache_beam/io/gcp/experimental/spannerio_read_it_test.py::SpannerReadIntegrationTest::test_transaction_sql_metrics_ok_call 
apache_beam/io/gcp/experimental/spannerio_read_it_test.py::SpannerReadIntegrationTest::test_transaction_table_metrics_error_call 
[gw0] SKIPPED apache_beam/io/gcp/experimental/spannerio_read_it_test.py::SpannerReadIntegrationTest::test_transaction_table_metrics_error_call 
apache_beam/io/gcp/experimental/spannerio_read_it_test.py::SpannerReadIntegrationTest::test_transaction_table_metrics_ok_call 
[gw0] SKIPPED apache_beam/io/gcp/experimental/spannerio_read_it_test.py::SpannerReadIntegrationTest::test_transaction_table_metrics_ok_call 
[gw1] PASSED apache_beam/io/gcp/experimental/spannerio_write_it_test.py::SpannerWriteIntegrationTest::test_write_batches 

=============================== warnings summary ===============================
../../build/gradleenv/-1734967052/lib/python3.7/site-packages/hdfs/config.py:15
../../build/gradleenv/-1734967052/lib/python3.7/site-packages/hdfs/config.py:15
../../build/gradleenv/-1734967052/lib/python3.7/site-packages/hdfs/config.py:15
../../build/gradleenv/-1734967052/lib/python3.7/site-packages/hdfs/config.py:15
../../build/gradleenv/-1734967052/lib/python3.7/site-packages/hdfs/config.py:15
../../build/gradleenv/-1734967052/lib/python3.7/site-packages/hdfs/config.py:15
../../build/gradleenv/-1734967052/lib/python3.7/site-packages/hdfs/config.py:15
../../build/gradleenv/-1734967052/lib/python3.7/site-packages/hdfs/config.py:15
../../build/gradleenv/-1734967052/lib/python3.7/site-packages/hdfs/config.py:15
  <https://ci-beam.apache.org/job/beam_PostCommit_Python37/ws/src/build/gradleenv/-1734967052/lib/python3.7/site-packages/hdfs/config.py>:15: DeprecationWarning: the imp module is deprecated in favour of importlib; see the module's documentation for alternative uses
    from imp import load_source

../../build/gradleenv/-1734967052/lib/python3.7/site-packages/pkg_resources/__init__.py:2804: 171 warnings
  <https://ci-beam.apache.org/job/beam_PostCommit_Python37/ws/src/build/gradleenv/-1734967052/lib/python3.7/site-packages/pkg_resources/__init__.py>:2804: DeprecationWarning: Deprecated call to `pkg_resources.declare_namespace('google')`.
  Implementing implicit namespace packages (as specified in PEP 420) is preferred to `pkg_resources.declare_namespace`. See https://setuptools.pypa.io/en/latest/references/keywords.html#keyword-namespace-packages
    declare_namespace(pkg)

../../build/gradleenv/-1734967052/lib/python3.7/site-packages/pkg_resources/__init__.py:2804: 117 warnings
  <https://ci-beam.apache.org/job/beam_PostCommit_Python37/ws/src/build/gradleenv/-1734967052/lib/python3.7/site-packages/pkg_resources/__init__.py>:2804: DeprecationWarning: Deprecated call to `pkg_resources.declare_namespace('google.cloud')`.
  Implementing implicit namespace packages (as specified in PEP 420) is preferred to `pkg_resources.declare_namespace`. See https://setuptools.pypa.io/en/latest/references/keywords.html#keyword-namespace-packages
    declare_namespace(pkg)

../../build/gradleenv/-1734967052/lib/python3.7/site-packages/pkg_resources/__init__.py:2309: 36 warnings
  <https://ci-beam.apache.org/job/beam_PostCommit_Python37/ws/src/build/gradleenv/-1734967052/lib/python3.7/site-packages/pkg_resources/__init__.py>:2309: DeprecationWarning: Deprecated call to `pkg_resources.declare_namespace('google')`.
  Implementing implicit namespace packages (as specified in PEP 420) is preferred to `pkg_resources.declare_namespace`. See https://setuptools.pypa.io/en/latest/references/keywords.html#keyword-namespace-packages
    declare_namespace(parent)

../../build/gradleenv/-1734967052/lib/python3.7/site-packages/pkg_resources/__init__.py:2804
../../build/gradleenv/-1734967052/lib/python3.7/site-packages/pkg_resources/__init__.py:2804
../../build/gradleenv/-1734967052/lib/python3.7/site-packages/pkg_resources/__init__.py:2804
../../build/gradleenv/-1734967052/lib/python3.7/site-packages/pkg_resources/__init__.py:2804
../../build/gradleenv/-1734967052/lib/python3.7/site-packages/pkg_resources/__init__.py:2804
../../build/gradleenv/-1734967052/lib/python3.7/site-packages/pkg_resources/__init__.py:2804
../../build/gradleenv/-1734967052/lib/python3.7/site-packages/pkg_resources/__init__.py:2804
../../build/gradleenv/-1734967052/lib/python3.7/site-packages/pkg_resources/__init__.py:2804
../../build/gradleenv/-1734967052/lib/python3.7/site-packages/pkg_resources/__init__.py:2804
  <https://ci-beam.apache.org/job/beam_PostCommit_Python37/ws/src/build/gradleenv/-1734967052/lib/python3.7/site-packages/pkg_resources/__init__.py>:2804: DeprecationWarning: Deprecated call to `pkg_resources.declare_namespace('google.logging')`.
  Implementing implicit namespace packages (as specified in PEP 420) is preferred to `pkg_resources.declare_namespace`. See https://setuptools.pypa.io/en/latest/references/keywords.html#keyword-namespace-packages
    declare_namespace(pkg)

../../build/gradleenv/-1734967052/lib/python3.7/site-packages/pkg_resources/__init__.py:2804
../../build/gradleenv/-1734967052/lib/python3.7/site-packages/pkg_resources/__init__.py:2804
../../build/gradleenv/-1734967052/lib/python3.7/site-packages/pkg_resources/__init__.py:2804
../../build/gradleenv/-1734967052/lib/python3.7/site-packages/pkg_resources/__init__.py:2804
../../build/gradleenv/-1734967052/lib/python3.7/site-packages/pkg_resources/__init__.py:2804
../../build/gradleenv/-1734967052/lib/python3.7/site-packages/pkg_resources/__init__.py:2804
../../build/gradleenv/-1734967052/lib/python3.7/site-packages/pkg_resources/__init__.py:2804
../../build/gradleenv/-1734967052/lib/python3.7/site-packages/pkg_resources/__init__.py:2804
../../build/gradleenv/-1734967052/lib/python3.7/site-packages/pkg_resources/__init__.py:2804
  <https://ci-beam.apache.org/job/beam_PostCommit_Python37/ws/src/build/gradleenv/-1734967052/lib/python3.7/site-packages/pkg_resources/__init__.py>:2804: DeprecationWarning: Deprecated call to `pkg_resources.declare_namespace('google.iam')`.
  Implementing implicit namespace packages (as specified in PEP 420) is preferred to `pkg_resources.declare_namespace`. See https://setuptools.pypa.io/en/latest/references/keywords.html#keyword-namespace-packages
    declare_namespace(pkg)

../../build/gradleenv/-1734967052/lib/python3.7/site-packages/google/rpc/__init__.py:20
../../build/gradleenv/-1734967052/lib/python3.7/site-packages/google/rpc/__init__.py:20
../../build/gradleenv/-1734967052/lib/python3.7/site-packages/google/rpc/__init__.py:20
../../build/gradleenv/-1734967052/lib/python3.7/site-packages/google/rpc/__init__.py:20
../../build/gradleenv/-1734967052/lib/python3.7/site-packages/google/rpc/__init__.py:20
../../build/gradleenv/-1734967052/lib/python3.7/site-packages/google/rpc/__init__.py:20
../../build/gradleenv/-1734967052/lib/python3.7/site-packages/google/rpc/__init__.py:20
../../build/gradleenv/-1734967052/lib/python3.7/site-packages/google/rpc/__init__.py:20
../../build/gradleenv/-1734967052/lib/python3.7/site-packages/google/rpc/__init__.py:20
  <https://ci-beam.apache.org/job/beam_PostCommit_Python37/ws/src/build/gradleenv/-1734967052/lib/python3.7/site-packages/google/rpc/__init__.py>:20: DeprecationWarning: Deprecated call to `pkg_resources.declare_namespace('google.rpc')`.
  Implementing implicit namespace packages (as specified in PEP 420) is preferred to `pkg_resources.declare_namespace`. See https://setuptools.pypa.io/en/latest/references/keywords.html#keyword-namespace-packages
    pkg_resources.declare_namespace(__name__)

apache_beam/io/gcp/experimental/spannerio_write_it_test.py::SpannerWriteIntegrationTest::test_spanner_error
  <https://ci-beam.apache.org/job/beam_PostCommit_Python37/ws/src/sdks/python/apache_beam/io/gcp/experimental/spannerio_write_it_test.py>:190: FutureWarning: WriteToSpanner is experimental. No backwards-compatibility guarantees.
    database_id=self.TEST_DATABASE))

apache_beam/io/gcp/experimental/spannerio_read_it_test.py::SpannerReadIntegrationTest::test_read_via_sql
  <https://ci-beam.apache.org/job/beam_PostCommit_Python37/ws/src/sdks/python/apache_beam/io/gcp/experimental/spannerio_read_it_test.py>:128: FutureWarning: ReadFromSpanner is experimental. No backwards-compatibility guarantees.
    sql="select * from Users")

apache_beam/io/gcp/experimental/spannerio_write_it_test.py::SpannerWriteIntegrationTest::test_spanner_update
  <https://ci-beam.apache.org/job/beam_PostCommit_Python37/ws/src/sdks/python/apache_beam/io/gcp/experimental/spannerio_write_it_test.py>:171: FutureWarning: WriteToSpanner is experimental. No backwards-compatibility guarantees.
    database_id=self.TEST_DATABASE))

apache_beam/io/gcp/experimental/spannerio_read_it_test.py::SpannerReadIntegrationTest::test_read_via_table
  <https://ci-beam.apache.org/job/beam_PostCommit_Python37/ws/src/sdks/python/apache_beam/io/gcp/experimental/spannerio_read_it_test.py>:117: FutureWarning: ReadFromSpanner is experimental. No backwards-compatibility guarantees.
    columns=["UserId", "Key"])

apache_beam/io/gcp/experimental/spannerio_write_it_test.py::SpannerWriteIntegrationTest::test_write_batches
  <https://ci-beam.apache.org/job/beam_PostCommit_Python37/ws/src/sdks/python/apache_beam/io/gcp/experimental/spannerio_write_it_test.py>:135: FutureWarning: WriteToSpanner is experimental. No backwards-compatibility guarantees.
    max_batch_size_bytes=250))

-- Docs: https://docs.pytest.org/en/stable/how-to/capture-warnings.html
- generated xml file: <https://ci-beam.apache.org/job/beam_PostCommit_Python37/ws/src/sdks/python/pytest_postCommitIT-df-py37.xml> -
=========== 5 passed, 18 skipped, 365 warnings in 2063.73s (0:34:23) ===========

FAILURE: Build failed with an exception.

* Where:
Script '<https://ci-beam.apache.org/job/beam_PostCommit_Python37/ws/src/sdks/python/test-suites/direct/common.gradle'> line: 194

* What went wrong:
Execution failed for task ':sdks:python:test-suites:direct:py37:azureIntegrationTest'.
> Process 'command 'sh'' finished with non-zero exit value 1

* Try:
> Run with --stacktrace option to get the stack trace.
> Run with --info or --debug option to get more log output.

* Get more help at https://help.gradle.org

Deprecated Gradle features were used in this build, making it incompatible with Gradle 8.0.

You can use '--warning-mode all' to show the individual deprecation warnings and determine if they come from your own scripts or plugins.

See https://docs.gradle.org/7.5.1/userguide/command_line_interface.html#sec:command_line_warnings

Execution optimizations have been disabled for 1 invalid unit(s) of work during this build to ensure correctness.
Please consult deprecation warnings for more details.

BUILD FAILED in 4h 34m 20s
216 actionable tasks: 151 executed, 59 from cache, 6 up-to-date

Publishing build scan...
https://gradle.com/s/o4kicbwm4n4x6

Build step 'Invoke Gradle script' changed build result to FAILURE
Build step 'Invoke Gradle script' marked build as failure

---------------------------------------------------------------------
To unsubscribe, e-mail: builds-unsubscribe@beam.apache.org
For additional commands, e-mail: builds-help@beam.apache.org


Jenkins build is back to normal : beam_PostCommit_Python37 #6386

Posted by Apache Jenkins Server <je...@builds.apache.org>.
See <https://ci-beam.apache.org/job/beam_PostCommit_Python37/6386/display/redirect>


---------------------------------------------------------------------
To unsubscribe, e-mail: builds-unsubscribe@beam.apache.org
For additional commands, e-mail: builds-help@beam.apache.org


Build failed in Jenkins: beam_PostCommit_Python37 #6385

Posted by Apache Jenkins Server <je...@builds.apache.org>.
See <https://ci-beam.apache.org/job/beam_PostCommit_Python37/6385/display/redirect?page=changes>

Changes:

[noreply] Fix Python3.7 PostCommit Azure integration test (#25654)


------------------------------------------
[...truncated 17.37 MB...]
  <https://ci-beam.apache.org/job/beam_PostCommit_Python37/ws/src/sdks/python/apache_beam/io/gcp/bigquery_file_loads.py>:1175: BeamDeprecationWarning: options is deprecated since First stable release. References to <pipeline>.options will not be supported
    p.options.view_as(GoogleCloudOptions).job_name or 'AUTOMATIC_JOB_NAME')

apache_beam/examples/cookbook/bigquery_tornadoes_it_test.py::BigqueryTornadoesIT::test_bigquery_tornadoes_it
  <https://ci-beam.apache.org/job/beam_PostCommit_Python37/ws/src/sdks/python/apache_beam/io/gcp/tests/utils.py>:100: PendingDeprecationWarning: Client.dataset is deprecated and will be removed in a future version. Use a string like 'my_project.my_dataset' or a cloud.google.bigquery.DatasetReference object, instead.
    table_ref = client.dataset(dataset_id).table(table_id)

apache_beam/examples/dataframe/taxiride_it_test.py::TaxirideIT::test_aggregation
apache_beam/examples/dataframe/flight_delays_it_test.py::FlightDelaysTest::test_flight_delays
apache_beam/examples/dataframe/taxiride_it_test.py::TaxirideIT::test_enrich
  <https://ci-beam.apache.org/job/beam_PostCommit_Python37/ws/src/sdks/python/apache_beam/dataframe/io.py>:664: FutureWarning: WriteToFiles is experimental.
    sink=lambda _: _WriteToPandasFileSink(

apache_beam/examples/dataframe/taxiride_it_test.py::TaxirideIT::test_aggregation
apache_beam/examples/dataframe/flight_delays_it_test.py::FlightDelaysTest::test_flight_delays
apache_beam/examples/dataframe/taxiride_it_test.py::TaxirideIT::test_enrich
  <https://ci-beam.apache.org/job/beam_PostCommit_Python37/ws/src/sdks/python/apache_beam/io/fileio.py>:596: BeamDeprecationWarning: options is deprecated since First stable release. References to <pipeline>.options will not be supported
    p.options.view_as(GoogleCloudOptions).temp_location or

apache_beam/examples/dataframe/flight_delays_it_test.py::FlightDelaysTest::test_flight_delays
  <https://ci-beam.apache.org/job/beam_PostCommit_Python37/ws/src/sdks/python/apache_beam/examples/dataframe/flight_delays.py>:47: FutureWarning: Dropping of nuisance columns in DataFrame reductions (with 'numeric_only=None') is deprecated; in a future version this will raise TypeError.  Select only valid columns before calling the reduction.
    return airline_df[at_top_airports].mean()

apache_beam/io/gcp/bigquery_test.py::BigQueryStreamingInsertTransformIntegrationTests::test_multiple_destinations_transform
  <https://ci-beam.apache.org/job/beam_PostCommit_Python37/ws/src/sdks/python/apache_beam/io/gcp/bigquery_test.py>:1690: BeamDeprecationWarning: options is deprecated since First stable release. References to <pipeline>.options will not be supported
    streaming = self.test_pipeline.options.view_as(StandardOptions).streaming

apache_beam/io/gcp/bigquery_read_it_test.py::ReadTests::test_native_source
  <https://ci-beam.apache.org/job/beam_PostCommit_Python37/ws/src/sdks/python/apache_beam/io/gcp/bigquery_read_it_test.py>:170: BeamDeprecationWarning: BigQuerySource is deprecated since 2.25.0. Use ReadFromBigQuery instead.
    beam.io.BigQuerySource(query=self.query, use_standard_sql=True)))

apache_beam/ml/gcp/cloud_dlp_it_test.py::CloudDLPIT::test_deidentification
  <https://ci-beam.apache.org/job/beam_PostCommit_Python37/ws/src/sdks/python/apache_beam/ml/gcp/cloud_dlp_it_test.py>:77: FutureWarning: MaskDetectedDetails is experimental.
    inspection_config=INSPECT_CONFIG))

apache_beam/ml/gcp/cloud_dlp_it_test.py::CloudDLPIT::test_inspection
  <https://ci-beam.apache.org/job/beam_PostCommit_Python37/ws/src/sdks/python/apache_beam/ml/gcp/cloud_dlp_it_test.py>:87: FutureWarning: InspectForDetails is experimental.
    | beam.ParDo(extract_inspection_results).with_outputs(

apache_beam/ml/inference/sklearn_inference_it_test.py::SklearnInference::test_sklearn_regression
  <https://ci-beam.apache.org/job/beam_PostCommit_Python37/ws/src/sdks/python/apache_beam/examples/inference/sklearn_japanese_housing_regression.py>:129: FutureWarning: SklearnModelHandlerPandas is experimental. No backwards-compatibility guarantees.
    model_file_type=ModelFileType.PICKLE, model_uri=model_filename)

apache_beam/ml/inference/sklearn_inference_it_test.py::SklearnInference::test_sklearn_regression
  <https://ci-beam.apache.org/job/beam_PostCommit_Python37/ws/src/build/gradleenv/-1734967052/lib/python3.7/site-packages/dill/_dill.py>:472: FutureWarning: SklearnModelHandlerPandas is experimental. No backwards-compatibility guarantees.
    obj = StockUnpickler.load(self)

apache_beam/io/gcp/bigquery_read_it_test.py::ReadNewTypesTests::test_native_source
  <https://ci-beam.apache.org/job/beam_PostCommit_Python37/ws/src/sdks/python/apache_beam/io/gcp/bigquery_read_it_test.py>:693: BeamDeprecationWarning: BigQuerySource is deprecated since 2.25.0. Use ReadFromBigQuery instead.
    beam.io.BigQuerySource(query=self.query, use_standard_sql=True)))

apache_beam/io/gcp/bigquery_read_it_test.py::ReadAllBQTests::test_read_queries
  <https://ci-beam.apache.org/job/beam_PostCommit_Python37/ws/src/sdks/python/apache_beam/io/gcp/bigquery_read_it_test.py>:808: FutureWarning: ReadAllFromBigQuery is experimental.
    | beam.io.ReadAllFromBigQuery())

apache_beam/io/gcp/bigquery_read_it_test.py::ReadAllBQTests::test_read_queries
  <https://ci-beam.apache.org/job/beam_PostCommit_Python37/ws/src/sdks/python/apache_beam/io/gcp/bigquery.py>:2658: BeamDeprecationWarning: options is deprecated since First stable release. References to <pipeline>.options will not be supported
    job_name = pcoll.pipeline.options.view_as(GoogleCloudOptions).job_name

apache_beam/io/gcp/bigquery_read_it_test.py::ReadAllBQTests::test_read_queries
  <https://ci-beam.apache.org/job/beam_PostCommit_Python37/ws/src/sdks/python/apache_beam/io/gcp/bigquery.py>:2659: BeamDeprecationWarning: options is deprecated since First stable release. References to <pipeline>.options will not be supported
    project = pcoll.pipeline.options.view_as(GoogleCloudOptions).project

apache_beam/io/gcp/bigquery_read_it_test.py::ReadAllBQTests::test_read_queries
  <https://ci-beam.apache.org/job/beam_PostCommit_Python37/ws/src/sdks/python/apache_beam/io/gcp/bigquery.py>:2672: BeamDeprecationWarning: options is deprecated since First stable release. References to <pipeline>.options will not be supported
    options=pcoll.pipeline.options,

-- Docs: https://docs.pytest.org/en/stable/how-to/capture-warnings.html
- generated xml file: <https://ci-beam.apache.org/job/beam_PostCommit_Python37/ws/src/sdks/python/pytest_postCommitIT-df-py37.xml> -
========== 85 passed, 28 skipped, 576 warnings in 13751.65s (3:49:11) ==========

> Task :sdks:python:test-suites:dataflow:py37:spannerioIT
>>> RUNNING integration tests with pipeline options: --runner=TestDataflowRunner --project=apache-beam-testing --region=us-central1 --staging_location=gs://temp-storage-for-end-to-end-tests/staging-it --temp_location=gs://temp-storage-for-end-to-end-tests/temp-it --output=gs://temp-storage-for-end-to-end-tests/py-it-cloud/output --sdk_location=<https://ci-beam.apache.org/job/beam_PostCommit_Python37/ws/src/sdks/python/build/apache-beam.tar.gz> --requirements_file=postcommit_requirements.txt --num_workers=1 --sleep_secs=20 --kms_key_name=projects/apache-beam-testing/locations/global/keyRings/beam-it/cryptoKeys/test --dataflow_kms_key=projects/apache-beam-testing/locations/global/keyRings/beam-it/cryptoKeys/test
>>>   pytest options: --capture=no --timeout=4500 --color=yes --log-cli-level=INFO --numprocesses=8 --dist=loadfile
>>>   collect markers: -m=spannerio_it
============================= test session starts ==============================
platform linux -- Python 3.7.12, pytest-7.2.1, pluggy-1.0.0
rootdir: <https://ci-beam.apache.org/job/beam_PostCommit_Python37/ws/src/sdks/python,> configfile: pytest.ini
plugins: xdist-2.5.0, timeout-2.1.0, forked-1.6.0, hypothesis-6.68.2, requests-mock-1.10.0
timeout: 4500.0s
timeout method: signal
timeout func_only: False
gw0 I / gw1 I / gw2 I / gw3 I / gw4 I / gw5 I / gw6 I / gw7 I
[gw0] Python 3.7.12 (default, Jan 15 2022, 18:42:10)  -- [GCC 9.3.0]
[gw1] Python 3.7.12 (default, Jan 15 2022, 18:42:10)  -- [GCC 9.3.0]
[gw2] Python 3.7.12 (default, Jan 15 2022, 18:42:10)  -- [GCC 9.3.0]
[gw3] Python 3.7.12 (default, Jan 15 2022, 18:42:10)  -- [GCC 9.3.0]
[gw4] Python 3.7.12 (default, Jan 15 2022, 18:42:10)  -- [GCC 9.3.0]
[gw5] Python 3.7.12 (default, Jan 15 2022, 18:42:10)  -- [GCC 9.3.0]
[gw6] Python 3.7.12 (default, Jan 15 2022, 18:42:10)  -- [GCC 9.3.0]
[gw7] Python 3.7.12 (default, Jan 15 2022, 18:42:10)  -- [GCC 9.3.0]
gw0 [15] / gw1 [15] / gw2 [15] / gw3 [15] / gw4 [15] / gw5 [15] / gw6 [15] / gw7 [15]

scheduling tests via LoadFileScheduling

apache_beam/io/gcp/experimental/spannerio_write_it_test.py::SpannerWriteIntegrationTest::test_metrics_error_call 
apache_beam/io/gcp/experimental/spannerio_read_it_test.py::SpannerReadIntegrationTest::test_read_via_sql 
[gw1] SKIPPED apache_beam/io/gcp/experimental/spannerio_write_it_test.py::SpannerWriteIntegrationTest::test_metrics_error_call 
apache_beam/io/gcp/experimental/spannerio_write_it_test.py::SpannerWriteIntegrationTest::test_metrics_ok_call 
[gw1] SKIPPED apache_beam/io/gcp/experimental/spannerio_write_it_test.py::SpannerWriteIntegrationTest::test_metrics_ok_call 
apache_beam/io/gcp/experimental/spannerio_write_it_test.py::SpannerWriteIntegrationTest::test_spanner_error 
[gw0] PASSED apache_beam/io/gcp/experimental/spannerio_read_it_test.py::SpannerReadIntegrationTest::test_read_via_sql 
apache_beam/io/gcp/experimental/spannerio_read_it_test.py::SpannerReadIntegrationTest::test_read_via_table 
[gw1] PASSED apache_beam/io/gcp/experimental/spannerio_write_it_test.py::SpannerWriteIntegrationTest::test_spanner_error 
apache_beam/io/gcp/experimental/spannerio_write_it_test.py::SpannerWriteIntegrationTest::test_spanner_update 
[gw1] PASSED apache_beam/io/gcp/experimental/spannerio_write_it_test.py::SpannerWriteIntegrationTest::test_spanner_update 
apache_beam/io/gcp/experimental/spannerio_write_it_test.py::SpannerWriteIntegrationTest::test_write_batches 
[gw0] PASSED apache_beam/io/gcp/experimental/spannerio_read_it_test.py::SpannerReadIntegrationTest::test_read_via_table 
apache_beam/io/gcp/experimental/spannerio_read_it_test.py::SpannerReadIntegrationTest::test_sql_metrics_error_call 
[gw0] SKIPPED apache_beam/io/gcp/experimental/spannerio_read_it_test.py::SpannerReadIntegrationTest::test_sql_metrics_error_call 
apache_beam/io/gcp/experimental/spannerio_read_it_test.py::SpannerReadIntegrationTest::test_sql_metrics_ok_call 
[gw0] SKIPPED apache_beam/io/gcp/experimental/spannerio_read_it_test.py::SpannerReadIntegrationTest::test_sql_metrics_ok_call 
apache_beam/io/gcp/experimental/spannerio_read_it_test.py::SpannerReadIntegrationTest::test_table_metrics_error_call 
[gw0] SKIPPED apache_beam/io/gcp/experimental/spannerio_read_it_test.py::SpannerReadIntegrationTest::test_table_metrics_error_call 
apache_beam/io/gcp/experimental/spannerio_read_it_test.py::SpannerReadIntegrationTest::test_table_metrics_ok_call 
[gw0] SKIPPED apache_beam/io/gcp/experimental/spannerio_read_it_test.py::SpannerReadIntegrationTest::test_table_metrics_ok_call 
apache_beam/io/gcp/experimental/spannerio_read_it_test.py::SpannerReadIntegrationTest::test_transaction_sql_metrics_error_call 
[gw0] SKIPPED apache_beam/io/gcp/experimental/spannerio_read_it_test.py::SpannerReadIntegrationTest::test_transaction_sql_metrics_error_call 
apache_beam/io/gcp/experimental/spannerio_read_it_test.py::SpannerReadIntegrationTest::test_transaction_sql_metrics_ok_call 
[gw0] SKIPPED apache_beam/io/gcp/experimental/spannerio_read_it_test.py::SpannerReadIntegrationTest::test_transaction_sql_metrics_ok_call 
apache_beam/io/gcp/experimental/spannerio_read_it_test.py::SpannerReadIntegrationTest::test_transaction_table_metrics_error_call 
[gw0] SKIPPED apache_beam/io/gcp/experimental/spannerio_read_it_test.py::SpannerReadIntegrationTest::test_transaction_table_metrics_error_call 
apache_beam/io/gcp/experimental/spannerio_read_it_test.py::SpannerReadIntegrationTest::test_transaction_table_metrics_ok_call 
[gw0] SKIPPED apache_beam/io/gcp/experimental/spannerio_read_it_test.py::SpannerReadIntegrationTest::test_transaction_table_metrics_ok_call 
[gw1] PASSED apache_beam/io/gcp/experimental/spannerio_write_it_test.py::SpannerWriteIntegrationTest::test_write_batches 

=============================== warnings summary ===============================
../../build/gradleenv/-1734967052/lib/python3.7/site-packages/hdfs/config.py:15
../../build/gradleenv/-1734967052/lib/python3.7/site-packages/hdfs/config.py:15
../../build/gradleenv/-1734967052/lib/python3.7/site-packages/hdfs/config.py:15
../../build/gradleenv/-1734967052/lib/python3.7/site-packages/hdfs/config.py:15
../../build/gradleenv/-1734967052/lib/python3.7/site-packages/hdfs/config.py:15
../../build/gradleenv/-1734967052/lib/python3.7/site-packages/hdfs/config.py:15
../../build/gradleenv/-1734967052/lib/python3.7/site-packages/hdfs/config.py:15
../../build/gradleenv/-1734967052/lib/python3.7/site-packages/hdfs/config.py:15
../../build/gradleenv/-1734967052/lib/python3.7/site-packages/hdfs/config.py:15
  <https://ci-beam.apache.org/job/beam_PostCommit_Python37/ws/src/build/gradleenv/-1734967052/lib/python3.7/site-packages/hdfs/config.py>:15: DeprecationWarning: the imp module is deprecated in favour of importlib; see the module's documentation for alternative uses
    from imp import load_source

../../build/gradleenv/-1734967052/lib/python3.7/site-packages/pkg_resources/__init__.py:2804: 171 warnings
  <https://ci-beam.apache.org/job/beam_PostCommit_Python37/ws/src/build/gradleenv/-1734967052/lib/python3.7/site-packages/pkg_resources/__init__.py>:2804: DeprecationWarning: Deprecated call to `pkg_resources.declare_namespace('google')`.
  Implementing implicit namespace packages (as specified in PEP 420) is preferred to `pkg_resources.declare_namespace`. See https://setuptools.pypa.io/en/latest/references/keywords.html#keyword-namespace-packages
    declare_namespace(pkg)

../../build/gradleenv/-1734967052/lib/python3.7/site-packages/pkg_resources/__init__.py:2804: 117 warnings
  <https://ci-beam.apache.org/job/beam_PostCommit_Python37/ws/src/build/gradleenv/-1734967052/lib/python3.7/site-packages/pkg_resources/__init__.py>:2804: DeprecationWarning: Deprecated call to `pkg_resources.declare_namespace('google.cloud')`.
  Implementing implicit namespace packages (as specified in PEP 420) is preferred to `pkg_resources.declare_namespace`. See https://setuptools.pypa.io/en/latest/references/keywords.html#keyword-namespace-packages
    declare_namespace(pkg)

../../build/gradleenv/-1734967052/lib/python3.7/site-packages/pkg_resources/__init__.py:2309: 36 warnings
  <https://ci-beam.apache.org/job/beam_PostCommit_Python37/ws/src/build/gradleenv/-1734967052/lib/python3.7/site-packages/pkg_resources/__init__.py>:2309: DeprecationWarning: Deprecated call to `pkg_resources.declare_namespace('google')`.
  Implementing implicit namespace packages (as specified in PEP 420) is preferred to `pkg_resources.declare_namespace`. See https://setuptools.pypa.io/en/latest/references/keywords.html#keyword-namespace-packages
    declare_namespace(parent)

../../build/gradleenv/-1734967052/lib/python3.7/site-packages/pkg_resources/__init__.py:2804
../../build/gradleenv/-1734967052/lib/python3.7/site-packages/pkg_resources/__init__.py:2804
../../build/gradleenv/-1734967052/lib/python3.7/site-packages/pkg_resources/__init__.py:2804
../../build/gradleenv/-1734967052/lib/python3.7/site-packages/pkg_resources/__init__.py:2804
../../build/gradleenv/-1734967052/lib/python3.7/site-packages/pkg_resources/__init__.py:2804
../../build/gradleenv/-1734967052/lib/python3.7/site-packages/pkg_resources/__init__.py:2804
../../build/gradleenv/-1734967052/lib/python3.7/site-packages/pkg_resources/__init__.py:2804
../../build/gradleenv/-1734967052/lib/python3.7/site-packages/pkg_resources/__init__.py:2804
../../build/gradleenv/-1734967052/lib/python3.7/site-packages/pkg_resources/__init__.py:2804
  <https://ci-beam.apache.org/job/beam_PostCommit_Python37/ws/src/build/gradleenv/-1734967052/lib/python3.7/site-packages/pkg_resources/__init__.py>:2804: DeprecationWarning: Deprecated call to `pkg_resources.declare_namespace('google.logging')`.
  Implementing implicit namespace packages (as specified in PEP 420) is preferred to `pkg_resources.declare_namespace`. See https://setuptools.pypa.io/en/latest/references/keywords.html#keyword-namespace-packages
    declare_namespace(pkg)

../../build/gradleenv/-1734967052/lib/python3.7/site-packages/pkg_resources/__init__.py:2804
../../build/gradleenv/-1734967052/lib/python3.7/site-packages/pkg_resources/__init__.py:2804
../../build/gradleenv/-1734967052/lib/python3.7/site-packages/pkg_resources/__init__.py:2804
../../build/gradleenv/-1734967052/lib/python3.7/site-packages/pkg_resources/__init__.py:2804
../../build/gradleenv/-1734967052/lib/python3.7/site-packages/pkg_resources/__init__.py:2804
../../build/gradleenv/-1734967052/lib/python3.7/site-packages/pkg_resources/__init__.py:2804
../../build/gradleenv/-1734967052/lib/python3.7/site-packages/pkg_resources/__init__.py:2804
../../build/gradleenv/-1734967052/lib/python3.7/site-packages/pkg_resources/__init__.py:2804
../../build/gradleenv/-1734967052/lib/python3.7/site-packages/pkg_resources/__init__.py:2804
  <https://ci-beam.apache.org/job/beam_PostCommit_Python37/ws/src/build/gradleenv/-1734967052/lib/python3.7/site-packages/pkg_resources/__init__.py>:2804: DeprecationWarning: Deprecated call to `pkg_resources.declare_namespace('google.iam')`.
  Implementing implicit namespace packages (as specified in PEP 420) is preferred to `pkg_resources.declare_namespace`. See https://setuptools.pypa.io/en/latest/references/keywords.html#keyword-namespace-packages
    declare_namespace(pkg)

../../build/gradleenv/-1734967052/lib/python3.7/site-packages/google/rpc/__init__.py:20
../../build/gradleenv/-1734967052/lib/python3.7/site-packages/google/rpc/__init__.py:20
../../build/gradleenv/-1734967052/lib/python3.7/site-packages/google/rpc/__init__.py:20
../../build/gradleenv/-1734967052/lib/python3.7/site-packages/google/rpc/__init__.py:20
../../build/gradleenv/-1734967052/lib/python3.7/site-packages/google/rpc/__init__.py:20
../../build/gradleenv/-1734967052/lib/python3.7/site-packages/google/rpc/__init__.py:20
../../build/gradleenv/-1734967052/lib/python3.7/site-packages/google/rpc/__init__.py:20
../../build/gradleenv/-1734967052/lib/python3.7/site-packages/google/rpc/__init__.py:20
../../build/gradleenv/-1734967052/lib/python3.7/site-packages/google/rpc/__init__.py:20
  <https://ci-beam.apache.org/job/beam_PostCommit_Python37/ws/src/build/gradleenv/-1734967052/lib/python3.7/site-packages/google/rpc/__init__.py>:20: DeprecationWarning: Deprecated call to `pkg_resources.declare_namespace('google.rpc')`.
  Implementing implicit namespace packages (as specified in PEP 420) is preferred to `pkg_resources.declare_namespace`. See https://setuptools.pypa.io/en/latest/references/keywords.html#keyword-namespace-packages
    pkg_resources.declare_namespace(__name__)

apache_beam/io/gcp/experimental/spannerio_read_it_test.py::SpannerReadIntegrationTest::test_read_via_sql
  <https://ci-beam.apache.org/job/beam_PostCommit_Python37/ws/src/sdks/python/apache_beam/io/gcp/experimental/spannerio_read_it_test.py>:128: FutureWarning: ReadFromSpanner is experimental. No backwards-compatibility guarantees.
    sql="select * from Users")

apache_beam/io/gcp/experimental/spannerio_write_it_test.py::SpannerWriteIntegrationTest::test_spanner_error
  <https://ci-beam.apache.org/job/beam_PostCommit_Python37/ws/src/sdks/python/apache_beam/io/gcp/experimental/spannerio_write_it_test.py>:190: FutureWarning: WriteToSpanner is experimental. No backwards-compatibility guarantees.
    database_id=self.TEST_DATABASE))

apache_beam/io/gcp/experimental/spannerio_write_it_test.py::SpannerWriteIntegrationTest::test_spanner_update
  <https://ci-beam.apache.org/job/beam_PostCommit_Python37/ws/src/sdks/python/apache_beam/io/gcp/experimental/spannerio_write_it_test.py>:171: FutureWarning: WriteToSpanner is experimental. No backwards-compatibility guarantees.
    database_id=self.TEST_DATABASE))

apache_beam/io/gcp/experimental/spannerio_read_it_test.py::SpannerReadIntegrationTest::test_read_via_table
  <https://ci-beam.apache.org/job/beam_PostCommit_Python37/ws/src/sdks/python/apache_beam/io/gcp/experimental/spannerio_read_it_test.py>:117: FutureWarning: ReadFromSpanner is experimental. No backwards-compatibility guarantees.
    columns=["UserId", "Key"])

apache_beam/io/gcp/experimental/spannerio_write_it_test.py::SpannerWriteIntegrationTest::test_write_batches
  <https://ci-beam.apache.org/job/beam_PostCommit_Python37/ws/src/sdks/python/apache_beam/io/gcp/experimental/spannerio_write_it_test.py>:135: FutureWarning: WriteToSpanner is experimental. No backwards-compatibility guarantees.
    max_batch_size_bytes=250))

-- Docs: https://docs.pytest.org/en/stable/how-to/capture-warnings.html
- generated xml file: <https://ci-beam.apache.org/job/beam_PostCommit_Python37/ws/src/sdks/python/pytest_postCommitIT-df-py37.xml> -
=========== 5 passed, 18 skipped, 365 warnings in 2053.09s (0:34:13) ===========

FAILURE: Build failed with an exception.

* Where:
Script '<https://ci-beam.apache.org/job/beam_PostCommit_Python37/ws/src/sdks/python/test-suites/direct/common.gradle'> line: 51

* What went wrong:
Execution failed for task ':sdks:python:test-suites:direct:py37:postCommitIT'.
> Process 'command 'sh'' finished with non-zero exit value 1

* Try:
> Run with --stacktrace option to get the stack trace.
> Run with --info or --debug option to get more log output.

* Get more help at https://help.gradle.org

Deprecated Gradle features were used in this build, making it incompatible with Gradle 8.0.

You can use '--warning-mode all' to show the individual deprecation warnings and determine if they come from your own scripts or plugins.

See https://docs.gradle.org/7.5.1/userguide/command_line_interface.html#sec:command_line_warnings

Execution optimizations have been disabled for 1 invalid unit(s) of work during this build to ensure correctness.
Please consult deprecation warnings for more details.

BUILD FAILED in 4h 27m 51s
216 actionable tasks: 151 executed, 59 from cache, 6 up-to-date

Publishing build scan...
https://gradle.com/s/5vkoezd43nvrw

Build step 'Invoke Gradle script' changed build result to FAILURE
Build step 'Invoke Gradle script' marked build as failure

---------------------------------------------------------------------
To unsubscribe, e-mail: builds-unsubscribe@beam.apache.org
For additional commands, e-mail: builds-help@beam.apache.org


Build failed in Jenkins: beam_PostCommit_Python37 #6384

Posted by Apache Jenkins Server <je...@builds.apache.org>.
See <https://ci-beam.apache.org/job/beam_PostCommit_Python37/6384/display/redirect>

Changes:


------------------------------------------
[...truncated 17.28 MB...]
  <https://ci-beam.apache.org/job/beam_PostCommit_Python37/ws/src/sdks/python/apache_beam/io/gcp/bigquery_file_loads.py>:1175: BeamDeprecationWarning: options is deprecated since First stable release. References to <pipeline>.options will not be supported
    p.options.view_as(GoogleCloudOptions).job_name or 'AUTOMATIC_JOB_NAME')

apache_beam/examples/cookbook/bigquery_tornadoes_it_test.py::BigqueryTornadoesIT::test_bigquery_tornadoes_it
  <https://ci-beam.apache.org/job/beam_PostCommit_Python37/ws/src/sdks/python/apache_beam/io/gcp/tests/utils.py>:100: PendingDeprecationWarning: Client.dataset is deprecated and will be removed in a future version. Use a string like 'my_project.my_dataset' or a cloud.google.bigquery.DatasetReference object, instead.
    table_ref = client.dataset(dataset_id).table(table_id)

apache_beam/examples/dataframe/flight_delays_it_test.py::FlightDelaysTest::test_flight_delays
  <https://ci-beam.apache.org/job/beam_PostCommit_Python37/ws/src/sdks/python/apache_beam/examples/dataframe/flight_delays.py>:47: FutureWarning: Dropping of nuisance columns in DataFrame reductions (with 'numeric_only=None') is deprecated; in a future version this will raise TypeError.  Select only valid columns before calling the reduction.
    return airline_df[at_top_airports].mean()

apache_beam/examples/dataframe/flight_delays_it_test.py::FlightDelaysTest::test_flight_delays
apache_beam/examples/dataframe/taxiride_it_test.py::TaxirideIT::test_aggregation
apache_beam/examples/dataframe/taxiride_it_test.py::TaxirideIT::test_enrich
  <https://ci-beam.apache.org/job/beam_PostCommit_Python37/ws/src/sdks/python/apache_beam/dataframe/io.py>:664: FutureWarning: WriteToFiles is experimental.
    sink=lambda _: _WriteToPandasFileSink(

apache_beam/examples/dataframe/flight_delays_it_test.py::FlightDelaysTest::test_flight_delays
apache_beam/examples/dataframe/taxiride_it_test.py::TaxirideIT::test_aggregation
apache_beam/examples/dataframe/taxiride_it_test.py::TaxirideIT::test_enrich
  <https://ci-beam.apache.org/job/beam_PostCommit_Python37/ws/src/sdks/python/apache_beam/io/fileio.py>:596: BeamDeprecationWarning: options is deprecated since First stable release. References to <pipeline>.options will not be supported
    p.options.view_as(GoogleCloudOptions).temp_location or

apache_beam/io/gcp/bigquery_test.py::BigQueryStreamingInsertTransformIntegrationTests::test_multiple_destinations_transform
  <https://ci-beam.apache.org/job/beam_PostCommit_Python37/ws/src/sdks/python/apache_beam/io/gcp/bigquery_test.py>:1690: BeamDeprecationWarning: options is deprecated since First stable release. References to <pipeline>.options will not be supported
    streaming = self.test_pipeline.options.view_as(StandardOptions).streaming

apache_beam/io/gcp/bigquery_read_it_test.py::ReadTests::test_native_source
  <https://ci-beam.apache.org/job/beam_PostCommit_Python37/ws/src/sdks/python/apache_beam/io/gcp/bigquery_read_it_test.py>:170: BeamDeprecationWarning: BigQuerySource is deprecated since 2.25.0. Use ReadFromBigQuery instead.
    beam.io.BigQuerySource(query=self.query, use_standard_sql=True)))

apache_beam/ml/gcp/cloud_dlp_it_test.py::CloudDLPIT::test_deidentification
  <https://ci-beam.apache.org/job/beam_PostCommit_Python37/ws/src/sdks/python/apache_beam/ml/gcp/cloud_dlp_it_test.py>:77: FutureWarning: MaskDetectedDetails is experimental.
    inspection_config=INSPECT_CONFIG))

apache_beam/ml/gcp/cloud_dlp_it_test.py::CloudDLPIT::test_inspection
  <https://ci-beam.apache.org/job/beam_PostCommit_Python37/ws/src/sdks/python/apache_beam/ml/gcp/cloud_dlp_it_test.py>:87: FutureWarning: InspectForDetails is experimental.
    | beam.ParDo(extract_inspection_results).with_outputs(

apache_beam/ml/inference/sklearn_inference_it_test.py::SklearnInference::test_sklearn_regression
  <https://ci-beam.apache.org/job/beam_PostCommit_Python37/ws/src/sdks/python/apache_beam/examples/inference/sklearn_japanese_housing_regression.py>:129: FutureWarning: SklearnModelHandlerPandas is experimental. No backwards-compatibility guarantees.
    model_file_type=ModelFileType.PICKLE, model_uri=model_filename)

apache_beam/ml/inference/sklearn_inference_it_test.py::SklearnInference::test_sklearn_regression
  <https://ci-beam.apache.org/job/beam_PostCommit_Python37/ws/src/build/gradleenv/-1734967052/lib/python3.7/site-packages/dill/_dill.py>:472: FutureWarning: SklearnModelHandlerPandas is experimental. No backwards-compatibility guarantees.
    obj = StockUnpickler.load(self)

apache_beam/io/gcp/bigquery_read_it_test.py::ReadNewTypesTests::test_native_source
  <https://ci-beam.apache.org/job/beam_PostCommit_Python37/ws/src/sdks/python/apache_beam/io/gcp/bigquery_read_it_test.py>:693: BeamDeprecationWarning: BigQuerySource is deprecated since 2.25.0. Use ReadFromBigQuery instead.
    beam.io.BigQuerySource(query=self.query, use_standard_sql=True)))

apache_beam/io/gcp/bigquery_read_it_test.py::ReadAllBQTests::test_read_queries
  <https://ci-beam.apache.org/job/beam_PostCommit_Python37/ws/src/sdks/python/apache_beam/io/gcp/bigquery_read_it_test.py>:808: FutureWarning: ReadAllFromBigQuery is experimental.
    | beam.io.ReadAllFromBigQuery())

apache_beam/io/gcp/bigquery_read_it_test.py::ReadAllBQTests::test_read_queries
  <https://ci-beam.apache.org/job/beam_PostCommit_Python37/ws/src/sdks/python/apache_beam/io/gcp/bigquery.py>:2658: BeamDeprecationWarning: options is deprecated since First stable release. References to <pipeline>.options will not be supported
    job_name = pcoll.pipeline.options.view_as(GoogleCloudOptions).job_name

apache_beam/io/gcp/bigquery_read_it_test.py::ReadAllBQTests::test_read_queries
  <https://ci-beam.apache.org/job/beam_PostCommit_Python37/ws/src/sdks/python/apache_beam/io/gcp/bigquery.py>:2659: BeamDeprecationWarning: options is deprecated since First stable release. References to <pipeline>.options will not be supported
    project = pcoll.pipeline.options.view_as(GoogleCloudOptions).project

apache_beam/io/gcp/bigquery_read_it_test.py::ReadAllBQTests::test_read_queries
  <https://ci-beam.apache.org/job/beam_PostCommit_Python37/ws/src/sdks/python/apache_beam/io/gcp/bigquery.py>:2672: BeamDeprecationWarning: options is deprecated since First stable release. References to <pipeline>.options will not be supported
    options=pcoll.pipeline.options,

-- Docs: https://docs.pytest.org/en/stable/how-to/capture-warnings.html
- generated xml file: <https://ci-beam.apache.org/job/beam_PostCommit_Python37/ws/src/sdks/python/pytest_postCommitIT-df-py37.xml> -
========== 85 passed, 28 skipped, 576 warnings in 13651.57s (3:47:31) ==========

> Task :sdks:python:test-suites:dataflow:py37:spannerioIT
>>> RUNNING integration tests with pipeline options: --runner=TestDataflowRunner --project=apache-beam-testing --region=us-central1 --staging_location=gs://temp-storage-for-end-to-end-tests/staging-it --temp_location=gs://temp-storage-for-end-to-end-tests/temp-it --output=gs://temp-storage-for-end-to-end-tests/py-it-cloud/output --sdk_location=<https://ci-beam.apache.org/job/beam_PostCommit_Python37/ws/src/sdks/python/build/apache-beam.tar.gz> --requirements_file=postcommit_requirements.txt --num_workers=1 --sleep_secs=20 --kms_key_name=projects/apache-beam-testing/locations/global/keyRings/beam-it/cryptoKeys/test --dataflow_kms_key=projects/apache-beam-testing/locations/global/keyRings/beam-it/cryptoKeys/test
>>>   pytest options: --capture=no --timeout=4500 --color=yes --log-cli-level=INFO --numprocesses=8 --dist=loadfile
>>>   collect markers: -m=spannerio_it
============================= test session starts ==============================
platform linux -- Python 3.7.12, pytest-7.2.1, pluggy-1.0.0
rootdir: <https://ci-beam.apache.org/job/beam_PostCommit_Python37/ws/src/sdks/python,> configfile: pytest.ini
plugins: xdist-2.5.0, timeout-2.1.0, forked-1.6.0, hypothesis-6.68.2, requests-mock-1.10.0
timeout: 4500.0s
timeout method: signal
timeout func_only: False
gw0 I / gw1 I / gw2 I / gw3 I / gw4 I / gw5 I / gw6 I / gw7 I
[gw0] Python 3.7.12 (default, Jan 15 2022, 18:42:10)  -- [GCC 9.3.0]
[gw1] Python 3.7.12 (default, Jan 15 2022, 18:42:10)  -- [GCC 9.3.0]
[gw3] Python 3.7.12 (default, Jan 15 2022, 18:42:10)  -- [GCC 9.3.0]
[gw6] Python 3.7.12 (default, Jan 15 2022, 18:42:10)  -- [GCC 9.3.0]
[gw4] Python 3.7.12 (default, Jan 15 2022, 18:42:10)  -- [GCC 9.3.0]
[gw2] Python 3.7.12 (default, Jan 15 2022, 18:42:10)  -- [GCC 9.3.0]
[gw5] Python 3.7.12 (default, Jan 15 2022, 18:42:10)  -- [GCC 9.3.0]
[gw7] Python 3.7.12 (default, Jan 15 2022, 18:42:10)  -- [GCC 9.3.0]
gw0 [15] / gw1 [15] / gw2 [15] / gw3 [15] / gw4 [15] / gw5 [15] / gw6 [15] / gw7 [15]

scheduling tests via LoadFileScheduling

apache_beam/io/gcp/experimental/spannerio_read_it_test.py::SpannerReadIntegrationTest::test_read_via_sql 
apache_beam/io/gcp/experimental/spannerio_write_it_test.py::SpannerWriteIntegrationTest::test_metrics_error_call 
[gw1] SKIPPED apache_beam/io/gcp/experimental/spannerio_write_it_test.py::SpannerWriteIntegrationTest::test_metrics_error_call 
apache_beam/io/gcp/experimental/spannerio_write_it_test.py::SpannerWriteIntegrationTest::test_metrics_ok_call 
[gw1] SKIPPED apache_beam/io/gcp/experimental/spannerio_write_it_test.py::SpannerWriteIntegrationTest::test_metrics_ok_call 
apache_beam/io/gcp/experimental/spannerio_write_it_test.py::SpannerWriteIntegrationTest::test_spanner_error 
[gw0] PASSED apache_beam/io/gcp/experimental/spannerio_read_it_test.py::SpannerReadIntegrationTest::test_read_via_sql 
apache_beam/io/gcp/experimental/spannerio_read_it_test.py::SpannerReadIntegrationTest::test_read_via_table 
[gw1] PASSED apache_beam/io/gcp/experimental/spannerio_write_it_test.py::SpannerWriteIntegrationTest::test_spanner_error 
apache_beam/io/gcp/experimental/spannerio_write_it_test.py::SpannerWriteIntegrationTest::test_spanner_update 
[gw1] PASSED apache_beam/io/gcp/experimental/spannerio_write_it_test.py::SpannerWriteIntegrationTest::test_spanner_update 
apache_beam/io/gcp/experimental/spannerio_write_it_test.py::SpannerWriteIntegrationTest::test_write_batches 
[gw0] PASSED apache_beam/io/gcp/experimental/spannerio_read_it_test.py::SpannerReadIntegrationTest::test_read_via_table 
apache_beam/io/gcp/experimental/spannerio_read_it_test.py::SpannerReadIntegrationTest::test_sql_metrics_error_call 
[gw0] SKIPPED apache_beam/io/gcp/experimental/spannerio_read_it_test.py::SpannerReadIntegrationTest::test_sql_metrics_error_call 
apache_beam/io/gcp/experimental/spannerio_read_it_test.py::SpannerReadIntegrationTest::test_sql_metrics_ok_call 
[gw0] SKIPPED apache_beam/io/gcp/experimental/spannerio_read_it_test.py::SpannerReadIntegrationTest::test_sql_metrics_ok_call 
apache_beam/io/gcp/experimental/spannerio_read_it_test.py::SpannerReadIntegrationTest::test_table_metrics_error_call 
[gw0] SKIPPED apache_beam/io/gcp/experimental/spannerio_read_it_test.py::SpannerReadIntegrationTest::test_table_metrics_error_call 
apache_beam/io/gcp/experimental/spannerio_read_it_test.py::SpannerReadIntegrationTest::test_table_metrics_ok_call 
[gw0] SKIPPED apache_beam/io/gcp/experimental/spannerio_read_it_test.py::SpannerReadIntegrationTest::test_table_metrics_ok_call 
apache_beam/io/gcp/experimental/spannerio_read_it_test.py::SpannerReadIntegrationTest::test_transaction_sql_metrics_error_call 
[gw0] SKIPPED apache_beam/io/gcp/experimental/spannerio_read_it_test.py::SpannerReadIntegrationTest::test_transaction_sql_metrics_error_call 
apache_beam/io/gcp/experimental/spannerio_read_it_test.py::SpannerReadIntegrationTest::test_transaction_sql_metrics_ok_call 
[gw0] SKIPPED apache_beam/io/gcp/experimental/spannerio_read_it_test.py::SpannerReadIntegrationTest::test_transaction_sql_metrics_ok_call 
apache_beam/io/gcp/experimental/spannerio_read_it_test.py::SpannerReadIntegrationTest::test_transaction_table_metrics_error_call 
[gw0] SKIPPED apache_beam/io/gcp/experimental/spannerio_read_it_test.py::SpannerReadIntegrationTest::test_transaction_table_metrics_error_call 
apache_beam/io/gcp/experimental/spannerio_read_it_test.py::SpannerReadIntegrationTest::test_transaction_table_metrics_ok_call 
[gw0] SKIPPED apache_beam/io/gcp/experimental/spannerio_read_it_test.py::SpannerReadIntegrationTest::test_transaction_table_metrics_ok_call 
[gw1] PASSED apache_beam/io/gcp/experimental/spannerio_write_it_test.py::SpannerWriteIntegrationTest::test_write_batches 

=============================== warnings summary ===============================
../../build/gradleenv/-1734967052/lib/python3.7/site-packages/hdfs/config.py:15
../../build/gradleenv/-1734967052/lib/python3.7/site-packages/hdfs/config.py:15
../../build/gradleenv/-1734967052/lib/python3.7/site-packages/hdfs/config.py:15
../../build/gradleenv/-1734967052/lib/python3.7/site-packages/hdfs/config.py:15
../../build/gradleenv/-1734967052/lib/python3.7/site-packages/hdfs/config.py:15
../../build/gradleenv/-1734967052/lib/python3.7/site-packages/hdfs/config.py:15
../../build/gradleenv/-1734967052/lib/python3.7/site-packages/hdfs/config.py:15
../../build/gradleenv/-1734967052/lib/python3.7/site-packages/hdfs/config.py:15
../../build/gradleenv/-1734967052/lib/python3.7/site-packages/hdfs/config.py:15
  <https://ci-beam.apache.org/job/beam_PostCommit_Python37/ws/src/build/gradleenv/-1734967052/lib/python3.7/site-packages/hdfs/config.py>:15: DeprecationWarning: the imp module is deprecated in favour of importlib; see the module's documentation for alternative uses
    from imp import load_source

../../build/gradleenv/-1734967052/lib/python3.7/site-packages/pkg_resources/__init__.py:2804: 171 warnings
  <https://ci-beam.apache.org/job/beam_PostCommit_Python37/ws/src/build/gradleenv/-1734967052/lib/python3.7/site-packages/pkg_resources/__init__.py>:2804: DeprecationWarning: Deprecated call to `pkg_resources.declare_namespace('google')`.
  Implementing implicit namespace packages (as specified in PEP 420) is preferred to `pkg_resources.declare_namespace`. See https://setuptools.pypa.io/en/latest/references/keywords.html#keyword-namespace-packages
    declare_namespace(pkg)

../../build/gradleenv/-1734967052/lib/python3.7/site-packages/pkg_resources/__init__.py:2804: 117 warnings
  <https://ci-beam.apache.org/job/beam_PostCommit_Python37/ws/src/build/gradleenv/-1734967052/lib/python3.7/site-packages/pkg_resources/__init__.py>:2804: DeprecationWarning: Deprecated call to `pkg_resources.declare_namespace('google.cloud')`.
  Implementing implicit namespace packages (as specified in PEP 420) is preferred to `pkg_resources.declare_namespace`. See https://setuptools.pypa.io/en/latest/references/keywords.html#keyword-namespace-packages
    declare_namespace(pkg)

../../build/gradleenv/-1734967052/lib/python3.7/site-packages/pkg_resources/__init__.py:2309: 36 warnings
  <https://ci-beam.apache.org/job/beam_PostCommit_Python37/ws/src/build/gradleenv/-1734967052/lib/python3.7/site-packages/pkg_resources/__init__.py>:2309: DeprecationWarning: Deprecated call to `pkg_resources.declare_namespace('google')`.
  Implementing implicit namespace packages (as specified in PEP 420) is preferred to `pkg_resources.declare_namespace`. See https://setuptools.pypa.io/en/latest/references/keywords.html#keyword-namespace-packages
    declare_namespace(parent)

../../build/gradleenv/-1734967052/lib/python3.7/site-packages/pkg_resources/__init__.py:2804
../../build/gradleenv/-1734967052/lib/python3.7/site-packages/pkg_resources/__init__.py:2804
../../build/gradleenv/-1734967052/lib/python3.7/site-packages/pkg_resources/__init__.py:2804
../../build/gradleenv/-1734967052/lib/python3.7/site-packages/pkg_resources/__init__.py:2804
../../build/gradleenv/-1734967052/lib/python3.7/site-packages/pkg_resources/__init__.py:2804
../../build/gradleenv/-1734967052/lib/python3.7/site-packages/pkg_resources/__init__.py:2804
../../build/gradleenv/-1734967052/lib/python3.7/site-packages/pkg_resources/__init__.py:2804
../../build/gradleenv/-1734967052/lib/python3.7/site-packages/pkg_resources/__init__.py:2804
../../build/gradleenv/-1734967052/lib/python3.7/site-packages/pkg_resources/__init__.py:2804
  <https://ci-beam.apache.org/job/beam_PostCommit_Python37/ws/src/build/gradleenv/-1734967052/lib/python3.7/site-packages/pkg_resources/__init__.py>:2804: DeprecationWarning: Deprecated call to `pkg_resources.declare_namespace('google.logging')`.
  Implementing implicit namespace packages (as specified in PEP 420) is preferred to `pkg_resources.declare_namespace`. See https://setuptools.pypa.io/en/latest/references/keywords.html#keyword-namespace-packages
    declare_namespace(pkg)

../../build/gradleenv/-1734967052/lib/python3.7/site-packages/pkg_resources/__init__.py:2804
../../build/gradleenv/-1734967052/lib/python3.7/site-packages/pkg_resources/__init__.py:2804
../../build/gradleenv/-1734967052/lib/python3.7/site-packages/pkg_resources/__init__.py:2804
../../build/gradleenv/-1734967052/lib/python3.7/site-packages/pkg_resources/__init__.py:2804
../../build/gradleenv/-1734967052/lib/python3.7/site-packages/pkg_resources/__init__.py:2804
../../build/gradleenv/-1734967052/lib/python3.7/site-packages/pkg_resources/__init__.py:2804
../../build/gradleenv/-1734967052/lib/python3.7/site-packages/pkg_resources/__init__.py:2804
../../build/gradleenv/-1734967052/lib/python3.7/site-packages/pkg_resources/__init__.py:2804
../../build/gradleenv/-1734967052/lib/python3.7/site-packages/pkg_resources/__init__.py:2804
  <https://ci-beam.apache.org/job/beam_PostCommit_Python37/ws/src/build/gradleenv/-1734967052/lib/python3.7/site-packages/pkg_resources/__init__.py>:2804: DeprecationWarning: Deprecated call to `pkg_resources.declare_namespace('google.iam')`.
  Implementing implicit namespace packages (as specified in PEP 420) is preferred to `pkg_resources.declare_namespace`. See https://setuptools.pypa.io/en/latest/references/keywords.html#keyword-namespace-packages
    declare_namespace(pkg)

../../build/gradleenv/-1734967052/lib/python3.7/site-packages/google/rpc/__init__.py:20
../../build/gradleenv/-1734967052/lib/python3.7/site-packages/google/rpc/__init__.py:20
../../build/gradleenv/-1734967052/lib/python3.7/site-packages/google/rpc/__init__.py:20
../../build/gradleenv/-1734967052/lib/python3.7/site-packages/google/rpc/__init__.py:20
../../build/gradleenv/-1734967052/lib/python3.7/site-packages/google/rpc/__init__.py:20
../../build/gradleenv/-1734967052/lib/python3.7/site-packages/google/rpc/__init__.py:20
../../build/gradleenv/-1734967052/lib/python3.7/site-packages/google/rpc/__init__.py:20
../../build/gradleenv/-1734967052/lib/python3.7/site-packages/google/rpc/__init__.py:20
../../build/gradleenv/-1734967052/lib/python3.7/site-packages/google/rpc/__init__.py:20
  <https://ci-beam.apache.org/job/beam_PostCommit_Python37/ws/src/build/gradleenv/-1734967052/lib/python3.7/site-packages/google/rpc/__init__.py>:20: DeprecationWarning: Deprecated call to `pkg_resources.declare_namespace('google.rpc')`.
  Implementing implicit namespace packages (as specified in PEP 420) is preferred to `pkg_resources.declare_namespace`. See https://setuptools.pypa.io/en/latest/references/keywords.html#keyword-namespace-packages
    pkg_resources.declare_namespace(__name__)

apache_beam/io/gcp/experimental/spannerio_read_it_test.py::SpannerReadIntegrationTest::test_read_via_sql
  <https://ci-beam.apache.org/job/beam_PostCommit_Python37/ws/src/sdks/python/apache_beam/io/gcp/experimental/spannerio_read_it_test.py>:128: FutureWarning: ReadFromSpanner is experimental. No backwards-compatibility guarantees.
    sql="select * from Users")

apache_beam/io/gcp/experimental/spannerio_write_it_test.py::SpannerWriteIntegrationTest::test_spanner_error
  <https://ci-beam.apache.org/job/beam_PostCommit_Python37/ws/src/sdks/python/apache_beam/io/gcp/experimental/spannerio_write_it_test.py>:190: FutureWarning: WriteToSpanner is experimental. No backwards-compatibility guarantees.
    database_id=self.TEST_DATABASE))

apache_beam/io/gcp/experimental/spannerio_write_it_test.py::SpannerWriteIntegrationTest::test_spanner_update
  <https://ci-beam.apache.org/job/beam_PostCommit_Python37/ws/src/sdks/python/apache_beam/io/gcp/experimental/spannerio_write_it_test.py>:171: FutureWarning: WriteToSpanner is experimental. No backwards-compatibility guarantees.
    database_id=self.TEST_DATABASE))

apache_beam/io/gcp/experimental/spannerio_read_it_test.py::SpannerReadIntegrationTest::test_read_via_table
  <https://ci-beam.apache.org/job/beam_PostCommit_Python37/ws/src/sdks/python/apache_beam/io/gcp/experimental/spannerio_read_it_test.py>:117: FutureWarning: ReadFromSpanner is experimental. No backwards-compatibility guarantees.
    columns=["UserId", "Key"])

apache_beam/io/gcp/experimental/spannerio_write_it_test.py::SpannerWriteIntegrationTest::test_write_batches
  <https://ci-beam.apache.org/job/beam_PostCommit_Python37/ws/src/sdks/python/apache_beam/io/gcp/experimental/spannerio_write_it_test.py>:135: FutureWarning: WriteToSpanner is experimental. No backwards-compatibility guarantees.
    max_batch_size_bytes=250))

-- Docs: https://docs.pytest.org/en/stable/how-to/capture-warnings.html
- generated xml file: <https://ci-beam.apache.org/job/beam_PostCommit_Python37/ws/src/sdks/python/pytest_postCommitIT-df-py37.xml> -
=========== 5 passed, 18 skipped, 365 warnings in 1928.68s (0:32:08) ===========

FAILURE: Build failed with an exception.

* Where:
Script '<https://ci-beam.apache.org/job/beam_PostCommit_Python37/ws/src/sdks/python/test-suites/direct/common.gradle'> line: 194

* What went wrong:
Execution failed for task ':sdks:python:test-suites:direct:py37:azureIntegrationTest'.
> Process 'command 'sh'' finished with non-zero exit value 1

* Try:
> Run with --stacktrace option to get the stack trace.
> Run with --info or --debug option to get more log output.

* Get more help at https://help.gradle.org

Deprecated Gradle features were used in this build, making it incompatible with Gradle 8.0.

You can use '--warning-mode all' to show the individual deprecation warnings and determine if they come from your own scripts or plugins.

See https://docs.gradle.org/7.5.1/userguide/command_line_interface.html#sec:command_line_warnings

Execution optimizations have been disabled for 1 invalid unit(s) of work during this build to ensure correctness.
Please consult deprecation warnings for more details.

BUILD FAILED in 4h 21m 50s
216 actionable tasks: 154 executed, 56 from cache, 6 up-to-date

Publishing build scan...
https://gradle.com/s/rcrdrqso6beli

Build step 'Invoke Gradle script' changed build result to FAILURE
Build step 'Invoke Gradle script' marked build as failure

---------------------------------------------------------------------
To unsubscribe, e-mail: builds-unsubscribe@beam.apache.org
For additional commands, e-mail: builds-help@beam.apache.org


Build failed in Jenkins: beam_PostCommit_Python37 #6383

Posted by Apache Jenkins Server <je...@builds.apache.org>.
See <https://ci-beam.apache.org/job/beam_PostCommit_Python37/6383/display/redirect>

Changes:


------------------------------------------
[...truncated 16.39 MB...]
  <https://ci-beam.apache.org/job/beam_PostCommit_Python37/ws/src/sdks/python/apache_beam/io/gcp/bigquery_file_loads.py>:1175: BeamDeprecationWarning: options is deprecated since First stable release. References to <pipeline>.options will not be supported
    p.options.view_as(GoogleCloudOptions).job_name or 'AUTOMATIC_JOB_NAME')

apache_beam/examples/cookbook/bigquery_tornadoes_it_test.py::BigqueryTornadoesIT::test_bigquery_tornadoes_it
  <https://ci-beam.apache.org/job/beam_PostCommit_Python37/ws/src/sdks/python/apache_beam/io/gcp/tests/utils.py>:100: PendingDeprecationWarning: Client.dataset is deprecated and will be removed in a future version. Use a string like 'my_project.my_dataset' or a cloud.google.bigquery.DatasetReference object, instead.
    table_ref = client.dataset(dataset_id).table(table_id)

apache_beam/examples/dataframe/flight_delays_it_test.py::FlightDelaysTest::test_flight_delays
  <https://ci-beam.apache.org/job/beam_PostCommit_Python37/ws/src/sdks/python/apache_beam/examples/dataframe/flight_delays.py>:47: FutureWarning: Dropping of nuisance columns in DataFrame reductions (with 'numeric_only=None') is deprecated; in a future version this will raise TypeError.  Select only valid columns before calling the reduction.
    return airline_df[at_top_airports].mean()

apache_beam/examples/dataframe/flight_delays_it_test.py::FlightDelaysTest::test_flight_delays
apache_beam/examples/dataframe/taxiride_it_test.py::TaxirideIT::test_aggregation
apache_beam/examples/dataframe/taxiride_it_test.py::TaxirideIT::test_enrich
  <https://ci-beam.apache.org/job/beam_PostCommit_Python37/ws/src/sdks/python/apache_beam/dataframe/io.py>:664: FutureWarning: WriteToFiles is experimental.
    sink=lambda _: _WriteToPandasFileSink(

apache_beam/examples/dataframe/flight_delays_it_test.py::FlightDelaysTest::test_flight_delays
apache_beam/examples/dataframe/taxiride_it_test.py::TaxirideIT::test_aggregation
apache_beam/examples/dataframe/taxiride_it_test.py::TaxirideIT::test_enrich
  <https://ci-beam.apache.org/job/beam_PostCommit_Python37/ws/src/sdks/python/apache_beam/io/fileio.py>:596: BeamDeprecationWarning: options is deprecated since First stable release. References to <pipeline>.options will not be supported
    p.options.view_as(GoogleCloudOptions).temp_location or

apache_beam/io/gcp/bigquery_read_it_test.py::ReadTests::test_native_source
  <https://ci-beam.apache.org/job/beam_PostCommit_Python37/ws/src/sdks/python/apache_beam/io/gcp/bigquery_read_it_test.py>:170: BeamDeprecationWarning: BigQuerySource is deprecated since 2.25.0. Use ReadFromBigQuery instead.
    beam.io.BigQuerySource(query=self.query, use_standard_sql=True)))

apache_beam/ml/gcp/cloud_dlp_it_test.py::CloudDLPIT::test_deidentification
  <https://ci-beam.apache.org/job/beam_PostCommit_Python37/ws/src/sdks/python/apache_beam/ml/gcp/cloud_dlp_it_test.py>:77: FutureWarning: MaskDetectedDetails is experimental.
    inspection_config=INSPECT_CONFIG))

apache_beam/ml/gcp/cloud_dlp_it_test.py::CloudDLPIT::test_inspection
  <https://ci-beam.apache.org/job/beam_PostCommit_Python37/ws/src/sdks/python/apache_beam/ml/gcp/cloud_dlp_it_test.py>:87: FutureWarning: InspectForDetails is experimental.
    | beam.ParDo(extract_inspection_results).with_outputs(

apache_beam/io/gcp/bigquery_test.py::BigQueryStreamingInsertTransformIntegrationTests::test_multiple_destinations_transform
  <https://ci-beam.apache.org/job/beam_PostCommit_Python37/ws/src/sdks/python/apache_beam/io/gcp/bigquery_test.py>:1690: BeamDeprecationWarning: options is deprecated since First stable release. References to <pipeline>.options will not be supported
    streaming = self.test_pipeline.options.view_as(StandardOptions).streaming

apache_beam/ml/inference/sklearn_inference_it_test.py::SklearnInference::test_sklearn_regression
  <https://ci-beam.apache.org/job/beam_PostCommit_Python37/ws/src/sdks/python/apache_beam/examples/inference/sklearn_japanese_housing_regression.py>:129: FutureWarning: SklearnModelHandlerPandas is experimental. No backwards-compatibility guarantees.
    model_file_type=ModelFileType.PICKLE, model_uri=model_filename)

apache_beam/ml/inference/sklearn_inference_it_test.py::SklearnInference::test_sklearn_regression
  <https://ci-beam.apache.org/job/beam_PostCommit_Python37/ws/src/build/gradleenv/-1734967052/lib/python3.7/site-packages/dill/_dill.py>:472: FutureWarning: SklearnModelHandlerPandas is experimental. No backwards-compatibility guarantees.
    obj = StockUnpickler.load(self)

apache_beam/io/gcp/bigquery_read_it_test.py::ReadNewTypesTests::test_native_source
  <https://ci-beam.apache.org/job/beam_PostCommit_Python37/ws/src/sdks/python/apache_beam/io/gcp/bigquery_read_it_test.py>:693: BeamDeprecationWarning: BigQuerySource is deprecated since 2.25.0. Use ReadFromBigQuery instead.
    beam.io.BigQuerySource(query=self.query, use_standard_sql=True)))

apache_beam/io/gcp/bigquery_read_it_test.py::ReadAllBQTests::test_read_queries
  <https://ci-beam.apache.org/job/beam_PostCommit_Python37/ws/src/sdks/python/apache_beam/io/gcp/bigquery_read_it_test.py>:808: FutureWarning: ReadAllFromBigQuery is experimental.
    | beam.io.ReadAllFromBigQuery())

apache_beam/io/gcp/bigquery_read_it_test.py::ReadAllBQTests::test_read_queries
  <https://ci-beam.apache.org/job/beam_PostCommit_Python37/ws/src/sdks/python/apache_beam/io/gcp/bigquery.py>:2658: BeamDeprecationWarning: options is deprecated since First stable release. References to <pipeline>.options will not be supported
    job_name = pcoll.pipeline.options.view_as(GoogleCloudOptions).job_name

apache_beam/io/gcp/bigquery_read_it_test.py::ReadAllBQTests::test_read_queries
  <https://ci-beam.apache.org/job/beam_PostCommit_Python37/ws/src/sdks/python/apache_beam/io/gcp/bigquery.py>:2659: BeamDeprecationWarning: options is deprecated since First stable release. References to <pipeline>.options will not be supported
    project = pcoll.pipeline.options.view_as(GoogleCloudOptions).project

apache_beam/io/gcp/bigquery_read_it_test.py::ReadAllBQTests::test_read_queries
  <https://ci-beam.apache.org/job/beam_PostCommit_Python37/ws/src/sdks/python/apache_beam/io/gcp/bigquery.py>:2672: BeamDeprecationWarning: options is deprecated since First stable release. References to <pipeline>.options will not be supported
    options=pcoll.pipeline.options,

-- Docs: https://docs.pytest.org/en/stable/how-to/capture-warnings.html
- generated xml file: <https://ci-beam.apache.org/job/beam_PostCommit_Python37/ws/src/sdks/python/pytest_postCommitIT-df-py37.xml> -
========== 85 passed, 28 skipped, 576 warnings in 14233.19s (3:57:13) ==========

> Task :sdks:python:test-suites:dataflow:py37:spannerioIT
>>> RUNNING integration tests with pipeline options: --runner=TestDataflowRunner --project=apache-beam-testing --region=us-central1 --staging_location=gs://temp-storage-for-end-to-end-tests/staging-it --temp_location=gs://temp-storage-for-end-to-end-tests/temp-it --output=gs://temp-storage-for-end-to-end-tests/py-it-cloud/output --sdk_location=<https://ci-beam.apache.org/job/beam_PostCommit_Python37/ws/src/sdks/python/build/apache-beam.tar.gz> --requirements_file=postcommit_requirements.txt --num_workers=1 --sleep_secs=20 --kms_key_name=projects/apache-beam-testing/locations/global/keyRings/beam-it/cryptoKeys/test --dataflow_kms_key=projects/apache-beam-testing/locations/global/keyRings/beam-it/cryptoKeys/test
>>>   pytest options: --capture=no --timeout=4500 --color=yes --log-cli-level=INFO --numprocesses=8 --dist=loadfile
>>>   collect markers: -m=spannerio_it
============================= test session starts ==============================
platform linux -- Python 3.7.12, pytest-7.2.1, pluggy-1.0.0
rootdir: <https://ci-beam.apache.org/job/beam_PostCommit_Python37/ws/src/sdks/python,> configfile: pytest.ini
plugins: xdist-2.5.0, timeout-2.1.0, forked-1.6.0, hypothesis-6.68.2, requests-mock-1.10.0
timeout: 4500.0s
timeout method: signal
timeout func_only: False
gw0 I / gw1 I / gw2 I / gw3 I / gw4 I / gw5 I / gw6 I / gw7 I
[gw0] Python 3.7.12 (default, Jan 15 2022, 18:42:10)  -- [GCC 9.3.0]
[gw1] Python 3.7.12 (default, Jan 15 2022, 18:42:10)  -- [GCC 9.3.0]
[gw2] Python 3.7.12 (default, Jan 15 2022, 18:42:10)  -- [GCC 9.3.0]
[gw3] Python 3.7.12 (default, Jan 15 2022, 18:42:10)  -- [GCC 9.3.0]
[gw4] Python 3.7.12 (default, Jan 15 2022, 18:42:10)  -- [GCC 9.3.0]
[gw5] Python 3.7.12 (default, Jan 15 2022, 18:42:10)  -- [GCC 9.3.0]
[gw6] Python 3.7.12 (default, Jan 15 2022, 18:42:10)  -- [GCC 9.3.0]
[gw7] Python 3.7.12 (default, Jan 15 2022, 18:42:10)  -- [GCC 9.3.0]
gw0 [15] / gw1 [15] / gw2 [15] / gw3 [15] / gw4 [15] / gw5 [15] / gw6 [15] / gw7 [15]

scheduling tests via LoadFileScheduling

apache_beam/io/gcp/experimental/spannerio_read_it_test.py::SpannerReadIntegrationTest::test_read_via_sql 
apache_beam/io/gcp/experimental/spannerio_write_it_test.py::SpannerWriteIntegrationTest::test_metrics_error_call 
[gw1] SKIPPED apache_beam/io/gcp/experimental/spannerio_write_it_test.py::SpannerWriteIntegrationTest::test_metrics_error_call 
apache_beam/io/gcp/experimental/spannerio_write_it_test.py::SpannerWriteIntegrationTest::test_metrics_ok_call 
[gw1] SKIPPED apache_beam/io/gcp/experimental/spannerio_write_it_test.py::SpannerWriteIntegrationTest::test_metrics_ok_call 
apache_beam/io/gcp/experimental/spannerio_write_it_test.py::SpannerWriteIntegrationTest::test_spanner_error 
[gw1] PASSED apache_beam/io/gcp/experimental/spannerio_write_it_test.py::SpannerWriteIntegrationTest::test_spanner_error 
apache_beam/io/gcp/experimental/spannerio_write_it_test.py::SpannerWriteIntegrationTest::test_spanner_update 
[gw0] PASSED apache_beam/io/gcp/experimental/spannerio_read_it_test.py::SpannerReadIntegrationTest::test_read_via_sql 
apache_beam/io/gcp/experimental/spannerio_read_it_test.py::SpannerReadIntegrationTest::test_read_via_table 
[gw1] PASSED apache_beam/io/gcp/experimental/spannerio_write_it_test.py::SpannerWriteIntegrationTest::test_spanner_update 
apache_beam/io/gcp/experimental/spannerio_write_it_test.py::SpannerWriteIntegrationTest::test_write_batches 
[gw0] PASSED apache_beam/io/gcp/experimental/spannerio_read_it_test.py::SpannerReadIntegrationTest::test_read_via_table 
apache_beam/io/gcp/experimental/spannerio_read_it_test.py::SpannerReadIntegrationTest::test_sql_metrics_error_call 
[gw0] SKIPPED apache_beam/io/gcp/experimental/spannerio_read_it_test.py::SpannerReadIntegrationTest::test_sql_metrics_error_call 
apache_beam/io/gcp/experimental/spannerio_read_it_test.py::SpannerReadIntegrationTest::test_sql_metrics_ok_call 
[gw0] SKIPPED apache_beam/io/gcp/experimental/spannerio_read_it_test.py::SpannerReadIntegrationTest::test_sql_metrics_ok_call 
apache_beam/io/gcp/experimental/spannerio_read_it_test.py::SpannerReadIntegrationTest::test_table_metrics_error_call 
[gw0] SKIPPED apache_beam/io/gcp/experimental/spannerio_read_it_test.py::SpannerReadIntegrationTest::test_table_metrics_error_call 
apache_beam/io/gcp/experimental/spannerio_read_it_test.py::SpannerReadIntegrationTest::test_table_metrics_ok_call 
[gw0] SKIPPED apache_beam/io/gcp/experimental/spannerio_read_it_test.py::SpannerReadIntegrationTest::test_table_metrics_ok_call 
apache_beam/io/gcp/experimental/spannerio_read_it_test.py::SpannerReadIntegrationTest::test_transaction_sql_metrics_error_call 
[gw0] SKIPPED apache_beam/io/gcp/experimental/spannerio_read_it_test.py::SpannerReadIntegrationTest::test_transaction_sql_metrics_error_call 
apache_beam/io/gcp/experimental/spannerio_read_it_test.py::SpannerReadIntegrationTest::test_transaction_sql_metrics_ok_call 
[gw0] SKIPPED apache_beam/io/gcp/experimental/spannerio_read_it_test.py::SpannerReadIntegrationTest::test_transaction_sql_metrics_ok_call 
apache_beam/io/gcp/experimental/spannerio_read_it_test.py::SpannerReadIntegrationTest::test_transaction_table_metrics_error_call 
[gw0] SKIPPED apache_beam/io/gcp/experimental/spannerio_read_it_test.py::SpannerReadIntegrationTest::test_transaction_table_metrics_error_call 
apache_beam/io/gcp/experimental/spannerio_read_it_test.py::SpannerReadIntegrationTest::test_transaction_table_metrics_ok_call 
[gw0] SKIPPED apache_beam/io/gcp/experimental/spannerio_read_it_test.py::SpannerReadIntegrationTest::test_transaction_table_metrics_ok_call 
[gw1] PASSED apache_beam/io/gcp/experimental/spannerio_write_it_test.py::SpannerWriteIntegrationTest::test_write_batches 

=============================== warnings summary ===============================
../../build/gradleenv/-1734967052/lib/python3.7/site-packages/hdfs/config.py:15
../../build/gradleenv/-1734967052/lib/python3.7/site-packages/hdfs/config.py:15
../../build/gradleenv/-1734967052/lib/python3.7/site-packages/hdfs/config.py:15
../../build/gradleenv/-1734967052/lib/python3.7/site-packages/hdfs/config.py:15
../../build/gradleenv/-1734967052/lib/python3.7/site-packages/hdfs/config.py:15
../../build/gradleenv/-1734967052/lib/python3.7/site-packages/hdfs/config.py:15
../../build/gradleenv/-1734967052/lib/python3.7/site-packages/hdfs/config.py:15
../../build/gradleenv/-1734967052/lib/python3.7/site-packages/hdfs/config.py:15
../../build/gradleenv/-1734967052/lib/python3.7/site-packages/hdfs/config.py:15
  <https://ci-beam.apache.org/job/beam_PostCommit_Python37/ws/src/build/gradleenv/-1734967052/lib/python3.7/site-packages/hdfs/config.py>:15: DeprecationWarning: the imp module is deprecated in favour of importlib; see the module's documentation for alternative uses
    from imp import load_source

../../build/gradleenv/-1734967052/lib/python3.7/site-packages/pkg_resources/__init__.py:2804: 171 warnings
  <https://ci-beam.apache.org/job/beam_PostCommit_Python37/ws/src/build/gradleenv/-1734967052/lib/python3.7/site-packages/pkg_resources/__init__.py>:2804: DeprecationWarning: Deprecated call to `pkg_resources.declare_namespace('google')`.
  Implementing implicit namespace packages (as specified in PEP 420) is preferred to `pkg_resources.declare_namespace`. See https://setuptools.pypa.io/en/latest/references/keywords.html#keyword-namespace-packages
    declare_namespace(pkg)

../../build/gradleenv/-1734967052/lib/python3.7/site-packages/pkg_resources/__init__.py:2804: 117 warnings
  <https://ci-beam.apache.org/job/beam_PostCommit_Python37/ws/src/build/gradleenv/-1734967052/lib/python3.7/site-packages/pkg_resources/__init__.py>:2804: DeprecationWarning: Deprecated call to `pkg_resources.declare_namespace('google.cloud')`.
  Implementing implicit namespace packages (as specified in PEP 420) is preferred to `pkg_resources.declare_namespace`. See https://setuptools.pypa.io/en/latest/references/keywords.html#keyword-namespace-packages
    declare_namespace(pkg)

../../build/gradleenv/-1734967052/lib/python3.7/site-packages/pkg_resources/__init__.py:2309: 36 warnings
  <https://ci-beam.apache.org/job/beam_PostCommit_Python37/ws/src/build/gradleenv/-1734967052/lib/python3.7/site-packages/pkg_resources/__init__.py>:2309: DeprecationWarning: Deprecated call to `pkg_resources.declare_namespace('google')`.
  Implementing implicit namespace packages (as specified in PEP 420) is preferred to `pkg_resources.declare_namespace`. See https://setuptools.pypa.io/en/latest/references/keywords.html#keyword-namespace-packages
    declare_namespace(parent)

../../build/gradleenv/-1734967052/lib/python3.7/site-packages/pkg_resources/__init__.py:2804
../../build/gradleenv/-1734967052/lib/python3.7/site-packages/pkg_resources/__init__.py:2804
../../build/gradleenv/-1734967052/lib/python3.7/site-packages/pkg_resources/__init__.py:2804
../../build/gradleenv/-1734967052/lib/python3.7/site-packages/pkg_resources/__init__.py:2804
../../build/gradleenv/-1734967052/lib/python3.7/site-packages/pkg_resources/__init__.py:2804
../../build/gradleenv/-1734967052/lib/python3.7/site-packages/pkg_resources/__init__.py:2804
../../build/gradleenv/-1734967052/lib/python3.7/site-packages/pkg_resources/__init__.py:2804
../../build/gradleenv/-1734967052/lib/python3.7/site-packages/pkg_resources/__init__.py:2804
../../build/gradleenv/-1734967052/lib/python3.7/site-packages/pkg_resources/__init__.py:2804
  <https://ci-beam.apache.org/job/beam_PostCommit_Python37/ws/src/build/gradleenv/-1734967052/lib/python3.7/site-packages/pkg_resources/__init__.py>:2804: DeprecationWarning: Deprecated call to `pkg_resources.declare_namespace('google.logging')`.
  Implementing implicit namespace packages (as specified in PEP 420) is preferred to `pkg_resources.declare_namespace`. See https://setuptools.pypa.io/en/latest/references/keywords.html#keyword-namespace-packages
    declare_namespace(pkg)

../../build/gradleenv/-1734967052/lib/python3.7/site-packages/pkg_resources/__init__.py:2804
../../build/gradleenv/-1734967052/lib/python3.7/site-packages/pkg_resources/__init__.py:2804
../../build/gradleenv/-1734967052/lib/python3.7/site-packages/pkg_resources/__init__.py:2804
../../build/gradleenv/-1734967052/lib/python3.7/site-packages/pkg_resources/__init__.py:2804
../../build/gradleenv/-1734967052/lib/python3.7/site-packages/pkg_resources/__init__.py:2804
../../build/gradleenv/-1734967052/lib/python3.7/site-packages/pkg_resources/__init__.py:2804
../../build/gradleenv/-1734967052/lib/python3.7/site-packages/pkg_resources/__init__.py:2804
../../build/gradleenv/-1734967052/lib/python3.7/site-packages/pkg_resources/__init__.py:2804
../../build/gradleenv/-1734967052/lib/python3.7/site-packages/pkg_resources/__init__.py:2804
  <https://ci-beam.apache.org/job/beam_PostCommit_Python37/ws/src/build/gradleenv/-1734967052/lib/python3.7/site-packages/pkg_resources/__init__.py>:2804: DeprecationWarning: Deprecated call to `pkg_resources.declare_namespace('google.iam')`.
  Implementing implicit namespace packages (as specified in PEP 420) is preferred to `pkg_resources.declare_namespace`. See https://setuptools.pypa.io/en/latest/references/keywords.html#keyword-namespace-packages
    declare_namespace(pkg)

../../build/gradleenv/-1734967052/lib/python3.7/site-packages/google/rpc/__init__.py:20
../../build/gradleenv/-1734967052/lib/python3.7/site-packages/google/rpc/__init__.py:20
../../build/gradleenv/-1734967052/lib/python3.7/site-packages/google/rpc/__init__.py:20
../../build/gradleenv/-1734967052/lib/python3.7/site-packages/google/rpc/__init__.py:20
../../build/gradleenv/-1734967052/lib/python3.7/site-packages/google/rpc/__init__.py:20
../../build/gradleenv/-1734967052/lib/python3.7/site-packages/google/rpc/__init__.py:20
../../build/gradleenv/-1734967052/lib/python3.7/site-packages/google/rpc/__init__.py:20
../../build/gradleenv/-1734967052/lib/python3.7/site-packages/google/rpc/__init__.py:20
../../build/gradleenv/-1734967052/lib/python3.7/site-packages/google/rpc/__init__.py:20
  <https://ci-beam.apache.org/job/beam_PostCommit_Python37/ws/src/build/gradleenv/-1734967052/lib/python3.7/site-packages/google/rpc/__init__.py>:20: DeprecationWarning: Deprecated call to `pkg_resources.declare_namespace('google.rpc')`.
  Implementing implicit namespace packages (as specified in PEP 420) is preferred to `pkg_resources.declare_namespace`. See https://setuptools.pypa.io/en/latest/references/keywords.html#keyword-namespace-packages
    pkg_resources.declare_namespace(__name__)

apache_beam/io/gcp/experimental/spannerio_write_it_test.py::SpannerWriteIntegrationTest::test_spanner_error
  <https://ci-beam.apache.org/job/beam_PostCommit_Python37/ws/src/sdks/python/apache_beam/io/gcp/experimental/spannerio_write_it_test.py>:190: FutureWarning: WriteToSpanner is experimental. No backwards-compatibility guarantees.
    database_id=self.TEST_DATABASE))

apache_beam/io/gcp/experimental/spannerio_read_it_test.py::SpannerReadIntegrationTest::test_read_via_sql
  <https://ci-beam.apache.org/job/beam_PostCommit_Python37/ws/src/sdks/python/apache_beam/io/gcp/experimental/spannerio_read_it_test.py>:128: FutureWarning: ReadFromSpanner is experimental. No backwards-compatibility guarantees.
    sql="select * from Users")

apache_beam/io/gcp/experimental/spannerio_write_it_test.py::SpannerWriteIntegrationTest::test_spanner_update
  <https://ci-beam.apache.org/job/beam_PostCommit_Python37/ws/src/sdks/python/apache_beam/io/gcp/experimental/spannerio_write_it_test.py>:171: FutureWarning: WriteToSpanner is experimental. No backwards-compatibility guarantees.
    database_id=self.TEST_DATABASE))

apache_beam/io/gcp/experimental/spannerio_read_it_test.py::SpannerReadIntegrationTest::test_read_via_table
  <https://ci-beam.apache.org/job/beam_PostCommit_Python37/ws/src/sdks/python/apache_beam/io/gcp/experimental/spannerio_read_it_test.py>:117: FutureWarning: ReadFromSpanner is experimental. No backwards-compatibility guarantees.
    columns=["UserId", "Key"])

apache_beam/io/gcp/experimental/spannerio_write_it_test.py::SpannerWriteIntegrationTest::test_write_batches
  <https://ci-beam.apache.org/job/beam_PostCommit_Python37/ws/src/sdks/python/apache_beam/io/gcp/experimental/spannerio_write_it_test.py>:135: FutureWarning: WriteToSpanner is experimental. No backwards-compatibility guarantees.
    max_batch_size_bytes=250))

-- Docs: https://docs.pytest.org/en/stable/how-to/capture-warnings.html
- generated xml file: <https://ci-beam.apache.org/job/beam_PostCommit_Python37/ws/src/sdks/python/pytest_postCommitIT-df-py37.xml> -
=========== 5 passed, 18 skipped, 365 warnings in 1950.16s (0:32:30) ===========

FAILURE: Build failed with an exception.

* Where:
Script '<https://ci-beam.apache.org/job/beam_PostCommit_Python37/ws/src/sdks/python/test-suites/direct/common.gradle'> line: 194

* What went wrong:
Execution failed for task ':sdks:python:test-suites:direct:py37:azureIntegrationTest'.
> Process 'command 'sh'' finished with non-zero exit value 1

* Try:
> Run with --stacktrace option to get the stack trace.
> Run with --info or --debug option to get more log output.

* Get more help at https://help.gradle.org

Deprecated Gradle features were used in this build, making it incompatible with Gradle 8.0.

You can use '--warning-mode all' to show the individual deprecation warnings and determine if they come from your own scripts or plugins.

See https://docs.gradle.org/7.5.1/userguide/command_line_interface.html#sec:command_line_warnings

Execution optimizations have been disabled for 1 invalid unit(s) of work during this build to ensure correctness.
Please consult deprecation warnings for more details.

BUILD FAILED in 4h 31m 46s
216 actionable tasks: 151 executed, 59 from cache, 6 up-to-date

Publishing build scan...
https://gradle.com/s/axcgbt4swtvni

Build step 'Invoke Gradle script' changed build result to FAILURE
Build step 'Invoke Gradle script' marked build as failure

---------------------------------------------------------------------
To unsubscribe, e-mail: builds-unsubscribe@beam.apache.org
For additional commands, e-mail: builds-help@beam.apache.org


Build failed in Jenkins: beam_PostCommit_Python37 #6382

Posted by Apache Jenkins Server <je...@builds.apache.org>.
See <https://ci-beam.apache.org/job/beam_PostCommit_Python37/6382/display/redirect>

Changes:


------------------------------------------
[...truncated 17.30 MB...]
  <https://ci-beam.apache.org/job/beam_PostCommit_Python37/ws/src/sdks/python/apache_beam/io/gcp/bigquery_file_loads.py>:1175: BeamDeprecationWarning: options is deprecated since First stable release. References to <pipeline>.options will not be supported
    p.options.view_as(GoogleCloudOptions).job_name or 'AUTOMATIC_JOB_NAME')

apache_beam/examples/cookbook/bigquery_tornadoes_it_test.py::BigqueryTornadoesIT::test_bigquery_tornadoes_it
  <https://ci-beam.apache.org/job/beam_PostCommit_Python37/ws/src/sdks/python/apache_beam/io/gcp/tests/utils.py>:100: PendingDeprecationWarning: Client.dataset is deprecated and will be removed in a future version. Use a string like 'my_project.my_dataset' or a cloud.google.bigquery.DatasetReference object, instead.
    table_ref = client.dataset(dataset_id).table(table_id)

apache_beam/examples/dataframe/flight_delays_it_test.py::FlightDelaysTest::test_flight_delays
  <https://ci-beam.apache.org/job/beam_PostCommit_Python37/ws/src/sdks/python/apache_beam/examples/dataframe/flight_delays.py>:47: FutureWarning: Dropping of nuisance columns in DataFrame reductions (with 'numeric_only=None') is deprecated; in a future version this will raise TypeError.  Select only valid columns before calling the reduction.
    return airline_df[at_top_airports].mean()

apache_beam/examples/dataframe/flight_delays_it_test.py::FlightDelaysTest::test_flight_delays
apache_beam/examples/dataframe/taxiride_it_test.py::TaxirideIT::test_aggregation
apache_beam/examples/dataframe/taxiride_it_test.py::TaxirideIT::test_enrich
  <https://ci-beam.apache.org/job/beam_PostCommit_Python37/ws/src/sdks/python/apache_beam/dataframe/io.py>:664: FutureWarning: WriteToFiles is experimental.
    sink=lambda _: _WriteToPandasFileSink(

apache_beam/examples/dataframe/flight_delays_it_test.py::FlightDelaysTest::test_flight_delays
apache_beam/examples/dataframe/taxiride_it_test.py::TaxirideIT::test_aggregation
apache_beam/examples/dataframe/taxiride_it_test.py::TaxirideIT::test_enrich
  <https://ci-beam.apache.org/job/beam_PostCommit_Python37/ws/src/sdks/python/apache_beam/io/fileio.py>:596: BeamDeprecationWarning: options is deprecated since First stable release. References to <pipeline>.options will not be supported
    p.options.view_as(GoogleCloudOptions).temp_location or

apache_beam/io/gcp/bigquery_test.py::BigQueryStreamingInsertTransformIntegrationTests::test_multiple_destinations_transform
  <https://ci-beam.apache.org/job/beam_PostCommit_Python37/ws/src/sdks/python/apache_beam/io/gcp/bigquery_test.py>:1690: BeamDeprecationWarning: options is deprecated since First stable release. References to <pipeline>.options will not be supported
    streaming = self.test_pipeline.options.view_as(StandardOptions).streaming

apache_beam/ml/gcp/cloud_dlp_it_test.py::CloudDLPIT::test_deidentification
  <https://ci-beam.apache.org/job/beam_PostCommit_Python37/ws/src/sdks/python/apache_beam/ml/gcp/cloud_dlp_it_test.py>:77: FutureWarning: MaskDetectedDetails is experimental.
    inspection_config=INSPECT_CONFIG))

apache_beam/io/gcp/bigquery_read_it_test.py::ReadTests::test_native_source
  <https://ci-beam.apache.org/job/beam_PostCommit_Python37/ws/src/sdks/python/apache_beam/io/gcp/bigquery_read_it_test.py>:170: BeamDeprecationWarning: BigQuerySource is deprecated since 2.25.0. Use ReadFromBigQuery instead.
    beam.io.BigQuerySource(query=self.query, use_standard_sql=True)))

apache_beam/ml/gcp/cloud_dlp_it_test.py::CloudDLPIT::test_inspection
  <https://ci-beam.apache.org/job/beam_PostCommit_Python37/ws/src/sdks/python/apache_beam/ml/gcp/cloud_dlp_it_test.py>:87: FutureWarning: InspectForDetails is experimental.
    | beam.ParDo(extract_inspection_results).with_outputs(

apache_beam/ml/inference/sklearn_inference_it_test.py::SklearnInference::test_sklearn_regression
  <https://ci-beam.apache.org/job/beam_PostCommit_Python37/ws/src/sdks/python/apache_beam/examples/inference/sklearn_japanese_housing_regression.py>:129: FutureWarning: SklearnModelHandlerPandas is experimental. No backwards-compatibility guarantees.
    model_file_type=ModelFileType.PICKLE, model_uri=model_filename)

apache_beam/ml/inference/sklearn_inference_it_test.py::SklearnInference::test_sklearn_regression
  <https://ci-beam.apache.org/job/beam_PostCommit_Python37/ws/src/build/gradleenv/-1734967052/lib/python3.7/site-packages/dill/_dill.py>:472: FutureWarning: SklearnModelHandlerPandas is experimental. No backwards-compatibility guarantees.
    obj = StockUnpickler.load(self)

apache_beam/io/gcp/bigquery_read_it_test.py::ReadNewTypesTests::test_native_source
  <https://ci-beam.apache.org/job/beam_PostCommit_Python37/ws/src/sdks/python/apache_beam/io/gcp/bigquery_read_it_test.py>:693: BeamDeprecationWarning: BigQuerySource is deprecated since 2.25.0. Use ReadFromBigQuery instead.
    beam.io.BigQuerySource(query=self.query, use_standard_sql=True)))

apache_beam/io/gcp/bigquery_read_it_test.py::ReadAllBQTests::test_read_queries
  <https://ci-beam.apache.org/job/beam_PostCommit_Python37/ws/src/sdks/python/apache_beam/io/gcp/bigquery_read_it_test.py>:808: FutureWarning: ReadAllFromBigQuery is experimental.
    | beam.io.ReadAllFromBigQuery())

apache_beam/io/gcp/bigquery_read_it_test.py::ReadAllBQTests::test_read_queries
  <https://ci-beam.apache.org/job/beam_PostCommit_Python37/ws/src/sdks/python/apache_beam/io/gcp/bigquery.py>:2658: BeamDeprecationWarning: options is deprecated since First stable release. References to <pipeline>.options will not be supported
    job_name = pcoll.pipeline.options.view_as(GoogleCloudOptions).job_name

apache_beam/io/gcp/bigquery_read_it_test.py::ReadAllBQTests::test_read_queries
  <https://ci-beam.apache.org/job/beam_PostCommit_Python37/ws/src/sdks/python/apache_beam/io/gcp/bigquery.py>:2659: BeamDeprecationWarning: options is deprecated since First stable release. References to <pipeline>.options will not be supported
    project = pcoll.pipeline.options.view_as(GoogleCloudOptions).project

apache_beam/io/gcp/bigquery_read_it_test.py::ReadAllBQTests::test_read_queries
  <https://ci-beam.apache.org/job/beam_PostCommit_Python37/ws/src/sdks/python/apache_beam/io/gcp/bigquery.py>:2672: BeamDeprecationWarning: options is deprecated since First stable release. References to <pipeline>.options will not be supported
    options=pcoll.pipeline.options,

-- Docs: https://docs.pytest.org/en/stable/how-to/capture-warnings.html
- generated xml file: <https://ci-beam.apache.org/job/beam_PostCommit_Python37/ws/src/sdks/python/pytest_postCommitIT-df-py37.xml> -
========== 85 passed, 28 skipped, 576 warnings in 15810.92s (4:23:30) ==========

> Task :sdks:python:test-suites:dataflow:py37:spannerioIT
>>> RUNNING integration tests with pipeline options: --runner=TestDataflowRunner --project=apache-beam-testing --region=us-central1 --staging_location=gs://temp-storage-for-end-to-end-tests/staging-it --temp_location=gs://temp-storage-for-end-to-end-tests/temp-it --output=gs://temp-storage-for-end-to-end-tests/py-it-cloud/output --sdk_location=<https://ci-beam.apache.org/job/beam_PostCommit_Python37/ws/src/sdks/python/build/apache-beam.tar.gz> --requirements_file=postcommit_requirements.txt --num_workers=1 --sleep_secs=20 --kms_key_name=projects/apache-beam-testing/locations/global/keyRings/beam-it/cryptoKeys/test --dataflow_kms_key=projects/apache-beam-testing/locations/global/keyRings/beam-it/cryptoKeys/test
>>>   pytest options: --capture=no --timeout=4500 --color=yes --log-cli-level=INFO --numprocesses=8 --dist=loadfile
>>>   collect markers: -m=spannerio_it
============================= test session starts ==============================
platform linux -- Python 3.7.12, pytest-7.2.1, pluggy-1.0.0
rootdir: <https://ci-beam.apache.org/job/beam_PostCommit_Python37/ws/src/sdks/python,> configfile: pytest.ini
plugins: xdist-2.5.0, timeout-2.1.0, forked-1.6.0, hypothesis-6.68.2, requests-mock-1.10.0
timeout: 4500.0s
timeout method: signal
timeout func_only: False
gw0 I / gw1 I / gw2 I / gw3 I / gw4 I / gw5 I / gw6 I / gw7 I
[gw0] Python 3.7.12 (default, Jan 15 2022, 18:42:10)  -- [GCC 9.3.0]
[gw1] Python 3.7.12 (default, Jan 15 2022, 18:42:10)  -- [GCC 9.3.0]
[gw2] Python 3.7.12 (default, Jan 15 2022, 18:42:10)  -- [GCC 9.3.0]
[gw3] Python 3.7.12 (default, Jan 15 2022, 18:42:10)  -- [GCC 9.3.0]
[gw4] Python 3.7.12 (default, Jan 15 2022, 18:42:10)  -- [GCC 9.3.0]
[gw5] Python 3.7.12 (default, Jan 15 2022, 18:42:10)  -- [GCC 9.3.0]
[gw6] Python 3.7.12 (default, Jan 15 2022, 18:42:10)  -- [GCC 9.3.0]
[gw7] Python 3.7.12 (default, Jan 15 2022, 18:42:10)  -- [GCC 9.3.0]
gw0 [15] / gw1 [15] / gw2 [15] / gw3 [15] / gw4 [15] / gw5 [15] / gw6 [15] / gw7 [15]

scheduling tests via LoadFileScheduling

apache_beam/io/gcp/experimental/spannerio_read_it_test.py::SpannerReadIntegrationTest::test_read_via_sql 
apache_beam/io/gcp/experimental/spannerio_write_it_test.py::SpannerWriteIntegrationTest::test_metrics_error_call 
[gw1] SKIPPED apache_beam/io/gcp/experimental/spannerio_write_it_test.py::SpannerWriteIntegrationTest::test_metrics_error_call 
apache_beam/io/gcp/experimental/spannerio_write_it_test.py::SpannerWriteIntegrationTest::test_metrics_ok_call 
[gw1] SKIPPED apache_beam/io/gcp/experimental/spannerio_write_it_test.py::SpannerWriteIntegrationTest::test_metrics_ok_call 
apache_beam/io/gcp/experimental/spannerio_write_it_test.py::SpannerWriteIntegrationTest::test_spanner_error 
[gw0] PASSED apache_beam/io/gcp/experimental/spannerio_read_it_test.py::SpannerReadIntegrationTest::test_read_via_sql 
apache_beam/io/gcp/experimental/spannerio_read_it_test.py::SpannerReadIntegrationTest::test_read_via_table 
[gw1] PASSED apache_beam/io/gcp/experimental/spannerio_write_it_test.py::SpannerWriteIntegrationTest::test_spanner_error 
apache_beam/io/gcp/experimental/spannerio_write_it_test.py::SpannerWriteIntegrationTest::test_spanner_update 
[gw0] PASSED apache_beam/io/gcp/experimental/spannerio_read_it_test.py::SpannerReadIntegrationTest::test_read_via_table 
apache_beam/io/gcp/experimental/spannerio_read_it_test.py::SpannerReadIntegrationTest::test_sql_metrics_error_call 
[gw0] SKIPPED apache_beam/io/gcp/experimental/spannerio_read_it_test.py::SpannerReadIntegrationTest::test_sql_metrics_error_call 
apache_beam/io/gcp/experimental/spannerio_read_it_test.py::SpannerReadIntegrationTest::test_sql_metrics_ok_call 
[gw0] SKIPPED apache_beam/io/gcp/experimental/spannerio_read_it_test.py::SpannerReadIntegrationTest::test_sql_metrics_ok_call 
apache_beam/io/gcp/experimental/spannerio_read_it_test.py::SpannerReadIntegrationTest::test_table_metrics_error_call 
[gw0] SKIPPED apache_beam/io/gcp/experimental/spannerio_read_it_test.py::SpannerReadIntegrationTest::test_table_metrics_error_call 
apache_beam/io/gcp/experimental/spannerio_read_it_test.py::SpannerReadIntegrationTest::test_table_metrics_ok_call 
[gw0] SKIPPED apache_beam/io/gcp/experimental/spannerio_read_it_test.py::SpannerReadIntegrationTest::test_table_metrics_ok_call 
apache_beam/io/gcp/experimental/spannerio_read_it_test.py::SpannerReadIntegrationTest::test_transaction_sql_metrics_error_call 
[gw0] SKIPPED apache_beam/io/gcp/experimental/spannerio_read_it_test.py::SpannerReadIntegrationTest::test_transaction_sql_metrics_error_call 
apache_beam/io/gcp/experimental/spannerio_read_it_test.py::SpannerReadIntegrationTest::test_transaction_sql_metrics_ok_call 
[gw0] SKIPPED apache_beam/io/gcp/experimental/spannerio_read_it_test.py::SpannerReadIntegrationTest::test_transaction_sql_metrics_ok_call 
apache_beam/io/gcp/experimental/spannerio_read_it_test.py::SpannerReadIntegrationTest::test_transaction_table_metrics_error_call 
[gw0] SKIPPED apache_beam/io/gcp/experimental/spannerio_read_it_test.py::SpannerReadIntegrationTest::test_transaction_table_metrics_error_call 
apache_beam/io/gcp/experimental/spannerio_read_it_test.py::SpannerReadIntegrationTest::test_transaction_table_metrics_ok_call 
[gw0] SKIPPED apache_beam/io/gcp/experimental/spannerio_read_it_test.py::SpannerReadIntegrationTest::test_transaction_table_metrics_ok_call 
[gw1] PASSED apache_beam/io/gcp/experimental/spannerio_write_it_test.py::SpannerWriteIntegrationTest::test_spanner_update 
apache_beam/io/gcp/experimental/spannerio_write_it_test.py::SpannerWriteIntegrationTest::test_write_batches 
[gw1] PASSED apache_beam/io/gcp/experimental/spannerio_write_it_test.py::SpannerWriteIntegrationTest::test_write_batches 

=============================== warnings summary ===============================
../../build/gradleenv/-1734967052/lib/python3.7/site-packages/hdfs/config.py:15
../../build/gradleenv/-1734967052/lib/python3.7/site-packages/hdfs/config.py:15
../../build/gradleenv/-1734967052/lib/python3.7/site-packages/hdfs/config.py:15
../../build/gradleenv/-1734967052/lib/python3.7/site-packages/hdfs/config.py:15
../../build/gradleenv/-1734967052/lib/python3.7/site-packages/hdfs/config.py:15
../../build/gradleenv/-1734967052/lib/python3.7/site-packages/hdfs/config.py:15
../../build/gradleenv/-1734967052/lib/python3.7/site-packages/hdfs/config.py:15
../../build/gradleenv/-1734967052/lib/python3.7/site-packages/hdfs/config.py:15
../../build/gradleenv/-1734967052/lib/python3.7/site-packages/hdfs/config.py:15
  <https://ci-beam.apache.org/job/beam_PostCommit_Python37/ws/src/build/gradleenv/-1734967052/lib/python3.7/site-packages/hdfs/config.py>:15: DeprecationWarning: the imp module is deprecated in favour of importlib; see the module's documentation for alternative uses
    from imp import load_source

../../build/gradleenv/-1734967052/lib/python3.7/site-packages/pkg_resources/__init__.py:2804: 171 warnings
  <https://ci-beam.apache.org/job/beam_PostCommit_Python37/ws/src/build/gradleenv/-1734967052/lib/python3.7/site-packages/pkg_resources/__init__.py>:2804: DeprecationWarning: Deprecated call to `pkg_resources.declare_namespace('google')`.
  Implementing implicit namespace packages (as specified in PEP 420) is preferred to `pkg_resources.declare_namespace`. See https://setuptools.pypa.io/en/latest/references/keywords.html#keyword-namespace-packages
    declare_namespace(pkg)

../../build/gradleenv/-1734967052/lib/python3.7/site-packages/pkg_resources/__init__.py:2804: 117 warnings
  <https://ci-beam.apache.org/job/beam_PostCommit_Python37/ws/src/build/gradleenv/-1734967052/lib/python3.7/site-packages/pkg_resources/__init__.py>:2804: DeprecationWarning: Deprecated call to `pkg_resources.declare_namespace('google.cloud')`.
  Implementing implicit namespace packages (as specified in PEP 420) is preferred to `pkg_resources.declare_namespace`. See https://setuptools.pypa.io/en/latest/references/keywords.html#keyword-namespace-packages
    declare_namespace(pkg)

../../build/gradleenv/-1734967052/lib/python3.7/site-packages/pkg_resources/__init__.py:2309: 36 warnings
  <https://ci-beam.apache.org/job/beam_PostCommit_Python37/ws/src/build/gradleenv/-1734967052/lib/python3.7/site-packages/pkg_resources/__init__.py>:2309: DeprecationWarning: Deprecated call to `pkg_resources.declare_namespace('google')`.
  Implementing implicit namespace packages (as specified in PEP 420) is preferred to `pkg_resources.declare_namespace`. See https://setuptools.pypa.io/en/latest/references/keywords.html#keyword-namespace-packages
    declare_namespace(parent)

../../build/gradleenv/-1734967052/lib/python3.7/site-packages/pkg_resources/__init__.py:2804
../../build/gradleenv/-1734967052/lib/python3.7/site-packages/pkg_resources/__init__.py:2804
../../build/gradleenv/-1734967052/lib/python3.7/site-packages/pkg_resources/__init__.py:2804
../../build/gradleenv/-1734967052/lib/python3.7/site-packages/pkg_resources/__init__.py:2804
../../build/gradleenv/-1734967052/lib/python3.7/site-packages/pkg_resources/__init__.py:2804
../../build/gradleenv/-1734967052/lib/python3.7/site-packages/pkg_resources/__init__.py:2804
../../build/gradleenv/-1734967052/lib/python3.7/site-packages/pkg_resources/__init__.py:2804
../../build/gradleenv/-1734967052/lib/python3.7/site-packages/pkg_resources/__init__.py:2804
../../build/gradleenv/-1734967052/lib/python3.7/site-packages/pkg_resources/__init__.py:2804
  <https://ci-beam.apache.org/job/beam_PostCommit_Python37/ws/src/build/gradleenv/-1734967052/lib/python3.7/site-packages/pkg_resources/__init__.py>:2804: DeprecationWarning: Deprecated call to `pkg_resources.declare_namespace('google.logging')`.
  Implementing implicit namespace packages (as specified in PEP 420) is preferred to `pkg_resources.declare_namespace`. See https://setuptools.pypa.io/en/latest/references/keywords.html#keyword-namespace-packages
    declare_namespace(pkg)

../../build/gradleenv/-1734967052/lib/python3.7/site-packages/pkg_resources/__init__.py:2804
../../build/gradleenv/-1734967052/lib/python3.7/site-packages/pkg_resources/__init__.py:2804
../../build/gradleenv/-1734967052/lib/python3.7/site-packages/pkg_resources/__init__.py:2804
../../build/gradleenv/-1734967052/lib/python3.7/site-packages/pkg_resources/__init__.py:2804
../../build/gradleenv/-1734967052/lib/python3.7/site-packages/pkg_resources/__init__.py:2804
../../build/gradleenv/-1734967052/lib/python3.7/site-packages/pkg_resources/__init__.py:2804
../../build/gradleenv/-1734967052/lib/python3.7/site-packages/pkg_resources/__init__.py:2804
../../build/gradleenv/-1734967052/lib/python3.7/site-packages/pkg_resources/__init__.py:2804
../../build/gradleenv/-1734967052/lib/python3.7/site-packages/pkg_resources/__init__.py:2804
  <https://ci-beam.apache.org/job/beam_PostCommit_Python37/ws/src/build/gradleenv/-1734967052/lib/python3.7/site-packages/pkg_resources/__init__.py>:2804: DeprecationWarning: Deprecated call to `pkg_resources.declare_namespace('google.iam')`.
  Implementing implicit namespace packages (as specified in PEP 420) is preferred to `pkg_resources.declare_namespace`. See https://setuptools.pypa.io/en/latest/references/keywords.html#keyword-namespace-packages
    declare_namespace(pkg)

../../build/gradleenv/-1734967052/lib/python3.7/site-packages/google/rpc/__init__.py:20
../../build/gradleenv/-1734967052/lib/python3.7/site-packages/google/rpc/__init__.py:20
../../build/gradleenv/-1734967052/lib/python3.7/site-packages/google/rpc/__init__.py:20
../../build/gradleenv/-1734967052/lib/python3.7/site-packages/google/rpc/__init__.py:20
../../build/gradleenv/-1734967052/lib/python3.7/site-packages/google/rpc/__init__.py:20
../../build/gradleenv/-1734967052/lib/python3.7/site-packages/google/rpc/__init__.py:20
../../build/gradleenv/-1734967052/lib/python3.7/site-packages/google/rpc/__init__.py:20
../../build/gradleenv/-1734967052/lib/python3.7/site-packages/google/rpc/__init__.py:20
../../build/gradleenv/-1734967052/lib/python3.7/site-packages/google/rpc/__init__.py:20
  <https://ci-beam.apache.org/job/beam_PostCommit_Python37/ws/src/build/gradleenv/-1734967052/lib/python3.7/site-packages/google/rpc/__init__.py>:20: DeprecationWarning: Deprecated call to `pkg_resources.declare_namespace('google.rpc')`.
  Implementing implicit namespace packages (as specified in PEP 420) is preferred to `pkg_resources.declare_namespace`. See https://setuptools.pypa.io/en/latest/references/keywords.html#keyword-namespace-packages
    pkg_resources.declare_namespace(__name__)

apache_beam/io/gcp/experimental/spannerio_read_it_test.py::SpannerReadIntegrationTest::test_read_via_sql
  <https://ci-beam.apache.org/job/beam_PostCommit_Python37/ws/src/sdks/python/apache_beam/io/gcp/experimental/spannerio_read_it_test.py>:128: FutureWarning: ReadFromSpanner is experimental. No backwards-compatibility guarantees.
    sql="select * from Users")

apache_beam/io/gcp/experimental/spannerio_write_it_test.py::SpannerWriteIntegrationTest::test_spanner_error
  <https://ci-beam.apache.org/job/beam_PostCommit_Python37/ws/src/sdks/python/apache_beam/io/gcp/experimental/spannerio_write_it_test.py>:190: FutureWarning: WriteToSpanner is experimental. No backwards-compatibility guarantees.
    database_id=self.TEST_DATABASE))

apache_beam/io/gcp/experimental/spannerio_read_it_test.py::SpannerReadIntegrationTest::test_read_via_table
  <https://ci-beam.apache.org/job/beam_PostCommit_Python37/ws/src/sdks/python/apache_beam/io/gcp/experimental/spannerio_read_it_test.py>:117: FutureWarning: ReadFromSpanner is experimental. No backwards-compatibility guarantees.
    columns=["UserId", "Key"])

apache_beam/io/gcp/experimental/spannerio_write_it_test.py::SpannerWriteIntegrationTest::test_spanner_update
  <https://ci-beam.apache.org/job/beam_PostCommit_Python37/ws/src/sdks/python/apache_beam/io/gcp/experimental/spannerio_write_it_test.py>:171: FutureWarning: WriteToSpanner is experimental. No backwards-compatibility guarantees.
    database_id=self.TEST_DATABASE))

apache_beam/io/gcp/experimental/spannerio_write_it_test.py::SpannerWriteIntegrationTest::test_write_batches
  <https://ci-beam.apache.org/job/beam_PostCommit_Python37/ws/src/sdks/python/apache_beam/io/gcp/experimental/spannerio_write_it_test.py>:135: FutureWarning: WriteToSpanner is experimental. No backwards-compatibility guarantees.
    max_batch_size_bytes=250))

-- Docs: https://docs.pytest.org/en/stable/how-to/capture-warnings.html
- generated xml file: <https://ci-beam.apache.org/job/beam_PostCommit_Python37/ws/src/sdks/python/pytest_postCommitIT-df-py37.xml> -
=========== 5 passed, 18 skipped, 365 warnings in 2275.31s (0:37:55) ===========

FAILURE: Build failed with an exception.

* Where:
Script '<https://ci-beam.apache.org/job/beam_PostCommit_Python37/ws/src/sdks/python/test-suites/direct/common.gradle'> line: 194

* What went wrong:
Execution failed for task ':sdks:python:test-suites:direct:py37:azureIntegrationTest'.
> Process 'command 'sh'' finished with non-zero exit value 1

* Try:
> Run with --stacktrace option to get the stack trace.
> Run with --info or --debug option to get more log output.

* Get more help at https://help.gradle.org

Deprecated Gradle features were used in this build, making it incompatible with Gradle 8.0.

You can use '--warning-mode all' to show the individual deprecation warnings and determine if they come from your own scripts or plugins.

See https://docs.gradle.org/7.5.1/userguide/command_line_interface.html#sec:command_line_warnings

Execution optimizations have been disabled for 1 invalid unit(s) of work during this build to ensure correctness.
Please consult deprecation warnings for more details.

BUILD FAILED in 5h 3m 26s
216 actionable tasks: 151 executed, 59 from cache, 6 up-to-date

Publishing build scan...
https://gradle.com/s/b6y2y7cp34d6s

Build step 'Invoke Gradle script' changed build result to FAILURE
Build step 'Invoke Gradle script' marked build as failure

---------------------------------------------------------------------
To unsubscribe, e-mail: builds-unsubscribe@beam.apache.org
For additional commands, e-mail: builds-help@beam.apache.org


Build failed in Jenkins: beam_PostCommit_Python37 #6381

Posted by Apache Jenkins Server <je...@builds.apache.org>.
See <https://ci-beam.apache.org/job/beam_PostCommit_Python37/6381/display/redirect?page=changes>

Changes:

[noreply] Update mock requirement in /sdks/python (#25503)


------------------------------------------
[...truncated 17.31 MB...]
apache_beam/examples/dataframe/flight_delays_it_test.py::FlightDelaysTest::test_flight_delays
apache_beam/examples/dataframe/taxiride_it_test.py::TaxirideIT::test_aggregation
apache_beam/examples/dataframe/taxiride_it_test.py::TaxirideIT::test_enrich
  <https://ci-beam.apache.org/job/beam_PostCommit_Python37/ws/src/sdks/python/apache_beam/io/fileio.py>:593: BeamDeprecationWarning: options is deprecated since First stable release. References to <pipeline>.options will not be supported
    p.options.view_as(GoogleCloudOptions).temp_location or

apache_beam/io/gcp/bigquery_test.py::BigQueryStreamingInsertTransformIntegrationTests::test_multiple_destinations_transform
  <https://ci-beam.apache.org/job/beam_PostCommit_Python37/ws/src/sdks/python/apache_beam/io/gcp/bigquery_test.py>:1690: BeamDeprecationWarning: options is deprecated since First stable release. References to <pipeline>.options will not be supported
    streaming = self.test_pipeline.options.view_as(StandardOptions).streaming

apache_beam/io/gcp/bigquery_read_it_test.py::ReadTests::test_native_source
  <https://ci-beam.apache.org/job/beam_PostCommit_Python37/ws/src/sdks/python/apache_beam/io/gcp/bigquery_read_it_test.py>:170: BeamDeprecationWarning: BigQuerySource is deprecated since 2.25.0. Use ReadFromBigQuery instead.
    beam.io.BigQuerySource(query=self.query, use_standard_sql=True)))

apache_beam/ml/inference/sklearn_inference_it_test.py::SklearnInference::test_sklearn_regression
  <https://ci-beam.apache.org/job/beam_PostCommit_Python37/ws/src/sdks/python/apache_beam/examples/inference/sklearn_japanese_housing_regression.py>:129: FutureWarning: SklearnModelHandlerPandas is experimental. No backwards-compatibility guarantees.
    model_file_type=ModelFileType.PICKLE, model_uri=model_filename)

apache_beam/ml/inference/sklearn_inference_it_test.py::SklearnInference::test_sklearn_regression
  <https://ci-beam.apache.org/job/beam_PostCommit_Python37/ws/src/build/gradleenv/-1734967052/lib/python3.7/site-packages/dill/_dill.py>:472: FutureWarning: SklearnModelHandlerPandas is experimental. No backwards-compatibility guarantees.
    obj = StockUnpickler.load(self)

apache_beam/ml/gcp/cloud_dlp_it_test.py::CloudDLPIT::test_deidentification
  <https://ci-beam.apache.org/job/beam_PostCommit_Python37/ws/src/sdks/python/apache_beam/ml/gcp/cloud_dlp_it_test.py>:77: FutureWarning: MaskDetectedDetails is experimental.
    inspection_config=INSPECT_CONFIG))

apache_beam/ml/gcp/cloud_dlp_it_test.py::CloudDLPIT::test_inspection
  <https://ci-beam.apache.org/job/beam_PostCommit_Python37/ws/src/sdks/python/apache_beam/ml/gcp/cloud_dlp_it_test.py>:87: FutureWarning: InspectForDetails is experimental.
    | beam.ParDo(extract_inspection_results).with_outputs(

apache_beam/io/gcp/bigquery_read_it_test.py::ReadNewTypesTests::test_native_source
  <https://ci-beam.apache.org/job/beam_PostCommit_Python37/ws/src/sdks/python/apache_beam/io/gcp/bigquery_read_it_test.py>:693: BeamDeprecationWarning: BigQuerySource is deprecated since 2.25.0. Use ReadFromBigQuery instead.
    beam.io.BigQuerySource(query=self.query, use_standard_sql=True)))

apache_beam/io/gcp/bigquery_read_it_test.py::ReadAllBQTests::test_read_queries
  <https://ci-beam.apache.org/job/beam_PostCommit_Python37/ws/src/sdks/python/apache_beam/io/gcp/bigquery_read_it_test.py>:808: FutureWarning: ReadAllFromBigQuery is experimental.
    | beam.io.ReadAllFromBigQuery())

apache_beam/io/gcp/bigquery_read_it_test.py::ReadAllBQTests::test_read_queries
  <https://ci-beam.apache.org/job/beam_PostCommit_Python37/ws/src/sdks/python/apache_beam/io/gcp/bigquery.py>:2658: BeamDeprecationWarning: options is deprecated since First stable release. References to <pipeline>.options will not be supported
    job_name = pcoll.pipeline.options.view_as(GoogleCloudOptions).job_name

apache_beam/io/gcp/bigquery_read_it_test.py::ReadAllBQTests::test_read_queries
  <https://ci-beam.apache.org/job/beam_PostCommit_Python37/ws/src/sdks/python/apache_beam/io/gcp/bigquery.py>:2659: BeamDeprecationWarning: options is deprecated since First stable release. References to <pipeline>.options will not be supported
    project = pcoll.pipeline.options.view_as(GoogleCloudOptions).project

apache_beam/io/gcp/bigquery_read_it_test.py::ReadAllBQTests::test_read_queries
  <https://ci-beam.apache.org/job/beam_PostCommit_Python37/ws/src/sdks/python/apache_beam/io/gcp/bigquery.py>:2672: BeamDeprecationWarning: options is deprecated since First stable release. References to <pipeline>.options will not be supported
    options=pcoll.pipeline.options,

-- Docs: https://docs.pytest.org/en/stable/how-to/capture-warnings.html
- generated xml file: <https://ci-beam.apache.org/job/beam_PostCommit_Python37/ws/src/sdks/python/pytest_postCommitIT-df-py37.xml> -
========== 85 passed, 28 skipped, 576 warnings in 14544.84s (4:02:24) ==========

> Task :sdks:python:test-suites:dataflow:py37:spannerioIT
>>> RUNNING integration tests with pipeline options: --runner=TestDataflowRunner --project=apache-beam-testing --region=us-central1 --staging_location=gs://temp-storage-for-end-to-end-tests/staging-it --temp_location=gs://temp-storage-for-end-to-end-tests/temp-it --output=gs://temp-storage-for-end-to-end-tests/py-it-cloud/output --sdk_location=<https://ci-beam.apache.org/job/beam_PostCommit_Python37/ws/src/sdks/python/build/apache-beam.tar.gz> --requirements_file=postcommit_requirements.txt --num_workers=1 --sleep_secs=20 --kms_key_name=projects/apache-beam-testing/locations/global/keyRings/beam-it/cryptoKeys/test --dataflow_kms_key=projects/apache-beam-testing/locations/global/keyRings/beam-it/cryptoKeys/test
>>>   pytest options: --capture=no --timeout=4500 --color=yes --log-cli-level=INFO --numprocesses=8 --dist=loadfile
>>>   collect markers: -m=spannerio_it
============================= test session starts ==============================
platform linux -- Python 3.7.12, pytest-7.2.1, pluggy-1.0.0
rootdir: <https://ci-beam.apache.org/job/beam_PostCommit_Python37/ws/src/sdks/python,> configfile: pytest.ini
plugins: xdist-2.5.0, timeout-2.1.0, forked-1.6.0, hypothesis-6.68.2, requests-mock-1.10.0
timeout: 4500.0s
timeout method: signal
timeout func_only: False
gw0 I / gw1 I / gw2 I / gw3 I / gw4 I / gw5 I / gw6 I / gw7 I
[gw2] Python 3.7.12 (default, Jan 15 2022, 18:42:10)  -- [GCC 9.3.0]
[gw0] Python 3.7.12 (default, Jan 15 2022, 18:42:10)  -- [GCC 9.3.0]
[gw4] Python 3.7.12 (default, Jan 15 2022, 18:42:10)  -- [GCC 9.3.0]
[gw6] Python 3.7.12 (default, Jan 15 2022, 18:42:10)  -- [GCC 9.3.0]
[gw1] Python 3.7.12 (default, Jan 15 2022, 18:42:10)  -- [GCC 9.3.0]
[gw5] Python 3.7.12 (default, Jan 15 2022, 18:42:10)  -- [GCC 9.3.0]
[gw3] Python 3.7.12 (default, Jan 15 2022, 18:42:10)  -- [GCC 9.3.0]
[gw7] Python 3.7.12 (default, Jan 15 2022, 18:42:10)  -- [GCC 9.3.0]
gw0 [15] / gw1 [15] / gw2 [15] / gw3 [15] / gw4 [15] / gw5 [15] / gw6 [15] / gw7 [15]

scheduling tests via LoadFileScheduling

apache_beam/io/gcp/experimental/spannerio_read_it_test.py::SpannerReadIntegrationTest::test_read_via_sql 
apache_beam/io/gcp/experimental/spannerio_write_it_test.py::SpannerWriteIntegrationTest::test_metrics_error_call 
[gw0] SKIPPED apache_beam/io/gcp/experimental/spannerio_write_it_test.py::SpannerWriteIntegrationTest::test_metrics_error_call 
apache_beam/io/gcp/experimental/spannerio_write_it_test.py::SpannerWriteIntegrationTest::test_metrics_ok_call 
[gw0] SKIPPED apache_beam/io/gcp/experimental/spannerio_write_it_test.py::SpannerWriteIntegrationTest::test_metrics_ok_call 
apache_beam/io/gcp/experimental/spannerio_write_it_test.py::SpannerWriteIntegrationTest::test_spanner_error 
[gw0] PASSED apache_beam/io/gcp/experimental/spannerio_write_it_test.py::SpannerWriteIntegrationTest::test_spanner_error 
apache_beam/io/gcp/experimental/spannerio_write_it_test.py::SpannerWriteIntegrationTest::test_spanner_update 
[gw2] PASSED apache_beam/io/gcp/experimental/spannerio_read_it_test.py::SpannerReadIntegrationTest::test_read_via_sql 
apache_beam/io/gcp/experimental/spannerio_read_it_test.py::SpannerReadIntegrationTest::test_read_via_table 
[gw0] PASSED apache_beam/io/gcp/experimental/spannerio_write_it_test.py::SpannerWriteIntegrationTest::test_spanner_update 
apache_beam/io/gcp/experimental/spannerio_write_it_test.py::SpannerWriteIntegrationTest::test_write_batches 
[gw2] PASSED apache_beam/io/gcp/experimental/spannerio_read_it_test.py::SpannerReadIntegrationTest::test_read_via_table 
apache_beam/io/gcp/experimental/spannerio_read_it_test.py::SpannerReadIntegrationTest::test_sql_metrics_error_call 
[gw2] SKIPPED apache_beam/io/gcp/experimental/spannerio_read_it_test.py::SpannerReadIntegrationTest::test_sql_metrics_error_call 
apache_beam/io/gcp/experimental/spannerio_read_it_test.py::SpannerReadIntegrationTest::test_sql_metrics_ok_call 
[gw2] SKIPPED apache_beam/io/gcp/experimental/spannerio_read_it_test.py::SpannerReadIntegrationTest::test_sql_metrics_ok_call 
apache_beam/io/gcp/experimental/spannerio_read_it_test.py::SpannerReadIntegrationTest::test_table_metrics_error_call 
[gw2] SKIPPED apache_beam/io/gcp/experimental/spannerio_read_it_test.py::SpannerReadIntegrationTest::test_table_metrics_error_call 
apache_beam/io/gcp/experimental/spannerio_read_it_test.py::SpannerReadIntegrationTest::test_table_metrics_ok_call 
[gw2] SKIPPED apache_beam/io/gcp/experimental/spannerio_read_it_test.py::SpannerReadIntegrationTest::test_table_metrics_ok_call 
apache_beam/io/gcp/experimental/spannerio_read_it_test.py::SpannerReadIntegrationTest::test_transaction_sql_metrics_error_call 
[gw2] SKIPPED apache_beam/io/gcp/experimental/spannerio_read_it_test.py::SpannerReadIntegrationTest::test_transaction_sql_metrics_error_call 
apache_beam/io/gcp/experimental/spannerio_read_it_test.py::SpannerReadIntegrationTest::test_transaction_sql_metrics_ok_call 
[gw2] SKIPPED apache_beam/io/gcp/experimental/spannerio_read_it_test.py::SpannerReadIntegrationTest::test_transaction_sql_metrics_ok_call 
apache_beam/io/gcp/experimental/spannerio_read_it_test.py::SpannerReadIntegrationTest::test_transaction_table_metrics_error_call 
[gw2] SKIPPED apache_beam/io/gcp/experimental/spannerio_read_it_test.py::SpannerReadIntegrationTest::test_transaction_table_metrics_error_call 
apache_beam/io/gcp/experimental/spannerio_read_it_test.py::SpannerReadIntegrationTest::test_transaction_table_metrics_ok_call 
[gw2] SKIPPED apache_beam/io/gcp/experimental/spannerio_read_it_test.py::SpannerReadIntegrationTest::test_transaction_table_metrics_ok_call 
[gw0] PASSED apache_beam/io/gcp/experimental/spannerio_write_it_test.py::SpannerWriteIntegrationTest::test_write_batches 

=============================== warnings summary ===============================
../../build/gradleenv/-1734967052/lib/python3.7/site-packages/hdfs/config.py:15
../../build/gradleenv/-1734967052/lib/python3.7/site-packages/hdfs/config.py:15
../../build/gradleenv/-1734967052/lib/python3.7/site-packages/hdfs/config.py:15
../../build/gradleenv/-1734967052/lib/python3.7/site-packages/hdfs/config.py:15
../../build/gradleenv/-1734967052/lib/python3.7/site-packages/hdfs/config.py:15
../../build/gradleenv/-1734967052/lib/python3.7/site-packages/hdfs/config.py:15
../../build/gradleenv/-1734967052/lib/python3.7/site-packages/hdfs/config.py:15
../../build/gradleenv/-1734967052/lib/python3.7/site-packages/hdfs/config.py:15
../../build/gradleenv/-1734967052/lib/python3.7/site-packages/hdfs/config.py:15
  <https://ci-beam.apache.org/job/beam_PostCommit_Python37/ws/src/build/gradleenv/-1734967052/lib/python3.7/site-packages/hdfs/config.py>:15: DeprecationWarning: the imp module is deprecated in favour of importlib; see the module's documentation for alternative uses
    from imp import load_source

../../build/gradleenv/-1734967052/lib/python3.7/site-packages/pkg_resources/__init__.py:2804: 171 warnings
  <https://ci-beam.apache.org/job/beam_PostCommit_Python37/ws/src/build/gradleenv/-1734967052/lib/python3.7/site-packages/pkg_resources/__init__.py>:2804: DeprecationWarning: Deprecated call to `pkg_resources.declare_namespace('google')`.
  Implementing implicit namespace packages (as specified in PEP 420) is preferred to `pkg_resources.declare_namespace`. See https://setuptools.pypa.io/en/latest/references/keywords.html#keyword-namespace-packages
    declare_namespace(pkg)

../../build/gradleenv/-1734967052/lib/python3.7/site-packages/pkg_resources/__init__.py:2804: 117 warnings
  <https://ci-beam.apache.org/job/beam_PostCommit_Python37/ws/src/build/gradleenv/-1734967052/lib/python3.7/site-packages/pkg_resources/__init__.py>:2804: DeprecationWarning: Deprecated call to `pkg_resources.declare_namespace('google.cloud')`.
  Implementing implicit namespace packages (as specified in PEP 420) is preferred to `pkg_resources.declare_namespace`. See https://setuptools.pypa.io/en/latest/references/keywords.html#keyword-namespace-packages
    declare_namespace(pkg)

../../build/gradleenv/-1734967052/lib/python3.7/site-packages/pkg_resources/__init__.py:2309: 36 warnings
  <https://ci-beam.apache.org/job/beam_PostCommit_Python37/ws/src/build/gradleenv/-1734967052/lib/python3.7/site-packages/pkg_resources/__init__.py>:2309: DeprecationWarning: Deprecated call to `pkg_resources.declare_namespace('google')`.
  Implementing implicit namespace packages (as specified in PEP 420) is preferred to `pkg_resources.declare_namespace`. See https://setuptools.pypa.io/en/latest/references/keywords.html#keyword-namespace-packages
    declare_namespace(parent)

../../build/gradleenv/-1734967052/lib/python3.7/site-packages/pkg_resources/__init__.py:2804
../../build/gradleenv/-1734967052/lib/python3.7/site-packages/pkg_resources/__init__.py:2804
../../build/gradleenv/-1734967052/lib/python3.7/site-packages/pkg_resources/__init__.py:2804
../../build/gradleenv/-1734967052/lib/python3.7/site-packages/pkg_resources/__init__.py:2804
../../build/gradleenv/-1734967052/lib/python3.7/site-packages/pkg_resources/__init__.py:2804
../../build/gradleenv/-1734967052/lib/python3.7/site-packages/pkg_resources/__init__.py:2804
../../build/gradleenv/-1734967052/lib/python3.7/site-packages/pkg_resources/__init__.py:2804
../../build/gradleenv/-1734967052/lib/python3.7/site-packages/pkg_resources/__init__.py:2804
../../build/gradleenv/-1734967052/lib/python3.7/site-packages/pkg_resources/__init__.py:2804
  <https://ci-beam.apache.org/job/beam_PostCommit_Python37/ws/src/build/gradleenv/-1734967052/lib/python3.7/site-packages/pkg_resources/__init__.py>:2804: DeprecationWarning: Deprecated call to `pkg_resources.declare_namespace('google.logging')`.
  Implementing implicit namespace packages (as specified in PEP 420) is preferred to `pkg_resources.declare_namespace`. See https://setuptools.pypa.io/en/latest/references/keywords.html#keyword-namespace-packages
    declare_namespace(pkg)

../../build/gradleenv/-1734967052/lib/python3.7/site-packages/pkg_resources/__init__.py:2804
../../build/gradleenv/-1734967052/lib/python3.7/site-packages/pkg_resources/__init__.py:2804
../../build/gradleenv/-1734967052/lib/python3.7/site-packages/pkg_resources/__init__.py:2804
../../build/gradleenv/-1734967052/lib/python3.7/site-packages/pkg_resources/__init__.py:2804
../../build/gradleenv/-1734967052/lib/python3.7/site-packages/pkg_resources/__init__.py:2804
../../build/gradleenv/-1734967052/lib/python3.7/site-packages/pkg_resources/__init__.py:2804
../../build/gradleenv/-1734967052/lib/python3.7/site-packages/pkg_resources/__init__.py:2804
../../build/gradleenv/-1734967052/lib/python3.7/site-packages/pkg_resources/__init__.py:2804
../../build/gradleenv/-1734967052/lib/python3.7/site-packages/pkg_resources/__init__.py:2804
  <https://ci-beam.apache.org/job/beam_PostCommit_Python37/ws/src/build/gradleenv/-1734967052/lib/python3.7/site-packages/pkg_resources/__init__.py>:2804: DeprecationWarning: Deprecated call to `pkg_resources.declare_namespace('google.iam')`.
  Implementing implicit namespace packages (as specified in PEP 420) is preferred to `pkg_resources.declare_namespace`. See https://setuptools.pypa.io/en/latest/references/keywords.html#keyword-namespace-packages
    declare_namespace(pkg)

../../build/gradleenv/-1734967052/lib/python3.7/site-packages/google/rpc/__init__.py:20
../../build/gradleenv/-1734967052/lib/python3.7/site-packages/google/rpc/__init__.py:20
../../build/gradleenv/-1734967052/lib/python3.7/site-packages/google/rpc/__init__.py:20
../../build/gradleenv/-1734967052/lib/python3.7/site-packages/google/rpc/__init__.py:20
../../build/gradleenv/-1734967052/lib/python3.7/site-packages/google/rpc/__init__.py:20
../../build/gradleenv/-1734967052/lib/python3.7/site-packages/google/rpc/__init__.py:20
../../build/gradleenv/-1734967052/lib/python3.7/site-packages/google/rpc/__init__.py:20
../../build/gradleenv/-1734967052/lib/python3.7/site-packages/google/rpc/__init__.py:20
../../build/gradleenv/-1734967052/lib/python3.7/site-packages/google/rpc/__init__.py:20
  <https://ci-beam.apache.org/job/beam_PostCommit_Python37/ws/src/build/gradleenv/-1734967052/lib/python3.7/site-packages/google/rpc/__init__.py>:20: DeprecationWarning: Deprecated call to `pkg_resources.declare_namespace('google.rpc')`.
  Implementing implicit namespace packages (as specified in PEP 420) is preferred to `pkg_resources.declare_namespace`. See https://setuptools.pypa.io/en/latest/references/keywords.html#keyword-namespace-packages
    pkg_resources.declare_namespace(__name__)

apache_beam/io/gcp/experimental/spannerio_write_it_test.py::SpannerWriteIntegrationTest::test_spanner_error
  <https://ci-beam.apache.org/job/beam_PostCommit_Python37/ws/src/sdks/python/apache_beam/io/gcp/experimental/spannerio_write_it_test.py>:190: FutureWarning: WriteToSpanner is experimental. No backwards-compatibility guarantees.
    database_id=self.TEST_DATABASE))

apache_beam/io/gcp/experimental/spannerio_read_it_test.py::SpannerReadIntegrationTest::test_read_via_sql
  <https://ci-beam.apache.org/job/beam_PostCommit_Python37/ws/src/sdks/python/apache_beam/io/gcp/experimental/spannerio_read_it_test.py>:128: FutureWarning: ReadFromSpanner is experimental. No backwards-compatibility guarantees.
    sql="select * from Users")

apache_beam/io/gcp/experimental/spannerio_write_it_test.py::SpannerWriteIntegrationTest::test_spanner_update
  <https://ci-beam.apache.org/job/beam_PostCommit_Python37/ws/src/sdks/python/apache_beam/io/gcp/experimental/spannerio_write_it_test.py>:171: FutureWarning: WriteToSpanner is experimental. No backwards-compatibility guarantees.
    database_id=self.TEST_DATABASE))

apache_beam/io/gcp/experimental/spannerio_read_it_test.py::SpannerReadIntegrationTest::test_read_via_table
  <https://ci-beam.apache.org/job/beam_PostCommit_Python37/ws/src/sdks/python/apache_beam/io/gcp/experimental/spannerio_read_it_test.py>:117: FutureWarning: ReadFromSpanner is experimental. No backwards-compatibility guarantees.
    columns=["UserId", "Key"])

apache_beam/io/gcp/experimental/spannerio_write_it_test.py::SpannerWriteIntegrationTest::test_write_batches
  <https://ci-beam.apache.org/job/beam_PostCommit_Python37/ws/src/sdks/python/apache_beam/io/gcp/experimental/spannerio_write_it_test.py>:135: FutureWarning: WriteToSpanner is experimental. No backwards-compatibility guarantees.
    max_batch_size_bytes=250))

-- Docs: https://docs.pytest.org/en/stable/how-to/capture-warnings.html
- generated xml file: <https://ci-beam.apache.org/job/beam_PostCommit_Python37/ws/src/sdks/python/pytest_postCommitIT-df-py37.xml> -
=========== 5 passed, 18 skipped, 365 warnings in 2258.83s (0:37:38) ===========

FAILURE: Build completed with 2 failures.

1: Task failed with an exception.
-----------
* Where:
Script '<https://ci-beam.apache.org/job/beam_PostCommit_Python37/ws/src/sdks/python/test-suites/direct/common.gradle'> line: 194

* What went wrong:
Execution failed for task ':sdks:python:test-suites:direct:py37:azureIntegrationTest'.
> Process 'command 'sh'' finished with non-zero exit value 1

* Try:
> Run with --stacktrace option to get the stack trace.
> Run with --info or --debug option to get more log output.
==============================================================================

2: Task failed with an exception.
-----------
* Where:
Script '<https://ci-beam.apache.org/job/beam_PostCommit_Python37/ws/src/sdks/python/test-suites/direct/common.gradle'> line: 176

* What went wrong:
Execution failed for task ':sdks:python:test-suites:direct:py37:directRunnerIT'.
> Process 'command 'sh'' finished with non-zero exit value 1

* Try:
> Run with --stacktrace option to get the stack trace.
> Run with --info or --debug option to get more log output.
==============================================================================

* Get more help at https://help.gradle.org

Deprecated Gradle features were used in this build, making it incompatible with Gradle 8.0.

You can use '--warning-mode all' to show the individual deprecation warnings and determine if they come from your own scripts or plugins.

See https://docs.gradle.org/7.5.1/userguide/command_line_interface.html#sec:command_line_warnings

Execution optimizations have been disabled for 1 invalid unit(s) of work during this build to ensure correctness.
Please consult deprecation warnings for more details.

BUILD FAILED in 4h 42m 17s
216 actionable tasks: 155 executed, 55 from cache, 6 up-to-date

Publishing build scan...
https://gradle.com/s/vesisadr3iago

Build step 'Invoke Gradle script' changed build result to FAILURE
Build step 'Invoke Gradle script' marked build as failure

---------------------------------------------------------------------
To unsubscribe, e-mail: builds-unsubscribe@beam.apache.org
For additional commands, e-mail: builds-help@beam.apache.org


Build failed in Jenkins: beam_PostCommit_Python37 #6380

Posted by Apache Jenkins Server <je...@builds.apache.org>.
See <https://ci-beam.apache.org/job/beam_PostCommit_Python37/6380/display/redirect>

Changes:


------------------------------------------
[...truncated 17.24 MB...]
  <https://ci-beam.apache.org/job/beam_PostCommit_Python37/ws/src/sdks/python/apache_beam/io/gcp/bigquery_file_loads.py>:1175: BeamDeprecationWarning: options is deprecated since First stable release. References to <pipeline>.options will not be supported
    p.options.view_as(GoogleCloudOptions).job_name or 'AUTOMATIC_JOB_NAME')

apache_beam/examples/cookbook/bigquery_tornadoes_it_test.py::BigqueryTornadoesIT::test_bigquery_tornadoes_it
  <https://ci-beam.apache.org/job/beam_PostCommit_Python37/ws/src/sdks/python/apache_beam/io/gcp/tests/utils.py>:100: PendingDeprecationWarning: Client.dataset is deprecated and will be removed in a future version. Use a string like 'my_project.my_dataset' or a cloud.google.bigquery.DatasetReference object, instead.
    table_ref = client.dataset(dataset_id).table(table_id)

apache_beam/examples/dataframe/flight_delays_it_test.py::FlightDelaysTest::test_flight_delays
  <https://ci-beam.apache.org/job/beam_PostCommit_Python37/ws/src/sdks/python/apache_beam/examples/dataframe/flight_delays.py>:47: FutureWarning: Dropping of nuisance columns in DataFrame reductions (with 'numeric_only=None') is deprecated; in a future version this will raise TypeError.  Select only valid columns before calling the reduction.
    return airline_df[at_top_airports].mean()

apache_beam/examples/dataframe/flight_delays_it_test.py::FlightDelaysTest::test_flight_delays
apache_beam/examples/dataframe/taxiride_it_test.py::TaxirideIT::test_aggregation
apache_beam/examples/dataframe/taxiride_it_test.py::TaxirideIT::test_enrich
  <https://ci-beam.apache.org/job/beam_PostCommit_Python37/ws/src/sdks/python/apache_beam/dataframe/io.py>:664: FutureWarning: WriteToFiles is experimental.
    sink=lambda _: _WriteToPandasFileSink(

apache_beam/examples/dataframe/flight_delays_it_test.py::FlightDelaysTest::test_flight_delays
apache_beam/examples/dataframe/taxiride_it_test.py::TaxirideIT::test_aggregation
apache_beam/examples/dataframe/taxiride_it_test.py::TaxirideIT::test_enrich
  <https://ci-beam.apache.org/job/beam_PostCommit_Python37/ws/src/sdks/python/apache_beam/io/fileio.py>:593: BeamDeprecationWarning: options is deprecated since First stable release. References to <pipeline>.options will not be supported
    p.options.view_as(GoogleCloudOptions).temp_location or

apache_beam/io/gcp/bigquery_test.py::BigQueryStreamingInsertTransformIntegrationTests::test_multiple_destinations_transform
  <https://ci-beam.apache.org/job/beam_PostCommit_Python37/ws/src/sdks/python/apache_beam/io/gcp/bigquery_test.py>:1690: BeamDeprecationWarning: options is deprecated since First stable release. References to <pipeline>.options will not be supported
    streaming = self.test_pipeline.options.view_as(StandardOptions).streaming

apache_beam/io/gcp/bigquery_read_it_test.py::ReadTests::test_native_source
  <https://ci-beam.apache.org/job/beam_PostCommit_Python37/ws/src/sdks/python/apache_beam/io/gcp/bigquery_read_it_test.py>:170: BeamDeprecationWarning: BigQuerySource is deprecated since 2.25.0. Use ReadFromBigQuery instead.
    beam.io.BigQuerySource(query=self.query, use_standard_sql=True)))

apache_beam/ml/gcp/cloud_dlp_it_test.py::CloudDLPIT::test_deidentification
  <https://ci-beam.apache.org/job/beam_PostCommit_Python37/ws/src/sdks/python/apache_beam/ml/gcp/cloud_dlp_it_test.py>:77: FutureWarning: MaskDetectedDetails is experimental.
    inspection_config=INSPECT_CONFIG))

apache_beam/ml/inference/sklearn_inference_it_test.py::SklearnInference::test_sklearn_regression
  <https://ci-beam.apache.org/job/beam_PostCommit_Python37/ws/src/sdks/python/apache_beam/examples/inference/sklearn_japanese_housing_regression.py>:129: FutureWarning: SklearnModelHandlerPandas is experimental. No backwards-compatibility guarantees.
    model_file_type=ModelFileType.PICKLE, model_uri=model_filename)

apache_beam/ml/inference/sklearn_inference_it_test.py::SklearnInference::test_sklearn_regression
  <https://ci-beam.apache.org/job/beam_PostCommit_Python37/ws/src/build/gradleenv/-1734967052/lib/python3.7/site-packages/dill/_dill.py>:472: FutureWarning: SklearnModelHandlerPandas is experimental. No backwards-compatibility guarantees.
    obj = StockUnpickler.load(self)

apache_beam/ml/gcp/cloud_dlp_it_test.py::CloudDLPIT::test_inspection
  <https://ci-beam.apache.org/job/beam_PostCommit_Python37/ws/src/sdks/python/apache_beam/ml/gcp/cloud_dlp_it_test.py>:87: FutureWarning: InspectForDetails is experimental.
    | beam.ParDo(extract_inspection_results).with_outputs(

apache_beam/io/gcp/bigquery_read_it_test.py::ReadNewTypesTests::test_native_source
  <https://ci-beam.apache.org/job/beam_PostCommit_Python37/ws/src/sdks/python/apache_beam/io/gcp/bigquery_read_it_test.py>:693: BeamDeprecationWarning: BigQuerySource is deprecated since 2.25.0. Use ReadFromBigQuery instead.
    beam.io.BigQuerySource(query=self.query, use_standard_sql=True)))

apache_beam/io/gcp/bigquery_read_it_test.py::ReadAllBQTests::test_read_queries
  <https://ci-beam.apache.org/job/beam_PostCommit_Python37/ws/src/sdks/python/apache_beam/io/gcp/bigquery_read_it_test.py>:808: FutureWarning: ReadAllFromBigQuery is experimental.
    | beam.io.ReadAllFromBigQuery())

apache_beam/io/gcp/bigquery_read_it_test.py::ReadAllBQTests::test_read_queries
  <https://ci-beam.apache.org/job/beam_PostCommit_Python37/ws/src/sdks/python/apache_beam/io/gcp/bigquery.py>:2658: BeamDeprecationWarning: options is deprecated since First stable release. References to <pipeline>.options will not be supported
    job_name = pcoll.pipeline.options.view_as(GoogleCloudOptions).job_name

apache_beam/io/gcp/bigquery_read_it_test.py::ReadAllBQTests::test_read_queries
  <https://ci-beam.apache.org/job/beam_PostCommit_Python37/ws/src/sdks/python/apache_beam/io/gcp/bigquery.py>:2659: BeamDeprecationWarning: options is deprecated since First stable release. References to <pipeline>.options will not be supported
    project = pcoll.pipeline.options.view_as(GoogleCloudOptions).project

apache_beam/io/gcp/bigquery_read_it_test.py::ReadAllBQTests::test_read_queries
  <https://ci-beam.apache.org/job/beam_PostCommit_Python37/ws/src/sdks/python/apache_beam/io/gcp/bigquery.py>:2672: BeamDeprecationWarning: options is deprecated since First stable release. References to <pipeline>.options will not be supported
    options=pcoll.pipeline.options,

-- Docs: https://docs.pytest.org/en/stable/how-to/capture-warnings.html
- generated xml file: <https://ci-beam.apache.org/job/beam_PostCommit_Python37/ws/src/sdks/python/pytest_postCommitIT-df-py37.xml> -
========== 85 passed, 28 skipped, 576 warnings in 13657.48s (3:47:37) ==========

> Task :sdks:python:test-suites:dataflow:py37:spannerioIT
>>> RUNNING integration tests with pipeline options: --runner=TestDataflowRunner --project=apache-beam-testing --region=us-central1 --staging_location=gs://temp-storage-for-end-to-end-tests/staging-it --temp_location=gs://temp-storage-for-end-to-end-tests/temp-it --output=gs://temp-storage-for-end-to-end-tests/py-it-cloud/output --sdk_location=<https://ci-beam.apache.org/job/beam_PostCommit_Python37/ws/src/sdks/python/build/apache-beam.tar.gz> --requirements_file=postcommit_requirements.txt --num_workers=1 --sleep_secs=20 --kms_key_name=projects/apache-beam-testing/locations/global/keyRings/beam-it/cryptoKeys/test --dataflow_kms_key=projects/apache-beam-testing/locations/global/keyRings/beam-it/cryptoKeys/test
>>>   pytest options: --capture=no --timeout=4500 --color=yes --log-cli-level=INFO --numprocesses=8 --dist=loadfile
>>>   collect markers: -m=spannerio_it
============================= test session starts ==============================
platform linux -- Python 3.7.12, pytest-7.2.1, pluggy-1.0.0
rootdir: <https://ci-beam.apache.org/job/beam_PostCommit_Python37/ws/src/sdks/python,> configfile: pytest.ini
plugins: xdist-2.5.0, timeout-2.1.0, forked-1.6.0, hypothesis-6.68.2, requests-mock-1.10.0
timeout: 4500.0s
timeout method: signal
timeout func_only: False
gw0 I / gw1 I / gw2 I / gw3 I / gw4 I / gw5 I / gw6 I / gw7 I
[gw0] Python 3.7.12 (default, Jan 15 2022, 18:42:10)  -- [GCC 9.3.0]
[gw1] Python 3.7.12 (default, Jan 15 2022, 18:42:10)  -- [GCC 9.3.0]
[gw2] Python 3.7.12 (default, Jan 15 2022, 18:42:10)  -- [GCC 9.3.0]
[gw3] Python 3.7.12 (default, Jan 15 2022, 18:42:10)  -- [GCC 9.3.0]
[gw4] Python 3.7.12 (default, Jan 15 2022, 18:42:10)  -- [GCC 9.3.0]
[gw5] Python 3.7.12 (default, Jan 15 2022, 18:42:10)  -- [GCC 9.3.0]
[gw6] Python 3.7.12 (default, Jan 15 2022, 18:42:10)  -- [GCC 9.3.0]
[gw7] Python 3.7.12 (default, Jan 15 2022, 18:42:10)  -- [GCC 9.3.0]
gw0 [15] / gw1 [15] / gw2 [15] / gw3 [15] / gw4 [15] / gw5 [15] / gw6 [15] / gw7 [15]

scheduling tests via LoadFileScheduling

apache_beam/io/gcp/experimental/spannerio_read_it_test.py::SpannerReadIntegrationTest::test_read_via_sql 
apache_beam/io/gcp/experimental/spannerio_write_it_test.py::SpannerWriteIntegrationTest::test_metrics_error_call 
[gw1] SKIPPED apache_beam/io/gcp/experimental/spannerio_write_it_test.py::SpannerWriteIntegrationTest::test_metrics_error_call 
apache_beam/io/gcp/experimental/spannerio_write_it_test.py::SpannerWriteIntegrationTest::test_metrics_ok_call 
[gw1] SKIPPED apache_beam/io/gcp/experimental/spannerio_write_it_test.py::SpannerWriteIntegrationTest::test_metrics_ok_call 
apache_beam/io/gcp/experimental/spannerio_write_it_test.py::SpannerWriteIntegrationTest::test_spanner_error 
[gw1] PASSED apache_beam/io/gcp/experimental/spannerio_write_it_test.py::SpannerWriteIntegrationTest::test_spanner_error 
apache_beam/io/gcp/experimental/spannerio_write_it_test.py::SpannerWriteIntegrationTest::test_spanner_update 
[gw0] PASSED apache_beam/io/gcp/experimental/spannerio_read_it_test.py::SpannerReadIntegrationTest::test_read_via_sql 
apache_beam/io/gcp/experimental/spannerio_read_it_test.py::SpannerReadIntegrationTest::test_read_via_table 
[gw1] PASSED apache_beam/io/gcp/experimental/spannerio_write_it_test.py::SpannerWriteIntegrationTest::test_spanner_update 
apache_beam/io/gcp/experimental/spannerio_write_it_test.py::SpannerWriteIntegrationTest::test_write_batches 
[gw0] PASSED apache_beam/io/gcp/experimental/spannerio_read_it_test.py::SpannerReadIntegrationTest::test_read_via_table 
apache_beam/io/gcp/experimental/spannerio_read_it_test.py::SpannerReadIntegrationTest::test_sql_metrics_error_call 
[gw0] SKIPPED apache_beam/io/gcp/experimental/spannerio_read_it_test.py::SpannerReadIntegrationTest::test_sql_metrics_error_call 
apache_beam/io/gcp/experimental/spannerio_read_it_test.py::SpannerReadIntegrationTest::test_sql_metrics_ok_call 
[gw0] SKIPPED apache_beam/io/gcp/experimental/spannerio_read_it_test.py::SpannerReadIntegrationTest::test_sql_metrics_ok_call 
apache_beam/io/gcp/experimental/spannerio_read_it_test.py::SpannerReadIntegrationTest::test_table_metrics_error_call 
[gw0] SKIPPED apache_beam/io/gcp/experimental/spannerio_read_it_test.py::SpannerReadIntegrationTest::test_table_metrics_error_call 
apache_beam/io/gcp/experimental/spannerio_read_it_test.py::SpannerReadIntegrationTest::test_table_metrics_ok_call 
[gw0] SKIPPED apache_beam/io/gcp/experimental/spannerio_read_it_test.py::SpannerReadIntegrationTest::test_table_metrics_ok_call 
apache_beam/io/gcp/experimental/spannerio_read_it_test.py::SpannerReadIntegrationTest::test_transaction_sql_metrics_error_call 
[gw0] SKIPPED apache_beam/io/gcp/experimental/spannerio_read_it_test.py::SpannerReadIntegrationTest::test_transaction_sql_metrics_error_call 
apache_beam/io/gcp/experimental/spannerio_read_it_test.py::SpannerReadIntegrationTest::test_transaction_sql_metrics_ok_call 
[gw0] SKIPPED apache_beam/io/gcp/experimental/spannerio_read_it_test.py::SpannerReadIntegrationTest::test_transaction_sql_metrics_ok_call 
apache_beam/io/gcp/experimental/spannerio_read_it_test.py::SpannerReadIntegrationTest::test_transaction_table_metrics_error_call 
[gw0] SKIPPED apache_beam/io/gcp/experimental/spannerio_read_it_test.py::SpannerReadIntegrationTest::test_transaction_table_metrics_error_call 
apache_beam/io/gcp/experimental/spannerio_read_it_test.py::SpannerReadIntegrationTest::test_transaction_table_metrics_ok_call 
[gw0] SKIPPED apache_beam/io/gcp/experimental/spannerio_read_it_test.py::SpannerReadIntegrationTest::test_transaction_table_metrics_ok_call 
[gw1] PASSED apache_beam/io/gcp/experimental/spannerio_write_it_test.py::SpannerWriteIntegrationTest::test_write_batches 

=============================== warnings summary ===============================
../../build/gradleenv/-1734967052/lib/python3.7/site-packages/hdfs/config.py:15
../../build/gradleenv/-1734967052/lib/python3.7/site-packages/hdfs/config.py:15
../../build/gradleenv/-1734967052/lib/python3.7/site-packages/hdfs/config.py:15
../../build/gradleenv/-1734967052/lib/python3.7/site-packages/hdfs/config.py:15
../../build/gradleenv/-1734967052/lib/python3.7/site-packages/hdfs/config.py:15
../../build/gradleenv/-1734967052/lib/python3.7/site-packages/hdfs/config.py:15
../../build/gradleenv/-1734967052/lib/python3.7/site-packages/hdfs/config.py:15
../../build/gradleenv/-1734967052/lib/python3.7/site-packages/hdfs/config.py:15
../../build/gradleenv/-1734967052/lib/python3.7/site-packages/hdfs/config.py:15
  <https://ci-beam.apache.org/job/beam_PostCommit_Python37/ws/src/build/gradleenv/-1734967052/lib/python3.7/site-packages/hdfs/config.py>:15: DeprecationWarning: the imp module is deprecated in favour of importlib; see the module's documentation for alternative uses
    from imp import load_source

../../build/gradleenv/-1734967052/lib/python3.7/site-packages/pkg_resources/__init__.py:2804: 171 warnings
  <https://ci-beam.apache.org/job/beam_PostCommit_Python37/ws/src/build/gradleenv/-1734967052/lib/python3.7/site-packages/pkg_resources/__init__.py>:2804: DeprecationWarning: Deprecated call to `pkg_resources.declare_namespace('google')`.
  Implementing implicit namespace packages (as specified in PEP 420) is preferred to `pkg_resources.declare_namespace`. See https://setuptools.pypa.io/en/latest/references/keywords.html#keyword-namespace-packages
    declare_namespace(pkg)

../../build/gradleenv/-1734967052/lib/python3.7/site-packages/pkg_resources/__init__.py:2804: 117 warnings
  <https://ci-beam.apache.org/job/beam_PostCommit_Python37/ws/src/build/gradleenv/-1734967052/lib/python3.7/site-packages/pkg_resources/__init__.py>:2804: DeprecationWarning: Deprecated call to `pkg_resources.declare_namespace('google.cloud')`.
  Implementing implicit namespace packages (as specified in PEP 420) is preferred to `pkg_resources.declare_namespace`. See https://setuptools.pypa.io/en/latest/references/keywords.html#keyword-namespace-packages
    declare_namespace(pkg)

../../build/gradleenv/-1734967052/lib/python3.7/site-packages/pkg_resources/__init__.py:2309: 36 warnings
  <https://ci-beam.apache.org/job/beam_PostCommit_Python37/ws/src/build/gradleenv/-1734967052/lib/python3.7/site-packages/pkg_resources/__init__.py>:2309: DeprecationWarning: Deprecated call to `pkg_resources.declare_namespace('google')`.
  Implementing implicit namespace packages (as specified in PEP 420) is preferred to `pkg_resources.declare_namespace`. See https://setuptools.pypa.io/en/latest/references/keywords.html#keyword-namespace-packages
    declare_namespace(parent)

../../build/gradleenv/-1734967052/lib/python3.7/site-packages/pkg_resources/__init__.py:2804
../../build/gradleenv/-1734967052/lib/python3.7/site-packages/pkg_resources/__init__.py:2804
../../build/gradleenv/-1734967052/lib/python3.7/site-packages/pkg_resources/__init__.py:2804
../../build/gradleenv/-1734967052/lib/python3.7/site-packages/pkg_resources/__init__.py:2804
../../build/gradleenv/-1734967052/lib/python3.7/site-packages/pkg_resources/__init__.py:2804
../../build/gradleenv/-1734967052/lib/python3.7/site-packages/pkg_resources/__init__.py:2804
../../build/gradleenv/-1734967052/lib/python3.7/site-packages/pkg_resources/__init__.py:2804
../../build/gradleenv/-1734967052/lib/python3.7/site-packages/pkg_resources/__init__.py:2804
../../build/gradleenv/-1734967052/lib/python3.7/site-packages/pkg_resources/__init__.py:2804
  <https://ci-beam.apache.org/job/beam_PostCommit_Python37/ws/src/build/gradleenv/-1734967052/lib/python3.7/site-packages/pkg_resources/__init__.py>:2804: DeprecationWarning: Deprecated call to `pkg_resources.declare_namespace('google.logging')`.
  Implementing implicit namespace packages (as specified in PEP 420) is preferred to `pkg_resources.declare_namespace`. See https://setuptools.pypa.io/en/latest/references/keywords.html#keyword-namespace-packages
    declare_namespace(pkg)

../../build/gradleenv/-1734967052/lib/python3.7/site-packages/pkg_resources/__init__.py:2804
../../build/gradleenv/-1734967052/lib/python3.7/site-packages/pkg_resources/__init__.py:2804
../../build/gradleenv/-1734967052/lib/python3.7/site-packages/pkg_resources/__init__.py:2804
../../build/gradleenv/-1734967052/lib/python3.7/site-packages/pkg_resources/__init__.py:2804
../../build/gradleenv/-1734967052/lib/python3.7/site-packages/pkg_resources/__init__.py:2804
../../build/gradleenv/-1734967052/lib/python3.7/site-packages/pkg_resources/__init__.py:2804
../../build/gradleenv/-1734967052/lib/python3.7/site-packages/pkg_resources/__init__.py:2804
../../build/gradleenv/-1734967052/lib/python3.7/site-packages/pkg_resources/__init__.py:2804
../../build/gradleenv/-1734967052/lib/python3.7/site-packages/pkg_resources/__init__.py:2804
  <https://ci-beam.apache.org/job/beam_PostCommit_Python37/ws/src/build/gradleenv/-1734967052/lib/python3.7/site-packages/pkg_resources/__init__.py>:2804: DeprecationWarning: Deprecated call to `pkg_resources.declare_namespace('google.iam')`.
  Implementing implicit namespace packages (as specified in PEP 420) is preferred to `pkg_resources.declare_namespace`. See https://setuptools.pypa.io/en/latest/references/keywords.html#keyword-namespace-packages
    declare_namespace(pkg)

../../build/gradleenv/-1734967052/lib/python3.7/site-packages/google/rpc/__init__.py:20
../../build/gradleenv/-1734967052/lib/python3.7/site-packages/google/rpc/__init__.py:20
../../build/gradleenv/-1734967052/lib/python3.7/site-packages/google/rpc/__init__.py:20
../../build/gradleenv/-1734967052/lib/python3.7/site-packages/google/rpc/__init__.py:20
../../build/gradleenv/-1734967052/lib/python3.7/site-packages/google/rpc/__init__.py:20
../../build/gradleenv/-1734967052/lib/python3.7/site-packages/google/rpc/__init__.py:20
../../build/gradleenv/-1734967052/lib/python3.7/site-packages/google/rpc/__init__.py:20
../../build/gradleenv/-1734967052/lib/python3.7/site-packages/google/rpc/__init__.py:20
../../build/gradleenv/-1734967052/lib/python3.7/site-packages/google/rpc/__init__.py:20
  <https://ci-beam.apache.org/job/beam_PostCommit_Python37/ws/src/build/gradleenv/-1734967052/lib/python3.7/site-packages/google/rpc/__init__.py>:20: DeprecationWarning: Deprecated call to `pkg_resources.declare_namespace('google.rpc')`.
  Implementing implicit namespace packages (as specified in PEP 420) is preferred to `pkg_resources.declare_namespace`. See https://setuptools.pypa.io/en/latest/references/keywords.html#keyword-namespace-packages
    pkg_resources.declare_namespace(__name__)

apache_beam/io/gcp/experimental/spannerio_write_it_test.py::SpannerWriteIntegrationTest::test_spanner_error
  <https://ci-beam.apache.org/job/beam_PostCommit_Python37/ws/src/sdks/python/apache_beam/io/gcp/experimental/spannerio_write_it_test.py>:190: FutureWarning: WriteToSpanner is experimental. No backwards-compatibility guarantees.
    database_id=self.TEST_DATABASE))

apache_beam/io/gcp/experimental/spannerio_read_it_test.py::SpannerReadIntegrationTest::test_read_via_sql
  <https://ci-beam.apache.org/job/beam_PostCommit_Python37/ws/src/sdks/python/apache_beam/io/gcp/experimental/spannerio_read_it_test.py>:128: FutureWarning: ReadFromSpanner is experimental. No backwards-compatibility guarantees.
    sql="select * from Users")

apache_beam/io/gcp/experimental/spannerio_write_it_test.py::SpannerWriteIntegrationTest::test_spanner_update
  <https://ci-beam.apache.org/job/beam_PostCommit_Python37/ws/src/sdks/python/apache_beam/io/gcp/experimental/spannerio_write_it_test.py>:171: FutureWarning: WriteToSpanner is experimental. No backwards-compatibility guarantees.
    database_id=self.TEST_DATABASE))

apache_beam/io/gcp/experimental/spannerio_read_it_test.py::SpannerReadIntegrationTest::test_read_via_table
  <https://ci-beam.apache.org/job/beam_PostCommit_Python37/ws/src/sdks/python/apache_beam/io/gcp/experimental/spannerio_read_it_test.py>:117: FutureWarning: ReadFromSpanner is experimental. No backwards-compatibility guarantees.
    columns=["UserId", "Key"])

apache_beam/io/gcp/experimental/spannerio_write_it_test.py::SpannerWriteIntegrationTest::test_write_batches
  <https://ci-beam.apache.org/job/beam_PostCommit_Python37/ws/src/sdks/python/apache_beam/io/gcp/experimental/spannerio_write_it_test.py>:135: FutureWarning: WriteToSpanner is experimental. No backwards-compatibility guarantees.
    max_batch_size_bytes=250))

-- Docs: https://docs.pytest.org/en/stable/how-to/capture-warnings.html
- generated xml file: <https://ci-beam.apache.org/job/beam_PostCommit_Python37/ws/src/sdks/python/pytest_postCommitIT-df-py37.xml> -
=========== 5 passed, 18 skipped, 365 warnings in 1928.74s (0:32:08) ===========

FAILURE: Build failed with an exception.

* Where:
Script '<https://ci-beam.apache.org/job/beam_PostCommit_Python37/ws/src/sdks/python/test-suites/direct/common.gradle'> line: 194

* What went wrong:
Execution failed for task ':sdks:python:test-suites:direct:py37:azureIntegrationTest'.
> Process 'command 'sh'' finished with non-zero exit value 1

* Try:
> Run with --stacktrace option to get the stack trace.
> Run with --info or --debug option to get more log output.

* Get more help at https://help.gradle.org

Deprecated Gradle features were used in this build, making it incompatible with Gradle 8.0.

You can use '--warning-mode all' to show the individual deprecation warnings and determine if they come from your own scripts or plugins.

See https://docs.gradle.org/7.5.1/userguide/command_line_interface.html#sec:command_line_warnings

Execution optimizations have been disabled for 1 invalid unit(s) of work during this build to ensure correctness.
Please consult deprecation warnings for more details.

BUILD FAILED in 4h 22m 7s
216 actionable tasks: 151 executed, 59 from cache, 6 up-to-date

Publishing build scan...
https://gradle.com/s/3nxhkvq4y6mj2

Build step 'Invoke Gradle script' changed build result to FAILURE
Build step 'Invoke Gradle script' marked build as failure

---------------------------------------------------------------------
To unsubscribe, e-mail: builds-unsubscribe@beam.apache.org
For additional commands, e-mail: builds-help@beam.apache.org


Build failed in Jenkins: beam_PostCommit_Python37 #6379

Posted by Apache Jenkins Server <je...@builds.apache.org>.
See <https://ci-beam.apache.org/job/beam_PostCommit_Python37/6379/display/redirect>

Changes:


------------------------------------------
[...truncated 17.25 MB...]

apache_beam/dataframe/io_it_test.py: 2 warnings
apache_beam/io/gcp/bigquery_json_it_test.py: 1 warning
apache_beam/io/gcp/bigquery_read_it_test.py: 9 warnings
  <https://ci-beam.apache.org/job/beam_PostCommit_Python37/ws/src/sdks/python/apache_beam/io/gcp/bigquery.py>:2557: BeamDeprecationWarning: options is deprecated since First stable release. References to <pipeline>.options will not be supported
    | _PassThroughThenCleanupTempDatasets(project_to_cleanup_pcoll))

apache_beam/examples/dataframe/flight_delays_it_test.py::FlightDelaysTest::test_flight_delays
  <https://ci-beam.apache.org/job/beam_PostCommit_Python37/ws/src/sdks/python/apache_beam/examples/dataframe/flight_delays.py>:47: FutureWarning: Dropping of nuisance columns in DataFrame reductions (with 'numeric_only=None') is deprecated; in a future version this will raise TypeError.  Select only valid columns before calling the reduction.
    return airline_df[at_top_airports].mean()

apache_beam/examples/dataframe/flight_delays_it_test.py::FlightDelaysTest::test_flight_delays
apache_beam/examples/dataframe/taxiride_it_test.py::TaxirideIT::test_aggregation
apache_beam/examples/dataframe/taxiride_it_test.py::TaxirideIT::test_enrich
  <https://ci-beam.apache.org/job/beam_PostCommit_Python37/ws/src/sdks/python/apache_beam/dataframe/io.py>:664: FutureWarning: WriteToFiles is experimental.
    sink=lambda _: _WriteToPandasFileSink(

apache_beam/examples/dataframe/flight_delays_it_test.py::FlightDelaysTest::test_flight_delays
apache_beam/examples/dataframe/taxiride_it_test.py::TaxirideIT::test_aggregation
apache_beam/examples/dataframe/taxiride_it_test.py::TaxirideIT::test_enrich
  <https://ci-beam.apache.org/job/beam_PostCommit_Python37/ws/src/sdks/python/apache_beam/io/fileio.py>:593: BeamDeprecationWarning: options is deprecated since First stable release. References to <pipeline>.options will not be supported
    p.options.view_as(GoogleCloudOptions).temp_location or

apache_beam/io/gcp/bigquery_test.py::BigQueryStreamingInsertTransformIntegrationTests::test_multiple_destinations_transform
  <https://ci-beam.apache.org/job/beam_PostCommit_Python37/ws/src/sdks/python/apache_beam/io/gcp/bigquery_test.py>:1690: BeamDeprecationWarning: options is deprecated since First stable release. References to <pipeline>.options will not be supported
    streaming = self.test_pipeline.options.view_as(StandardOptions).streaming

apache_beam/io/gcp/bigquery_read_it_test.py::ReadTests::test_native_source
  <https://ci-beam.apache.org/job/beam_PostCommit_Python37/ws/src/sdks/python/apache_beam/io/gcp/bigquery_read_it_test.py>:170: BeamDeprecationWarning: BigQuerySource is deprecated since 2.25.0. Use ReadFromBigQuery instead.
    beam.io.BigQuerySource(query=self.query, use_standard_sql=True)))

apache_beam/ml/gcp/cloud_dlp_it_test.py::CloudDLPIT::test_deidentification
  <https://ci-beam.apache.org/job/beam_PostCommit_Python37/ws/src/sdks/python/apache_beam/ml/gcp/cloud_dlp_it_test.py>:77: FutureWarning: MaskDetectedDetails is experimental.
    inspection_config=INSPECT_CONFIG))

apache_beam/ml/gcp/cloud_dlp_it_test.py::CloudDLPIT::test_inspection
  <https://ci-beam.apache.org/job/beam_PostCommit_Python37/ws/src/sdks/python/apache_beam/ml/gcp/cloud_dlp_it_test.py>:87: FutureWarning: InspectForDetails is experimental.
    | beam.ParDo(extract_inspection_results).with_outputs(

apache_beam/ml/inference/sklearn_inference_it_test.py::SklearnInference::test_sklearn_regression
  <https://ci-beam.apache.org/job/beam_PostCommit_Python37/ws/src/sdks/python/apache_beam/examples/inference/sklearn_japanese_housing_regression.py>:129: FutureWarning: SklearnModelHandlerPandas is experimental. No backwards-compatibility guarantees.
    model_file_type=ModelFileType.PICKLE, model_uri=model_filename)

apache_beam/ml/inference/sklearn_inference_it_test.py::SklearnInference::test_sklearn_regression
  <https://ci-beam.apache.org/job/beam_PostCommit_Python37/ws/src/build/gradleenv/-1734967052/lib/python3.7/site-packages/dill/_dill.py>:472: FutureWarning: SklearnModelHandlerPandas is experimental. No backwards-compatibility guarantees.
    obj = StockUnpickler.load(self)

apache_beam/io/gcp/bigquery_read_it_test.py::ReadNewTypesTests::test_native_source
  <https://ci-beam.apache.org/job/beam_PostCommit_Python37/ws/src/sdks/python/apache_beam/io/gcp/bigquery_read_it_test.py>:693: BeamDeprecationWarning: BigQuerySource is deprecated since 2.25.0. Use ReadFromBigQuery instead.
    beam.io.BigQuerySource(query=self.query, use_standard_sql=True)))

apache_beam/io/gcp/bigquery_read_it_test.py::ReadAllBQTests::test_read_queries
  <https://ci-beam.apache.org/job/beam_PostCommit_Python37/ws/src/sdks/python/apache_beam/io/gcp/bigquery_read_it_test.py>:808: FutureWarning: ReadAllFromBigQuery is experimental.
    | beam.io.ReadAllFromBigQuery())

apache_beam/io/gcp/bigquery_read_it_test.py::ReadAllBQTests::test_read_queries
  <https://ci-beam.apache.org/job/beam_PostCommit_Python37/ws/src/sdks/python/apache_beam/io/gcp/bigquery.py>:2658: BeamDeprecationWarning: options is deprecated since First stable release. References to <pipeline>.options will not be supported
    job_name = pcoll.pipeline.options.view_as(GoogleCloudOptions).job_name

apache_beam/io/gcp/bigquery_read_it_test.py::ReadAllBQTests::test_read_queries
  <https://ci-beam.apache.org/job/beam_PostCommit_Python37/ws/src/sdks/python/apache_beam/io/gcp/bigquery.py>:2659: BeamDeprecationWarning: options is deprecated since First stable release. References to <pipeline>.options will not be supported
    project = pcoll.pipeline.options.view_as(GoogleCloudOptions).project

apache_beam/io/gcp/bigquery_read_it_test.py::ReadAllBQTests::test_read_queries
  <https://ci-beam.apache.org/job/beam_PostCommit_Python37/ws/src/sdks/python/apache_beam/io/gcp/bigquery.py>:2672: BeamDeprecationWarning: options is deprecated since First stable release. References to <pipeline>.options will not be supported
    options=pcoll.pipeline.options,

-- Docs: https://docs.pytest.org/en/stable/how-to/capture-warnings.html
- generated xml file: <https://ci-beam.apache.org/job/beam_PostCommit_Python37/ws/src/sdks/python/pytest_postCommitIT-df-py37.xml> -
========== 85 passed, 28 skipped, 576 warnings in 18046.91s (5:00:46) ==========

> Task :sdks:python:test-suites:dataflow:py37:spannerioIT
>>> RUNNING integration tests with pipeline options: --runner=TestDataflowRunner --project=apache-beam-testing --region=us-central1 --staging_location=gs://temp-storage-for-end-to-end-tests/staging-it --temp_location=gs://temp-storage-for-end-to-end-tests/temp-it --output=gs://temp-storage-for-end-to-end-tests/py-it-cloud/output --sdk_location=<https://ci-beam.apache.org/job/beam_PostCommit_Python37/ws/src/sdks/python/build/apache-beam.tar.gz> --requirements_file=postcommit_requirements.txt --num_workers=1 --sleep_secs=20 --kms_key_name=projects/apache-beam-testing/locations/global/keyRings/beam-it/cryptoKeys/test --dataflow_kms_key=projects/apache-beam-testing/locations/global/keyRings/beam-it/cryptoKeys/test
>>>   pytest options: --capture=no --timeout=4500 --color=yes --log-cli-level=INFO --numprocesses=8 --dist=loadfile
>>>   collect markers: -m=spannerio_it
============================= test session starts ==============================
platform linux -- Python 3.7.12, pytest-7.2.1, pluggy-1.0.0
rootdir: <https://ci-beam.apache.org/job/beam_PostCommit_Python37/ws/src/sdks/python,> configfile: pytest.ini
plugins: xdist-2.5.0, timeout-2.1.0, forked-1.6.0, hypothesis-6.68.2, requests-mock-1.10.0
timeout: 4500.0s
timeout method: signal
timeout func_only: False
gw0 I / gw1 I / gw2 I / gw3 I / gw4 I / gw5 I / gw6 I / gw7 I
[gw1] Python 3.7.12 (default, Jan 15 2022, 18:42:10)  -- [GCC 9.3.0]
[gw3] Python 3.7.12 (default, Jan 15 2022, 18:42:10)  -- [GCC 9.3.0]
[gw0] Python 3.7.12 (default, Jan 15 2022, 18:42:10)  -- [GCC 9.3.0]
[gw2] Python 3.7.12 (default, Jan 15 2022, 18:42:10)  -- [GCC 9.3.0]
[gw5] Python 3.7.12 (default, Jan 15 2022, 18:42:10)  -- [GCC 9.3.0]
[gw6] Python 3.7.12 (default, Jan 15 2022, 18:42:10)  -- [GCC 9.3.0]
[gw4] Python 3.7.12 (default, Jan 15 2022, 18:42:10)  -- [GCC 9.3.0]
[gw7] Python 3.7.12 (default, Jan 15 2022, 18:42:10)  -- [GCC 9.3.0]
gw0 [15] / gw1 [15] / gw2 [15] / gw3 [15] / gw4 [15] / gw5 [15] / gw6 [15] / gw7 [15]

scheduling tests via LoadFileScheduling

apache_beam/io/gcp/experimental/spannerio_write_it_test.py::SpannerWriteIntegrationTest::test_metrics_error_call 
apache_beam/io/gcp/experimental/spannerio_read_it_test.py::SpannerReadIntegrationTest::test_read_via_sql 
[gw3] SKIPPED apache_beam/io/gcp/experimental/spannerio_write_it_test.py::SpannerWriteIntegrationTest::test_metrics_error_call 
apache_beam/io/gcp/experimental/spannerio_write_it_test.py::SpannerWriteIntegrationTest::test_metrics_ok_call 
[gw3] SKIPPED apache_beam/io/gcp/experimental/spannerio_write_it_test.py::SpannerWriteIntegrationTest::test_metrics_ok_call 
apache_beam/io/gcp/experimental/spannerio_write_it_test.py::SpannerWriteIntegrationTest::test_spanner_error 
[gw1] PASSED apache_beam/io/gcp/experimental/spannerio_read_it_test.py::SpannerReadIntegrationTest::test_read_via_sql 
apache_beam/io/gcp/experimental/spannerio_read_it_test.py::SpannerReadIntegrationTest::test_read_via_table 
[gw3] PASSED apache_beam/io/gcp/experimental/spannerio_write_it_test.py::SpannerWriteIntegrationTest::test_spanner_error 
apache_beam/io/gcp/experimental/spannerio_write_it_test.py::SpannerWriteIntegrationTest::test_spanner_update 
[gw1] PASSED apache_beam/io/gcp/experimental/spannerio_read_it_test.py::SpannerReadIntegrationTest::test_read_via_table 
apache_beam/io/gcp/experimental/spannerio_read_it_test.py::SpannerReadIntegrationTest::test_sql_metrics_error_call 
[gw1] SKIPPED apache_beam/io/gcp/experimental/spannerio_read_it_test.py::SpannerReadIntegrationTest::test_sql_metrics_error_call 
apache_beam/io/gcp/experimental/spannerio_read_it_test.py::SpannerReadIntegrationTest::test_sql_metrics_ok_call 
[gw1] SKIPPED apache_beam/io/gcp/experimental/spannerio_read_it_test.py::SpannerReadIntegrationTest::test_sql_metrics_ok_call 
apache_beam/io/gcp/experimental/spannerio_read_it_test.py::SpannerReadIntegrationTest::test_table_metrics_error_call 
[gw1] SKIPPED apache_beam/io/gcp/experimental/spannerio_read_it_test.py::SpannerReadIntegrationTest::test_table_metrics_error_call 
apache_beam/io/gcp/experimental/spannerio_read_it_test.py::SpannerReadIntegrationTest::test_table_metrics_ok_call 
[gw1] SKIPPED apache_beam/io/gcp/experimental/spannerio_read_it_test.py::SpannerReadIntegrationTest::test_table_metrics_ok_call 
apache_beam/io/gcp/experimental/spannerio_read_it_test.py::SpannerReadIntegrationTest::test_transaction_sql_metrics_error_call 
[gw1] SKIPPED apache_beam/io/gcp/experimental/spannerio_read_it_test.py::SpannerReadIntegrationTest::test_transaction_sql_metrics_error_call 
apache_beam/io/gcp/experimental/spannerio_read_it_test.py::SpannerReadIntegrationTest::test_transaction_sql_metrics_ok_call 
[gw1] SKIPPED apache_beam/io/gcp/experimental/spannerio_read_it_test.py::SpannerReadIntegrationTest::test_transaction_sql_metrics_ok_call 
apache_beam/io/gcp/experimental/spannerio_read_it_test.py::SpannerReadIntegrationTest::test_transaction_table_metrics_error_call 
[gw1] SKIPPED apache_beam/io/gcp/experimental/spannerio_read_it_test.py::SpannerReadIntegrationTest::test_transaction_table_metrics_error_call 
apache_beam/io/gcp/experimental/spannerio_read_it_test.py::SpannerReadIntegrationTest::test_transaction_table_metrics_ok_call 
[gw1] SKIPPED apache_beam/io/gcp/experimental/spannerio_read_it_test.py::SpannerReadIntegrationTest::test_transaction_table_metrics_ok_call 
[gw3] PASSED apache_beam/io/gcp/experimental/spannerio_write_it_test.py::SpannerWriteIntegrationTest::test_spanner_update 
apache_beam/io/gcp/experimental/spannerio_write_it_test.py::SpannerWriteIntegrationTest::test_write_batches 
[gw3] PASSED apache_beam/io/gcp/experimental/spannerio_write_it_test.py::SpannerWriteIntegrationTest::test_write_batches 

=============================== warnings summary ===============================
../../build/gradleenv/-1734967052/lib/python3.7/site-packages/hdfs/config.py:15
../../build/gradleenv/-1734967052/lib/python3.7/site-packages/hdfs/config.py:15
../../build/gradleenv/-1734967052/lib/python3.7/site-packages/hdfs/config.py:15
../../build/gradleenv/-1734967052/lib/python3.7/site-packages/hdfs/config.py:15
../../build/gradleenv/-1734967052/lib/python3.7/site-packages/hdfs/config.py:15
../../build/gradleenv/-1734967052/lib/python3.7/site-packages/hdfs/config.py:15
../../build/gradleenv/-1734967052/lib/python3.7/site-packages/hdfs/config.py:15
../../build/gradleenv/-1734967052/lib/python3.7/site-packages/hdfs/config.py:15
../../build/gradleenv/-1734967052/lib/python3.7/site-packages/hdfs/config.py:15
  <https://ci-beam.apache.org/job/beam_PostCommit_Python37/ws/src/build/gradleenv/-1734967052/lib/python3.7/site-packages/hdfs/config.py>:15: DeprecationWarning: the imp module is deprecated in favour of importlib; see the module's documentation for alternative uses
    from imp import load_source

../../build/gradleenv/-1734967052/lib/python3.7/site-packages/pkg_resources/__init__.py:2804: 171 warnings
  <https://ci-beam.apache.org/job/beam_PostCommit_Python37/ws/src/build/gradleenv/-1734967052/lib/python3.7/site-packages/pkg_resources/__init__.py>:2804: DeprecationWarning: Deprecated call to `pkg_resources.declare_namespace('google')`.
  Implementing implicit namespace packages (as specified in PEP 420) is preferred to `pkg_resources.declare_namespace`. See https://setuptools.pypa.io/en/latest/references/keywords.html#keyword-namespace-packages
    declare_namespace(pkg)

../../build/gradleenv/-1734967052/lib/python3.7/site-packages/pkg_resources/__init__.py:2804: 117 warnings
  <https://ci-beam.apache.org/job/beam_PostCommit_Python37/ws/src/build/gradleenv/-1734967052/lib/python3.7/site-packages/pkg_resources/__init__.py>:2804: DeprecationWarning: Deprecated call to `pkg_resources.declare_namespace('google.cloud')`.
  Implementing implicit namespace packages (as specified in PEP 420) is preferred to `pkg_resources.declare_namespace`. See https://setuptools.pypa.io/en/latest/references/keywords.html#keyword-namespace-packages
    declare_namespace(pkg)

../../build/gradleenv/-1734967052/lib/python3.7/site-packages/pkg_resources/__init__.py:2309: 36 warnings
  <https://ci-beam.apache.org/job/beam_PostCommit_Python37/ws/src/build/gradleenv/-1734967052/lib/python3.7/site-packages/pkg_resources/__init__.py>:2309: DeprecationWarning: Deprecated call to `pkg_resources.declare_namespace('google')`.
  Implementing implicit namespace packages (as specified in PEP 420) is preferred to `pkg_resources.declare_namespace`. See https://setuptools.pypa.io/en/latest/references/keywords.html#keyword-namespace-packages
    declare_namespace(parent)

../../build/gradleenv/-1734967052/lib/python3.7/site-packages/pkg_resources/__init__.py:2804
../../build/gradleenv/-1734967052/lib/python3.7/site-packages/pkg_resources/__init__.py:2804
../../build/gradleenv/-1734967052/lib/python3.7/site-packages/pkg_resources/__init__.py:2804
../../build/gradleenv/-1734967052/lib/python3.7/site-packages/pkg_resources/__init__.py:2804
../../build/gradleenv/-1734967052/lib/python3.7/site-packages/pkg_resources/__init__.py:2804
../../build/gradleenv/-1734967052/lib/python3.7/site-packages/pkg_resources/__init__.py:2804
../../build/gradleenv/-1734967052/lib/python3.7/site-packages/pkg_resources/__init__.py:2804
../../build/gradleenv/-1734967052/lib/python3.7/site-packages/pkg_resources/__init__.py:2804
../../build/gradleenv/-1734967052/lib/python3.7/site-packages/pkg_resources/__init__.py:2804
  <https://ci-beam.apache.org/job/beam_PostCommit_Python37/ws/src/build/gradleenv/-1734967052/lib/python3.7/site-packages/pkg_resources/__init__.py>:2804: DeprecationWarning: Deprecated call to `pkg_resources.declare_namespace('google.logging')`.
  Implementing implicit namespace packages (as specified in PEP 420) is preferred to `pkg_resources.declare_namespace`. See https://setuptools.pypa.io/en/latest/references/keywords.html#keyword-namespace-packages
    declare_namespace(pkg)

../../build/gradleenv/-1734967052/lib/python3.7/site-packages/pkg_resources/__init__.py:2804
../../build/gradleenv/-1734967052/lib/python3.7/site-packages/pkg_resources/__init__.py:2804
../../build/gradleenv/-1734967052/lib/python3.7/site-packages/pkg_resources/__init__.py:2804
../../build/gradleenv/-1734967052/lib/python3.7/site-packages/pkg_resources/__init__.py:2804
../../build/gradleenv/-1734967052/lib/python3.7/site-packages/pkg_resources/__init__.py:2804
../../build/gradleenv/-1734967052/lib/python3.7/site-packages/pkg_resources/__init__.py:2804
../../build/gradleenv/-1734967052/lib/python3.7/site-packages/pkg_resources/__init__.py:2804
../../build/gradleenv/-1734967052/lib/python3.7/site-packages/pkg_resources/__init__.py:2804
../../build/gradleenv/-1734967052/lib/python3.7/site-packages/pkg_resources/__init__.py:2804
  <https://ci-beam.apache.org/job/beam_PostCommit_Python37/ws/src/build/gradleenv/-1734967052/lib/python3.7/site-packages/pkg_resources/__init__.py>:2804: DeprecationWarning: Deprecated call to `pkg_resources.declare_namespace('google.iam')`.
  Implementing implicit namespace packages (as specified in PEP 420) is preferred to `pkg_resources.declare_namespace`. See https://setuptools.pypa.io/en/latest/references/keywords.html#keyword-namespace-packages
    declare_namespace(pkg)

../../build/gradleenv/-1734967052/lib/python3.7/site-packages/google/rpc/__init__.py:20
../../build/gradleenv/-1734967052/lib/python3.7/site-packages/google/rpc/__init__.py:20
../../build/gradleenv/-1734967052/lib/python3.7/site-packages/google/rpc/__init__.py:20
../../build/gradleenv/-1734967052/lib/python3.7/site-packages/google/rpc/__init__.py:20
../../build/gradleenv/-1734967052/lib/python3.7/site-packages/google/rpc/__init__.py:20
../../build/gradleenv/-1734967052/lib/python3.7/site-packages/google/rpc/__init__.py:20
../../build/gradleenv/-1734967052/lib/python3.7/site-packages/google/rpc/__init__.py:20
../../build/gradleenv/-1734967052/lib/python3.7/site-packages/google/rpc/__init__.py:20
../../build/gradleenv/-1734967052/lib/python3.7/site-packages/google/rpc/__init__.py:20
  <https://ci-beam.apache.org/job/beam_PostCommit_Python37/ws/src/build/gradleenv/-1734967052/lib/python3.7/site-packages/google/rpc/__init__.py>:20: DeprecationWarning: Deprecated call to `pkg_resources.declare_namespace('google.rpc')`.
  Implementing implicit namespace packages (as specified in PEP 420) is preferred to `pkg_resources.declare_namespace`. See https://setuptools.pypa.io/en/latest/references/keywords.html#keyword-namespace-packages
    pkg_resources.declare_namespace(__name__)

apache_beam/io/gcp/experimental/spannerio_read_it_test.py::SpannerReadIntegrationTest::test_read_via_sql
  <https://ci-beam.apache.org/job/beam_PostCommit_Python37/ws/src/sdks/python/apache_beam/io/gcp/experimental/spannerio_read_it_test.py>:128: FutureWarning: ReadFromSpanner is experimental. No backwards-compatibility guarantees.
    sql="select * from Users")

apache_beam/io/gcp/experimental/spannerio_write_it_test.py::SpannerWriteIntegrationTest::test_spanner_error
  <https://ci-beam.apache.org/job/beam_PostCommit_Python37/ws/src/sdks/python/apache_beam/io/gcp/experimental/spannerio_write_it_test.py>:190: FutureWarning: WriteToSpanner is experimental. No backwards-compatibility guarantees.
    database_id=self.TEST_DATABASE))

apache_beam/io/gcp/experimental/spannerio_read_it_test.py::SpannerReadIntegrationTest::test_read_via_table
  <https://ci-beam.apache.org/job/beam_PostCommit_Python37/ws/src/sdks/python/apache_beam/io/gcp/experimental/spannerio_read_it_test.py>:117: FutureWarning: ReadFromSpanner is experimental. No backwards-compatibility guarantees.
    columns=["UserId", "Key"])

apache_beam/io/gcp/experimental/spannerio_write_it_test.py::SpannerWriteIntegrationTest::test_spanner_update
  <https://ci-beam.apache.org/job/beam_PostCommit_Python37/ws/src/sdks/python/apache_beam/io/gcp/experimental/spannerio_write_it_test.py>:171: FutureWarning: WriteToSpanner is experimental. No backwards-compatibility guarantees.
    database_id=self.TEST_DATABASE))

apache_beam/io/gcp/experimental/spannerio_write_it_test.py::SpannerWriteIntegrationTest::test_write_batches
  <https://ci-beam.apache.org/job/beam_PostCommit_Python37/ws/src/sdks/python/apache_beam/io/gcp/experimental/spannerio_write_it_test.py>:135: FutureWarning: WriteToSpanner is experimental. No backwards-compatibility guarantees.
    max_batch_size_bytes=250))

-- Docs: https://docs.pytest.org/en/stable/how-to/capture-warnings.html
- generated xml file: <https://ci-beam.apache.org/job/beam_PostCommit_Python37/ws/src/sdks/python/pytest_postCommitIT-df-py37.xml> -
=========== 5 passed, 18 skipped, 365 warnings in 2267.47s (0:37:47) ===========

FAILURE: Build failed with an exception.

* Where:
Script '<https://ci-beam.apache.org/job/beam_PostCommit_Python37/ws/src/sdks/python/test-suites/direct/common.gradle'> line: 194

* What went wrong:
Execution failed for task ':sdks:python:test-suites:direct:py37:azureIntegrationTest'.
> Process 'command 'sh'' finished with non-zero exit value 1

* Try:
> Run with --stacktrace option to get the stack trace.
> Run with --info or --debug option to get more log output.

* Get more help at https://help.gradle.org

Deprecated Gradle features were used in this build, making it incompatible with Gradle 8.0.

You can use '--warning-mode all' to show the individual deprecation warnings and determine if they come from your own scripts or plugins.

See https://docs.gradle.org/7.5.1/userguide/command_line_interface.html#sec:command_line_warnings

Execution optimizations have been disabled for 1 invalid unit(s) of work during this build to ensure correctness.
Please consult deprecation warnings for more details.

BUILD FAILED in 5h 40m 44s
216 actionable tasks: 151 executed, 59 from cache, 6 up-to-date

Publishing build scan...
https://gradle.com/s/kcajducjg63lo

Build step 'Invoke Gradle script' changed build result to FAILURE
Build step 'Invoke Gradle script' marked build as failure

---------------------------------------------------------------------
To unsubscribe, e-mail: builds-unsubscribe@beam.apache.org
For additional commands, e-mail: builds-help@beam.apache.org