You are viewing a plain text version of this content. The canonical link for it is here.
Posted to commits@jena.apache.org by Apache Jenkins Server <je...@builds.apache.org> on 2021/10/15 08:31:59 UTC
Build failed in Jenkins: Jena » Jena_Development_Test #237
See <https://ci-builds.apache.org/job/Jena/job/Jena_Development_Test/237/display/redirect?page=changes>
Changes:
[jan-martin.keil] Dataset: enable named Models with blank node name
[Andy Seaborne] Label Explain
[Andy Seaborne] JENA-2183: Remove deprecated BindingHashMap
[Andy Seaborne] JENA-2179: NodecSSE to ignore warnings
[Andy Seaborne] Clean white space and comments. Implement debug NodeTable.all
[Andy Seaborne] Add getter for the ProgressMonitor label
[Andy Seaborne] Assemble from Model+type
[Andy Seaborne] Add serverStarted to the FusekiModule lifecycle
[Andy Seaborne] Rename serverStarting/serverStarted to serverBeforeStarting/serverAfterStarting
[Andy Seaborne] Clarify role of IRIResolver
[Andy Seaborne] Injectable Fuseki command
[Andy Seaborne] Improve naming for xloader steps
[Andy Seaborne] JENA-2169: Enable named Models with blank node name
------------------------------------------
[...truncated 151.26 KB...]
[INFO] -------------------------------------------------------
[INFO] Running org.apache.jena.dboe.storage.storage.TestDatasetGraphStorageTests
[INFO] Tests run: 23, Failures: 0, Errors: 0, Skipped: 0, Time elapsed: 1.28 s - in org.apache.jena.dboe.storage.storage.TestDatasetGraphStorageTests
[INFO] Running org.apache.jena.dboe.storage.storage.TestDatasetGraphStorageFindTests
[INFO] Tests run: 20, Failures: 0, Errors: 0, Skipped: 0, Time elapsed: 0.02 s - in org.apache.jena.dboe.storage.storage.TestDatasetGraphStorageFindTests
[INFO] Running org.apache.jena.dboe.storage.storage.TestStorageSimple
[INFO] Tests run: 8, Failures: 0, Errors: 0, Skipped: 0, Time elapsed: 0.005 s - in org.apache.jena.dboe.storage.storage.TestStorageSimple
[INFO] Running org.apache.jena.dboe.storage.prefixes.TestDatasetPrefixesMem
[INFO] Tests run: 5, Failures: 0, Errors: 0, Skipped: 0, Time elapsed: 0.003 s - in org.apache.jena.dboe.storage.prefixes.TestDatasetPrefixesMem
[INFO] Running org.apache.jena.dboe.storage.prefixes.TestPrefixMappingOverDatasetPrefixes
[INFO] Tests run: 8, Failures: 0, Errors: 0, Skipped: 0, Time elapsed: 0.008 s - in org.apache.jena.dboe.storage.prefixes.TestPrefixMappingOverDatasetPrefixes
[INFO] Running org.apache.jena.dboe.storage.prefixes.TestPrefixLib
[INFO] Tests run: 6, Failures: 0, Errors: 0, Skipped: 0, Time elapsed: 0.003 s - in org.apache.jena.dboe.storage.prefixes.TestPrefixLib
[INFO] Running org.apache.jena.dboe.storage.prefixes.TestPrefixMappingOverDatasetPrefixes2
[INFO] Tests run: 8, Failures: 0, Errors: 0, Skipped: 0, Time elapsed: 0.003 s - in org.apache.jena.dboe.storage.prefixes.TestPrefixMappingOverDatasetPrefixes2
[INFO]
[INFO] Results:
[INFO]
[INFO] Tests run: 78, Failures: 0, Errors: 0, Skipped: 0
[INFO]
[JENKINS] Recording test results
[INFO]
[INFO] --- maven-jar-plugin:3.2.0:jar (default-jar) @ jena-dboe-storage ---
[INFO] Building jar: <https://ci-builds.apache.org/job/Jena/job/Jena_Development_Test/ws/jena-db/jena-dboe-storage/target/jena-dboe-storage-4.3.0-SNAPSHOT.jar>
[INFO]
[INFO] --- maven-site-plugin:3.9.1:attach-descriptor (attach-descriptor) @ jena-dboe-storage ---
[INFO] Skipping because packaging 'jar' is not pom.
[INFO]
[INFO] --- maven-jar-plugin:3.2.0:test-jar (default) @ jena-dboe-storage ---
[INFO] Building jar: <https://ci-builds.apache.org/job/Jena/job/Jena_Development_Test/ws/jena-db/jena-dboe-storage/target/jena-dboe-storage-4.3.0-SNAPSHOT-tests.jar>
[INFO]
[INFO] ---------------------< org.apache.jena:jena-tdb2 >----------------------
[INFO] Building Apache Jena - DBOE TDB2 (Native Triple Store) 4.3.0-SNAPSHOT [18/45]
[INFO] --------------------------------[ jar ]---------------------------------
[INFO]
[INFO] --- maven-clean-plugin:3.1.0:clean (default-clean) @ jena-tdb2 ---
[INFO] Deleting <https://ci-builds.apache.org/job/Jena/job/Jena_Development_Test/ws/jena-db/jena-tdb2/target>
[INFO]
[INFO] --- maven-enforcer-plugin:3.0.0:enforce (enforce-maven-version) @ jena-tdb2 ---
[INFO]
[INFO] --- maven-enforcer-plugin:3.0.0:enforce (enforce-java-version) @ jena-tdb2 ---
[INFO]
[INFO] --- maven-enforcer-plugin:3.0.0:enforce (enforce-output-timestamp-property) @ jena-tdb2 ---
[INFO]
[INFO] --- maven-enforcer-plugin:3.0.0:enforce (enforce) @ jena-tdb2 ---
[INFO] Downloading from Nexus: http://repository.apache.org/snapshots/org/apache/jena/jena-tdb2/4.3.0-SNAPSHOT/maven-metadata.xml
[INFO] Downloaded from Nexus: http://repository.apache.org/snapshots/org/apache/jena/jena-tdb2/4.3.0-SNAPSHOT/maven-metadata.xml (1.2 kB at 3.6 kB/s)
[INFO]
[INFO] --- maven-remote-resources-plugin:1.7.0:process (process-resource-bundles) @ jena-tdb2 ---
[INFO] Preparing remote bundle org.apache:apache-jar-resource-bundle:1.4
[INFO] Copying 3 resources from 1 bundle.
[INFO]
[INFO] --- maven-resources-plugin:3.2.0:resources (default-resources) @ jena-tdb2 ---
[INFO] Using 'UTF-8' encoding to copy filtered resources.
[INFO] Using 'UTF-8' encoding to copy filtered properties files.
[INFO] Copying 1 resource
[INFO] Copying 1 resource
[INFO] Copying 3 resources
[INFO]
[INFO] --- maven-compiler-plugin:3.8.1:compile (default-compile) @ jena-tdb2 ---
[INFO] Changes detected - recompiling the module!
[INFO] Compiling 132 source files to <https://ci-builds.apache.org/job/Jena/job/Jena_Development_Test/ws/jena-db/jena-tdb2/target/classes>
[INFO] -------------------------------------------------------------
[ERROR] COMPILATION ERROR :
[INFO] -------------------------------------------------------------
[ERROR] <https://ci-builds.apache.org/job/Jena/job/Jena_Development_Test/ws/jena-db/jena-tdb2/src/main/java/org/apache/jena/tdb2/xloader/ProcNodeTableDataBuilder.java>:[71,74] cannot find symbol
symbol: variable BulkLoaderX
location: class org.apache.jena.tdb2.xloader.ProcNodeTableDataBuilder
[ERROR] <https://ci-builds.apache.org/job/Jena/job/Jena_Development_Test/ws/jena-db/jena-tdb2/src/main/java/org/apache/jena/tdb2/xloader/ProcNodeTableDataBuilder.java>:[71,96] cannot find symbol
symbol: variable BulkLoaderX
location: class org.apache.jena.tdb2.xloader.ProcNodeTableDataBuilder
[INFO] 2 errors
[INFO] -------------------------------------------------------------
[INFO] ------------------------------------------------------------------------
[INFO] Reactor Summary for Apache Jena 4.3.0-SNAPSHOT:
[INFO]
[INFO] Apache Jena ........................................ SUCCESS [ 20.184 s]
[INFO] Apache Jena - Shadowed external libraries .......... SUCCESS [ 14.341 s]
[INFO] Apache Jena - IRI .................................. SUCCESS [ 36.701 s]
[INFO] Apache Jena - Base Common Environment .............. SUCCESS [ 27.468 s]
[INFO] Apache Jena - Core ................................. SUCCESS [01:26 min]
[INFO] Apache Jena - ARQ (SPARQL 1.1 Query Engine) ........ SUCCESS [01:39 min]
[INFO] Apache Jena - SHACL ................................ SUCCESS [ 18.461 s]
[INFO] Apache Jena - ShEx ................................. SUCCESS [ 21.953 s]
[INFO] Apache Jena - RDF Connection ....................... SUCCESS [ 17.146 s]
[INFO] Apache Jena - TDB1 (Native Triple Store) ........... SUCCESS [02:11 min]
[INFO] Apache Jena - DBOE Database Operation Environment .. SUCCESS [ 2.561 s]
[INFO] Apache Jena - DBOE Base ............................ SUCCESS [ 9.848 s]
[INFO] Apache Jena - DBOE Transactions .................... SUCCESS [ 7.753 s]
[INFO] Apache Jena - DBOE Indexes ......................... SUCCESS [ 6.084 s]
[INFO] Apache Jena - DBOE Index test suite ................ SUCCESS [ 5.866 s]
[INFO] Apache Jena - DBOE Transactional Datastructures .... SUCCESS [ 13.012 s]
[INFO] Apache Jena - DBOE Storage ......................... SUCCESS [ 9.786 s]
[INFO] Apache Jena - DBOE TDB2 (Native Triple Store) ...... FAILURE [ 3.671 s]
[INFO] Apache Jena - Libraries POM ........................ SKIPPED
[INFO] Apache Jena - Command line tools ................... SKIPPED
[INFO] Apache Jena - SPARQL Text Search ................... SKIPPED
[INFO] Apache Jena - Fuseki - A SPARQL 1.1 Server ......... SKIPPED
[INFO] Apache Jena - Fuseki Core Engine ................... SKIPPED
[INFO] Apache Jena - Fuseki Data Access Control ........... SKIPPED
[INFO] Apache Jena - Fuseki Server Main ................... SKIPPED
[INFO] Apache Jena - Fuseki Server Jar .................... SKIPPED
[INFO] Apache Jena - Fuseki Webapp ........................ SKIPPED
[INFO] Apache Jena - Fuseki WAR File ...................... SKIPPED
[INFO] Apache Jena - Fuseki Server Standalone Jar ......... SKIPPED
[INFO] Apache Jena - Fuseki Docker Tools .................. SKIPPED
[INFO] Apache Jena - Fuseki Binary Distribution ........... SKIPPED
[INFO] Apache Jena - GeoSPARQL Engine ..................... SKIPPED
[INFO] Apache Jena - Fuseki with GeoSPARQL Engine ......... SKIPPED
[INFO] Apache Jena - Integration Testing .................. SKIPPED
[INFO] Apache Jena - Distribution ......................... SKIPPED
[INFO] Apache Jena - Security Permissions ................. SKIPPED
[INFO] Apache Jena - Extras ............................... SKIPPED
[INFO] Apache Jena - Extras - Query Builder ............... SKIPPED
[INFO] Apache Jena - CommonsRDF for Jena .................. SKIPPED
[INFO] Apache Jena - JDBC Parent .......................... SKIPPED
[INFO] Apache Jena - JDBC Core API ........................ SKIPPED
[INFO] Apache Jena - JDBC Remote Endpoint Driver .......... SKIPPED
[INFO] Apache Jena - JDBC In-Memory Driver ................ SKIPPED
[INFO] Apache Jena - JDBC TDB Driver ...................... SKIPPED
[INFO] Apache Jena - JDBC Driver Bundle ................... SKIPPED
[INFO] ------------------------------------------------------------------------
[INFO] BUILD FAILURE
[INFO] ------------------------------------------------------------------------
[INFO] Total time: 11:07 min
[INFO] Finished at: 2021-10-15T08:31:00Z
[INFO] ------------------------------------------------------------------------
Waiting for Jenkins to finish collecting data
[ERROR] Failed to execute goal org.apache.maven.plugins:maven-compiler-plugin:3.8.1:compile (default-compile) on project jena-tdb2: Compilation failure: Compilation failure:
[ERROR] <https://ci-builds.apache.org/job/Jena/job/Jena_Development_Test/ws/jena-db/jena-tdb2/src/main/java/org/apache/jena/tdb2/xloader/ProcNodeTableDataBuilder.java>:[71,74] cannot find symbol
[ERROR] symbol: variable BulkLoaderX
[ERROR] location: class org.apache.jena.tdb2.xloader.ProcNodeTableDataBuilder
[ERROR] <https://ci-builds.apache.org/job/Jena/job/Jena_Development_Test/ws/jena-db/jena-tdb2/src/main/java/org/apache/jena/tdb2/xloader/ProcNodeTableDataBuilder.java>:[71,96] cannot find symbol
[ERROR] symbol: variable BulkLoaderX
[ERROR] location: class org.apache.jena.tdb2.xloader.ProcNodeTableDataBuilder
[ERROR] -> [Help 1]
[ERROR]
[ERROR] To see the full stack trace of the errors, re-run Maven with the -e switch.
[ERROR] Re-run Maven using the -X switch to enable full debug logging.
[ERROR]
[ERROR] For more information about the errors and possible solutions, please read the following articles:
[ERROR] [Help 1] http://cwiki.apache.org/confluence/display/MAVEN/MojoFailureException
[ERROR]
[ERROR] After correcting the problems, you can resume the build with the command
[ERROR] mvn <goals> -rf :jena-tdb2
[JENKINS] Archiving <https://ci-builds.apache.org/job/Jena/job/Jena_Development_Test/ws/pom.xml> to org.apache.jena/jena/4.3.0-SNAPSHOT/jena-4.3.0-SNAPSHOT.pom
[Fast Archiver] Compressed 34.64 KB of artifacts by 92.4% relative to #236
[JENKINS] Archiving <https://ci-builds.apache.org/job/Jena/job/Jena_Development_Test/ws/jena-db/jena-dboe-index-test/pom.xml> to org.apache.jena/jena-dboe-index-test/4.3.0-SNAPSHOT/jena-dboe-index-test-4.3.0-SNAPSHOT.pom
[JENKINS] Archiving <https://ci-builds.apache.org/job/Jena/job/Jena_Development_Test/ws/jena-db/jena-dboe-index-test/target/jena-dboe-index-test-4.3.0-SNAPSHOT.jar> to org.apache.jena/jena-dboe-index-test/4.3.0-SNAPSHOT/jena-dboe-index-test-4.3.0-SNAPSHOT.jar
[JENKINS] Archiving <https://ci-builds.apache.org/job/Jena/job/Jena_Development_Test/ws/jena-db/jena-dboe-index-test/target/jena-dboe-index-test-4.3.0-SNAPSHOT-tests.jar> to org.apache.jena/jena-dboe-index-test/4.3.0-SNAPSHOT/jena-dboe-index-test-4.3.0-SNAPSHOT-tests.jar
[JENKINS] Archiving <https://ci-builds.apache.org/job/Jena/job/Jena_Development_Test/ws/apache-jena-libs/pom.xml> to org.apache.jena/apache-jena-libs/4.3.0-SNAPSHOT/apache-jena-libs-4.3.0-SNAPSHOT.pom
[JENKINS] Archiving <https://ci-builds.apache.org/job/Jena/job/Jena_Development_Test/ws/jena-extras/jena-querybuilder/pom.xml> to org.apache.jena/jena-querybuilder/4.3.0-SNAPSHOT/jena-querybuilder-4.3.0-SNAPSHOT.pom
[JENKINS] Archiving <https://ci-builds.apache.org/job/Jena/job/Jena_Development_Test/ws/jena-shaded-guava/dependency-reduced-pom.xml> to org.apache.jena/jena-shaded-guava/4.3.0-SNAPSHOT/jena-shaded-guava-4.3.0-SNAPSHOT.pom
[JENKINS] Archiving <https://ci-builds.apache.org/job/Jena/job/Jena_Development_Test/ws/jena-shaded-guava/target/jena-shaded-guava-4.3.0-SNAPSHOT.jar> to org.apache.jena/jena-shaded-guava/4.3.0-SNAPSHOT/jena-shaded-guava-4.3.0-SNAPSHOT.jar
[JENKINS] Archiving <https://ci-builds.apache.org/job/Jena/job/Jena_Development_Test/ws/jena-shaded-guava/target/jena-shaded-guava-4.3.0-SNAPSHOT-sources.jar> to org.apache.jena/jena-shaded-guava/4.3.0-SNAPSHOT/jena-shaded-guava-4.3.0-SNAPSHOT-sources.jar
[Fast Archiver] Compressed 4.55 MB of artifacts by 96.9% relative to #236
[JENKINS] Archiving <https://ci-builds.apache.org/job/Jena/job/Jena_Development_Test/ws/jena-fuseki2/jena-fuseki-war/pom.xml> to org.apache.jena/jena-fuseki-war/4.3.0-SNAPSHOT/jena-fuseki-war-4.3.0-SNAPSHOT.pom
[JENKINS] Archiving <https://ci-builds.apache.org/job/Jena/job/Jena_Development_Test/ws/jena-shex/pom.xml> to org.apache.jena/jena-shex/4.3.0-SNAPSHOT/jena-shex-4.3.0-SNAPSHOT.pom
[JENKINS] Archiving <https://ci-builds.apache.org/job/Jena/job/Jena_Development_Test/ws/jena-shex/target/jena-shex-4.3.0-SNAPSHOT.jar> to org.apache.jena/jena-shex/4.3.0-SNAPSHOT/jena-shex-4.3.0-SNAPSHOT.jar
[JENKINS] Archiving <https://ci-builds.apache.org/job/Jena/job/Jena_Development_Test/ws/jena-shex/target/jena-shex-4.3.0-SNAPSHOT-tests.jar> to org.apache.jena/jena-shex/4.3.0-SNAPSHOT/jena-shex-4.3.0-SNAPSHOT-tests.jar
[JENKINS] Archiving <https://ci-builds.apache.org/job/Jena/job/Jena_Development_Test/ws/jena-shex/target/jena-shex-4.3.0-SNAPSHOT-sources.jar> to org.apache.jena/jena-shex/4.3.0-SNAPSHOT/jena-shex-4.3.0-SNAPSHOT-sources.jar
[JENKINS] Archiving <https://ci-builds.apache.org/job/Jena/job/Jena_Development_Test/ws/jena-shex/target/jena-shex-4.3.0-SNAPSHOT-test-sources.jar> to org.apache.jena/jena-shex/4.3.0-SNAPSHOT/jena-shex-4.3.0-SNAPSHOT-test-sources.jar
[JENKINS] Archiving <https://ci-builds.apache.org/job/Jena/job/Jena_Development_Test/ws/jena-shex/target/jena-shex-4.3.0-SNAPSHOT-javadoc.jar> to org.apache.jena/jena-shex/4.3.0-SNAPSHOT/jena-shex-4.3.0-SNAPSHOT-javadoc.jar
[Fast Archiver] Compressed 1.23 MB of artifacts by 12.7% relative to #236
[JENKINS] Archiving <https://ci-builds.apache.org/job/Jena/job/Jena_Development_Test/ws/jena-base/pom.xml> to org.apache.jena/jena-base/4.3.0-SNAPSHOT/jena-base-4.3.0-SNAPSHOT.pom
[JENKINS] Archiving <https://ci-builds.apache.org/job/Jena/job/Jena_Development_Test/ws/jena-base/target/jena-base-4.3.0-SNAPSHOT.jar> to org.apache.jena/jena-base/4.3.0-SNAPSHOT/jena-base-4.3.0-SNAPSHOT.jar
[JENKINS] Archiving <https://ci-builds.apache.org/job/Jena/job/Jena_Development_Test/ws/jena-base/target/jena-base-4.3.0-SNAPSHOT-tests.jar> to org.apache.jena/jena-base/4.3.0-SNAPSHOT/jena-base-4.3.0-SNAPSHOT-tests.jar
[JENKINS] Archiving <https://ci-builds.apache.org/job/Jena/job/Jena_Development_Test/ws/jena-base/target/jena-base-4.3.0-SNAPSHOT-sources.jar> to org.apache.jena/jena-base/4.3.0-SNAPSHOT/jena-base-4.3.0-SNAPSHOT-sources.jar
[JENKINS] Archiving <https://ci-builds.apache.org/job/Jena/job/Jena_Development_Test/ws/jena-base/target/jena-base-4.3.0-SNAPSHOT-test-sources.jar> to org.apache.jena/jena-base/4.3.0-SNAPSHOT/jena-base-4.3.0-SNAPSHOT-test-sources.jar
[JENKINS] Archiving <https://ci-builds.apache.org/job/Jena/job/Jena_Development_Test/ws/jena-base/target/jena-base-4.3.0-SNAPSHOT-javadoc.jar> to org.apache.jena/jena-base/4.3.0-SNAPSHOT/jena-base-4.3.0-SNAPSHOT-javadoc.jar
[JENKINS] Archiving <https://ci-builds.apache.org/job/Jena/job/Jena_Development_Test/ws/jena-extras/jena-commonsrdf/pom.xml> to org.apache.jena/jena-commonsrdf/4.3.0-SNAPSHOT/jena-commonsrdf-4.3.0-SNAPSHOT.pom
[JENKINS] Archiving <https://ci-builds.apache.org/job/Jena/job/Jena_Development_Test/ws/jena-permissions/pom.xml> to org.apache.jena/jena-permissions/4.3.0-SNAPSHOT/jena-permissions-4.3.0-SNAPSHOT.pom
[JENKINS] Archiving <https://ci-builds.apache.org/job/Jena/job/Jena_Development_Test/ws/jena-db/jena-dboe-transaction/pom.xml> to org.apache.jena/jena-dboe-transaction/4.3.0-SNAPSHOT/jena-dboe-transaction-4.3.0-SNAPSHOT.pom
[JENKINS] Archiving <https://ci-builds.apache.org/job/Jena/job/Jena_Development_Test/ws/jena-db/jena-dboe-transaction/target/jena-dboe-transaction-4.3.0-SNAPSHOT.jar> to org.apache.jena/jena-dboe-transaction/4.3.0-SNAPSHOT/jena-dboe-transaction-4.3.0-SNAPSHOT.jar
[JENKINS] Archiving <https://ci-builds.apache.org/job/Jena/job/Jena_Development_Test/ws/jena-db/jena-dboe-transaction/target/jena-dboe-transaction-4.3.0-SNAPSHOT-tests.jar> to org.apache.jena/jena-dboe-transaction/4.3.0-SNAPSHOT/jena-dboe-transaction-4.3.0-SNAPSHOT-tests.jar
[JENKINS] Archiving <https://ci-builds.apache.org/job/Jena/job/Jena_Development_Test/ws/jena-fuseki2/jena-fuseki-main/pom.xml> to org.apache.jena/jena-fuseki-main/4.3.0-SNAPSHOT/jena-fuseki-main-4.3.0-SNAPSHOT.pom
[JENKINS] Archiving <https://ci-builds.apache.org/job/Jena/job/Jena_Development_Test/ws/jena-iri/pom.xml> to org.apache.jena/jena-iri/4.3.0-SNAPSHOT/jena-iri-4.3.0-SNAPSHOT.pom
[JENKINS] Archiving <https://ci-builds.apache.org/job/Jena/job/Jena_Development_Test/ws/jena-iri/target/jena-iri-4.3.0-SNAPSHOT.jar> to org.apache.jena/jena-iri/4.3.0-SNAPSHOT/jena-iri-4.3.0-SNAPSHOT.jar
[JENKINS] Archiving <https://ci-builds.apache.org/job/Jena/job/Jena_Development_Test/ws/jena-iri/target/jena-iri-4.3.0-SNAPSHOT-sources.jar> to org.apache.jena/jena-iri/4.3.0-SNAPSHOT/jena-iri-4.3.0-SNAPSHOT-sources.jar
[JENKINS] Archiving <https://ci-builds.apache.org/job/Jena/job/Jena_Development_Test/ws/jena-iri/target/jena-iri-4.3.0-SNAPSHOT-javadoc.jar> to org.apache.jena/jena-iri/4.3.0-SNAPSHOT/jena-iri-4.3.0-SNAPSHOT-javadoc.jar
[Fast Archiver] Compressed 940.99 KB of artifacts by 13.6% relative to #236
[JENKINS] Archiving <https://ci-builds.apache.org/job/Jena/job/Jena_Development_Test/ws/jena-arq/pom.xml> to org.apache.jena/jena-arq/4.3.0-SNAPSHOT/jena-arq-4.3.0-SNAPSHOT.pom
[JENKINS] Archiving <https://ci-builds.apache.org/job/Jena/job/Jena_Development_Test/ws/jena-arq/target/jena-arq-4.3.0-SNAPSHOT.jar> to org.apache.jena/jena-arq/4.3.0-SNAPSHOT/jena-arq-4.3.0-SNAPSHOT.jar
[JENKINS] Archiving <https://ci-builds.apache.org/job/Jena/job/Jena_Development_Test/ws/jena-arq/target/jena-arq-4.3.0-SNAPSHOT-sources.jar> to org.apache.jena/jena-arq/4.3.0-SNAPSHOT/jena-arq-4.3.0-SNAPSHOT-sources.jar
[JENKINS] Archiving <https://ci-builds.apache.org/job/Jena/job/Jena_Development_Test/ws/jena-arq/target/jena-arq-4.3.0-SNAPSHOT-test-sources.jar> to org.apache.jena/jena-arq/4.3.0-SNAPSHOT/jena-arq-4.3.0-SNAPSHOT-test-sources.jar
[JENKINS] Archiving <https://ci-builds.apache.org/job/Jena/job/Jena_Development_Test/ws/jena-arq/target/jena-arq-4.3.0-SNAPSHOT-tests.jar> to org.apache.jena/jena-arq/4.3.0-SNAPSHOT/jena-arq-4.3.0-SNAPSHOT-tests.jar
[JENKINS] Archiving <https://ci-builds.apache.org/job/Jena/job/Jena_Development_Test/ws/jena-arq/target/jena-arq-4.3.0-SNAPSHOT-javadoc.jar> to org.apache.jena/jena-arq/4.3.0-SNAPSHOT/jena-arq-4.3.0-SNAPSHOT-javadoc.jar
[JENKINS] Archiving <https://ci-builds.apache.org/job/Jena/job/Jena_Development_Test/ws/jena-fuseki2/jena-fuseki-server/pom.xml> to org.apache.jena/jena-fuseki-server/4.3.0-SNAPSHOT/jena-fuseki-server-4.3.0-SNAPSHOT.pom
[JENKINS] Archiving <https://ci-builds.apache.org/job/Jena/job/Jena_Development_Test/ws/jena-db/jena-dboe-index/pom.xml> to org.apache.jena/jena-dboe-index/4.3.0-SNAPSHOT/jena-dboe-index-4.3.0-SNAPSHOT.pom
[JENKINS] Archiving <https://ci-builds.apache.org/job/Jena/job/Jena_Development_Test/ws/jena-db/jena-dboe-index/target/jena-dboe-index-4.3.0-SNAPSHOT.jar> to org.apache.jena/jena-dboe-index/4.3.0-SNAPSHOT/jena-dboe-index-4.3.0-SNAPSHOT.jar
[JENKINS] Archiving <https://ci-builds.apache.org/job/Jena/job/Jena_Development_Test/ws/jena-db/jena-dboe-index/target/jena-dboe-index-4.3.0-SNAPSHOT-tests.jar> to org.apache.jena/jena-dboe-index/4.3.0-SNAPSHOT/jena-dboe-index-4.3.0-SNAPSHOT-tests.jar
[JENKINS] Archiving <https://ci-builds.apache.org/job/Jena/job/Jena_Development_Test/ws/jena-fuseki2/jena-fuseki-fulljar/pom.xml> to org.apache.jena/jena-fuseki-fulljar/4.3.0-SNAPSHOT/jena-fuseki-fulljar-4.3.0-SNAPSHOT.pom
[JENKINS] Archiving <https://ci-builds.apache.org/job/Jena/job/Jena_Development_Test/ws/jena-jdbc/jena-jdbc-driver-mem/pom.xml> to org.apache.jena/jena-jdbc-driver-mem/4.3.0-SNAPSHOT/jena-jdbc-driver-mem-4.3.0-SNAPSHOT.pom
[JENKINS] Archiving <https://ci-builds.apache.org/job/Jena/job/Jena_Development_Test/ws/jena-db/pom.xml> to org.apache.jena/jena-db/4.3.0-SNAPSHOT/jena-db-4.3.0-SNAPSHOT.pom
[JENKINS] Archiving <https://ci-builds.apache.org/job/Jena/job/Jena_Development_Test/ws/apache-jena/pom.xml> to org.apache.jena/apache-jena/4.3.0-SNAPSHOT/apache-jena-4.3.0-SNAPSHOT.pom
[JENKINS] Archiving <https://ci-builds.apache.org/job/Jena/job/Jena_Development_Test/ws/jena-jdbc/jena-jdbc-driver-remote/pom.xml> to org.apache.jena/jena-jdbc-driver-remote/4.3.0-SNAPSHOT/jena-jdbc-driver-remote-4.3.0-SNAPSHOT.pom
[JENKINS] Archiving <https://ci-builds.apache.org/job/Jena/job/Jena_Development_Test/ws/jena-core/pom.xml> to org.apache.jena/jena-core/4.3.0-SNAPSHOT/jena-core-4.3.0-SNAPSHOT.pom
[JENKINS] Archiving <https://ci-builds.apache.org/job/Jena/job/Jena_Development_Test/ws/jena-core/target/jena-core-4.3.0-SNAPSHOT.jar> to org.apache.jena/jena-core/4.3.0-SNAPSHOT/jena-core-4.3.0-SNAPSHOT.jar
[JENKINS] Archiving <https://ci-builds.apache.org/job/Jena/job/Jena_Development_Test/ws/jena-core/target/jena-core-4.3.0-SNAPSHOT-sources.jar> to org.apache.jena/jena-core/4.3.0-SNAPSHOT/jena-core-4.3.0-SNAPSHOT-sources.jar
[JENKINS] Archiving <https://ci-builds.apache.org/job/Jena/job/Jena_Development_Test/ws/jena-core/target/jena-core-4.3.0-SNAPSHOT-test-sources.jar> to org.apache.jena/jena-core/4.3.0-SNAPSHOT/jena-core-4.3.0-SNAPSHOT-test-sources.jar
[JENKINS] Archiving <https://ci-builds.apache.org/job/Jena/job/Jena_Development_Test/ws/jena-core/target/jena-core-4.3.0-SNAPSHOT-javadoc.jar> to org.apache.jena/jena-core/4.3.0-SNAPSHOT/jena-core-4.3.0-SNAPSHOT-javadoc.jar
[JENKINS] Archiving <https://ci-builds.apache.org/job/Jena/job/Jena_Development_Test/ws/jena-core/target/jena-core-4.3.0-SNAPSHOT-tests.jar> to org.apache.jena/jena-core/4.3.0-SNAPSHOT/jena-core-4.3.0-SNAPSHOT-tests.jar
[JENKINS] Archiving <https://ci-builds.apache.org/job/Jena/job/Jena_Development_Test/ws/jena-shacl/pom.xml> to org.apache.jena/jena-shacl/4.3.0-SNAPSHOT/jena-shacl-4.3.0-SNAPSHOT.pom
[JENKINS] Archiving <https://ci-builds.apache.org/job/Jena/job/Jena_Development_Test/ws/jena-shacl/target/jena-shacl-4.3.0-SNAPSHOT.jar> to org.apache.jena/jena-shacl/4.3.0-SNAPSHOT/jena-shacl-4.3.0-SNAPSHOT.jar
[JENKINS] Archiving <https://ci-builds.apache.org/job/Jena/job/Jena_Development_Test/ws/jena-shacl/target/jena-shacl-4.3.0-SNAPSHOT-sources.jar> to org.apache.jena/jena-shacl/4.3.0-SNAPSHOT/jena-shacl-4.3.0-SNAPSHOT-sources.jar
[JENKINS] Archiving <https://ci-builds.apache.org/job/Jena/job/Jena_Development_Test/ws/jena-shacl/target/jena-shacl-4.3.0-SNAPSHOT-test-sources.jar> to org.apache.jena/jena-shacl/4.3.0-SNAPSHOT/jena-shacl-4.3.0-SNAPSHOT-test-sources.jar
[JENKINS] Archiving <https://ci-builds.apache.org/job/Jena/job/Jena_Development_Test/ws/jena-shacl/target/jena-shacl-4.3.0-SNAPSHOT-tests.jar> to org.apache.jena/jena-shacl/4.3.0-SNAPSHOT/jena-shacl-4.3.0-SNAPSHOT-tests.jar
[JENKINS] Archiving <https://ci-builds.apache.org/job/Jena/job/Jena_Development_Test/ws/jena-shacl/target/jena-shacl-4.3.0-SNAPSHOT-javadoc.jar> to org.apache.jena/jena-shacl/4.3.0-SNAPSHOT/jena-shacl-4.3.0-SNAPSHOT-javadoc.jar
[Fast Archiver] Compressed 1014.13 KB of artifacts by 18.9% relative to #236
[JENKINS] Archiving <https://ci-builds.apache.org/job/Jena/job/Jena_Development_Test/ws/jena-extras/pom.xml> to org.apache.jena/jena-extras/4.3.0-SNAPSHOT/jena-extras-4.3.0-SNAPSHOT.pom
[JENKINS] Archiving <https://ci-builds.apache.org/job/Jena/job/Jena_Development_Test/ws/jena-fuseki2/jena-fuseki-geosparql/pom.xml> to org.apache.jena/jena-fuseki-geosparql/4.3.0-SNAPSHOT/jena-fuseki-geosparql-4.3.0-SNAPSHOT.pom
[JENKINS] Archiving <https://ci-builds.apache.org/job/Jena/job/Jena_Development_Test/ws/jena-text/pom.xml> to org.apache.jena/jena-text/4.3.0-SNAPSHOT/jena-text-4.3.0-SNAPSHOT.pom
[JENKINS] Archiving <https://ci-builds.apache.org/job/Jena/job/Jena_Development_Test/ws/jena-fuseki2/jena-fuseki-docker/pom.xml> to org.apache.jena/jena-fuseki-docker/4.3.0-SNAPSHOT/jena-fuseki-docker-4.3.0-SNAPSHOT.pom
[JENKINS] Archiving <https://ci-builds.apache.org/job/Jena/job/Jena_Development_Test/ws/jena-tdb/pom.xml> to org.apache.jena/jena-tdb/4.3.0-SNAPSHOT/jena-tdb-4.3.0-SNAPSHOT.pom
[JENKINS] Archiving <https://ci-builds.apache.org/job/Jena/job/Jena_Development_Test/ws/jena-tdb/target/jena-tdb-4.3.0-SNAPSHOT.jar> to org.apache.jena/jena-tdb/4.3.0-SNAPSHOT/jena-tdb-4.3.0-SNAPSHOT.jar
[JENKINS] Archiving <https://ci-builds.apache.org/job/Jena/job/Jena_Development_Test/ws/jena-tdb/target/jena-tdb-4.3.0-SNAPSHOT-sources.jar> to org.apache.jena/jena-tdb/4.3.0-SNAPSHOT/jena-tdb-4.3.0-SNAPSHOT-sources.jar
[JENKINS] Archiving <https://ci-builds.apache.org/job/Jena/job/Jena_Development_Test/ws/jena-tdb/target/jena-tdb-4.3.0-SNAPSHOT-test-sources.jar> to org.apache.jena/jena-tdb/4.3.0-SNAPSHOT/jena-tdb-4.3.0-SNAPSHOT-test-sources.jar
[JENKINS] Archiving <https://ci-builds.apache.org/job/Jena/job/Jena_Development_Test/ws/jena-tdb/target/jena-tdb-4.3.0-SNAPSHOT-tests.jar> to org.apache.jena/jena-tdb/4.3.0-SNAPSHOT/jena-tdb-4.3.0-SNAPSHOT-tests.jar
[JENKINS] Archiving <https://ci-builds.apache.org/job/Jena/job/Jena_Development_Test/ws/jena-tdb/target/jena-tdb-4.3.0-SNAPSHOT-javadoc.jar> to org.apache.jena/jena-tdb/4.3.0-SNAPSHOT/jena-tdb-4.3.0-SNAPSHOT-javadoc.jar
[JENKINS] Archiving <https://ci-builds.apache.org/job/Jena/job/Jena_Development_Test/ws/jena-db/jena-dboe-trans-data/pom.xml> to org.apache.jena/jena-dboe-trans-data/4.3.0-SNAPSHOT/jena-dboe-trans-data-4.3.0-SNAPSHOT.pom
[JENKINS] Archiving <https://ci-builds.apache.org/job/Jena/job/Jena_Development_Test/ws/jena-db/jena-dboe-trans-data/target/jena-dboe-trans-data-4.3.0-SNAPSHOT.jar> to org.apache.jena/jena-dboe-trans-data/4.3.0-SNAPSHOT/jena-dboe-trans-data-4.3.0-SNAPSHOT.jar
[JENKINS] Archiving <https://ci-builds.apache.org/job/Jena/job/Jena_Development_Test/ws/jena-db/jena-dboe-trans-data/target/jena-dboe-trans-data-4.3.0-SNAPSHOT-tests.jar> to org.apache.jena/jena-dboe-trans-data/4.3.0-SNAPSHOT/jena-dboe-trans-data-4.3.0-SNAPSHOT-tests.jar
[JENKINS] Archiving <https://ci-builds.apache.org/job/Jena/job/Jena_Development_Test/ws/jena-jdbc/jena-jdbc-core/pom.xml> to org.apache.jena/jena-jdbc-core/4.3.0-SNAPSHOT/jena-jdbc-core-4.3.0-SNAPSHOT.pom
[JENKINS] Archiving <https://ci-builds.apache.org/job/Jena/job/Jena_Development_Test/ws/jena-fuseki2/jena-fuseki-access/pom.xml> to org.apache.jena/jena-fuseki-access/4.3.0-SNAPSHOT/jena-fuseki-access-4.3.0-SNAPSHOT.pom
[JENKINS] Archiving <https://ci-builds.apache.org/job/Jena/job/Jena_Development_Test/ws/jena-db/jena-dboe-base/pom.xml> to org.apache.jena/jena-dboe-base/4.3.0-SNAPSHOT/jena-dboe-base-4.3.0-SNAPSHOT.pom
[JENKINS] Archiving <https://ci-builds.apache.org/job/Jena/job/Jena_Development_Test/ws/jena-db/jena-dboe-base/target/jena-dboe-base-4.3.0-SNAPSHOT.jar> to org.apache.jena/jena-dboe-base/4.3.0-SNAPSHOT/jena-dboe-base-4.3.0-SNAPSHOT.jar
[JENKINS] Archiving <https://ci-builds.apache.org/job/Jena/job/Jena_Development_Test/ws/jena-db/jena-dboe-base/target/jena-dboe-base-4.3.0-SNAPSHOT-tests.jar> to org.apache.jena/jena-dboe-base/4.3.0-SNAPSHOT/jena-dboe-base-4.3.0-SNAPSHOT-tests.jar
[JENKINS] Archiving <https://ci-builds.apache.org/job/Jena/job/Jena_Development_Test/ws/jena-fuseki2/pom.xml> to org.apache.jena/jena-fuseki/4.3.0-SNAPSHOT/jena-fuseki-4.3.0-SNAPSHOT.pom
[JENKINS] Archiving <https://ci-builds.apache.org/job/Jena/job/Jena_Development_Test/ws/jena-fuseki2/jena-fuseki-webapp/pom.xml> to org.apache.jena/jena-fuseki-webapp/4.3.0-SNAPSHOT/jena-fuseki-webapp-4.3.0-SNAPSHOT.pom
[JENKINS] Archiving <https://ci-builds.apache.org/job/Jena/job/Jena_Development_Test/ws/jena-integration-tests/pom.xml> to org.apache.jena/jena-integration-tests/4.3.0-SNAPSHOT/jena-integration-tests-4.3.0-SNAPSHOT.pom
[JENKINS] Archiving <https://ci-builds.apache.org/job/Jena/job/Jena_Development_Test/ws/jena-jdbc/pom.xml> to org.apache.jena/jena-jdbc/4.3.0-SNAPSHOT/jena-jdbc-4.3.0-SNAPSHOT.pom
[JENKINS] Archiving <https://ci-builds.apache.org/job/Jena/job/Jena_Development_Test/ws/jena-jdbc/jena-jdbc-driver-bundle/pom.xml> to org.apache.jena/jena-jdbc-driver-bundle/4.3.0-SNAPSHOT/jena-jdbc-driver-bundle-4.3.0-SNAPSHOT.pom
[JENKINS] Archiving <https://ci-builds.apache.org/job/Jena/job/Jena_Development_Test/ws/jena-db/jena-tdb2/pom.xml> to org.apache.jena/jena-tdb2/4.3.0-SNAPSHOT/jena-tdb2-4.3.0-SNAPSHOT.pom
[JENKINS] Archiving <https://ci-builds.apache.org/job/Jena/job/Jena_Development_Test/ws/jena-cmds/pom.xml> to org.apache.jena/jena-cmds/4.3.0-SNAPSHOT/jena-cmds-4.3.0-SNAPSHOT.pom
[JENKINS] Archiving <https://ci-builds.apache.org/job/Jena/job/Jena_Development_Test/ws/jena-jdbc/jena-jdbc-driver-tdb/pom.xml> to org.apache.jena/jena-jdbc-driver-tdb/4.3.0-SNAPSHOT/jena-jdbc-driver-tdb-4.3.0-SNAPSHOT.pom
[JENKINS] Archiving <https://ci-builds.apache.org/job/Jena/job/Jena_Development_Test/ws/jena-fuseki2/jena-fuseki-core/pom.xml> to org.apache.jena/jena-fuseki-core/4.3.0-SNAPSHOT/jena-fuseki-core-4.3.0-SNAPSHOT.pom
[JENKINS] Archiving <https://ci-builds.apache.org/job/Jena/job/Jena_Development_Test/ws/jena-geosparql/pom.xml> to org.apache.jena/jena-geosparql/4.3.0-SNAPSHOT/jena-geosparql-4.3.0-SNAPSHOT.pom
[JENKINS] Archiving <https://ci-builds.apache.org/job/Jena/job/Jena_Development_Test/ws/jena-db/jena-dboe-storage/pom.xml> to org.apache.jena/jena-dboe-storage/4.3.0-SNAPSHOT/jena-dboe-storage-4.3.0-SNAPSHOT.pom
[JENKINS] Archiving <https://ci-builds.apache.org/job/Jena/job/Jena_Development_Test/ws/jena-db/jena-dboe-storage/target/jena-dboe-storage-4.3.0-SNAPSHOT.jar> to org.apache.jena/jena-dboe-storage/4.3.0-SNAPSHOT/jena-dboe-storage-4.3.0-SNAPSHOT.jar
[JENKINS] Archiving <https://ci-builds.apache.org/job/Jena/job/Jena_Development_Test/ws/jena-db/jena-dboe-storage/target/jena-dboe-storage-4.3.0-SNAPSHOT-tests.jar> to org.apache.jena/jena-dboe-storage/4.3.0-SNAPSHOT/jena-dboe-storage-4.3.0-SNAPSHOT-tests.jar
[JENKINS] Archiving <https://ci-builds.apache.org/job/Jena/job/Jena_Development_Test/ws/jena-fuseki2/apache-jena-fuseki/pom.xml> to org.apache.jena/apache-jena-fuseki/4.3.0-SNAPSHOT/apache-jena-fuseki-4.3.0-SNAPSHOT.pom
[JENKINS] Archiving <https://ci-builds.apache.org/job/Jena/job/Jena_Development_Test/ws/jena-rdfconnection/pom.xml> to org.apache.jena/jena-rdfconnection/4.3.0-SNAPSHOT/jena-rdfconnection-4.3.0-SNAPSHOT.pom
[JENKINS] Archiving <https://ci-builds.apache.org/job/Jena/job/Jena_Development_Test/ws/jena-rdfconnection/target/jena-rdfconnection-4.3.0-SNAPSHOT.jar> to org.apache.jena/jena-rdfconnection/4.3.0-SNAPSHOT/jena-rdfconnection-4.3.0-SNAPSHOT.jar
[JENKINS] Archiving <https://ci-builds.apache.org/job/Jena/job/Jena_Development_Test/ws/jena-rdfconnection/target/jena-rdfconnection-4.3.0-SNAPSHOT-sources.jar> to org.apache.jena/jena-rdfconnection/4.3.0-SNAPSHOT/jena-rdfconnection-4.3.0-SNAPSHOT-sources.jar
[JENKINS] Archiving <https://ci-builds.apache.org/job/Jena/job/Jena_Development_Test/ws/jena-rdfconnection/target/jena-rdfconnection-4.3.0-SNAPSHOT-test-sources.jar> to org.apache.jena/jena-rdfconnection/4.3.0-SNAPSHOT/jena-rdfconnection-4.3.0-SNAPSHOT-test-sources.jar
[JENKINS] Archiving <https://ci-builds.apache.org/job/Jena/job/Jena_Development_Test/ws/jena-rdfconnection/target/jena-rdfconnection-4.3.0-SNAPSHOT-tests.jar> to org.apache.jena/jena-rdfconnection/4.3.0-SNAPSHOT/jena-rdfconnection-4.3.0-SNAPSHOT-tests.jar
[JENKINS] Archiving <https://ci-builds.apache.org/job/Jena/job/Jena_Development_Test/ws/jena-rdfconnection/target/jena-rdfconnection-4.3.0-SNAPSHOT-javadoc.jar> to org.apache.jena/jena-rdfconnection/4.3.0-SNAPSHOT/jena-rdfconnection-4.3.0-SNAPSHOT-javadoc.jar
[Fast Archiver] Compressed 851.14 KB of artifacts by 15.0% relative to #236
channel stopped
Jenkins build is back to normal : Jena » Jena_Development_Test #238
Posted by Apache Jenkins Server <je...@builds.apache.org>.
See <https://ci-builds.apache.org/job/Jena/job/Jena_Development_Test/238/display/redirect?page=changes>