You are viewing a plain text version of this content. The canonical link for it is here.
Posted to commits@myfaces.apache.org by Apache Jenkins Server <je...@builds.apache.org> on 2014/06/14 23:41:15 UTC
Build failed in Jenkins: myfaces-current22-1 #1329
See <https://builds.apache.org/job/myfaces-current22-1/1329/>
------------------------------------------
[...truncated 837 lines...]
Uploaded: https://repository.apache.org/content/repositories/snapshots/org/apache/myfaces/shared/myfaces-shared-tomahawk/4.2.3-SNAPSHOT/myfaces-shared-tomahawk-4.2.3-20140614.214022-44-sources.jar (392 KB at 565.9 KB/sec)
Uploading: https://repository.apache.org/content/repositories/snapshots/org/apache/myfaces/shared/myfaces-shared-tomahawk/4.2.3-SNAPSHOT/maven-metadata.xml
Uploaded: https://repository.apache.org/content/repositories/snapshots/org/apache/myfaces/shared/myfaces-shared-tomahawk/4.2.3-SNAPSHOT/maven-metadata.xml (1016 B at 3.0 KB/sec)
[INFO]
[INFO] ------------------------------------------------------------------------
[INFO] Building Apache MyFaces JSF-2.2 Core Project 2.2.4-SNAPSHOT
[INFO] ------------------------------------------------------------------------
[INFO]
[INFO] --- maven-clean-plugin:2.5:clean (default-clean) @ myfaces-core-project ---
[INFO]
[INFO] --- maven-remote-resources-plugin:1.4:process (default) @ myfaces-core-project ---
[WARNING] Failed to getClass for org.apache.maven.plugin.source.SourceJarMojo
[INFO]
[INFO] --- maven-source-plugin:2.2.1:jar (attach-source) @ myfaces-core-project ---
[INFO]
[INFO] --- maven-site-plugin:3.3:attach-descriptor (attach-descriptor) @ myfaces-core-project ---
[INFO]
[INFO] --- maven-checkstyle-plugin:2.7:check (verify-style) @ myfaces-core-project ---
[INFO] Starting audit...
Audit done.
[INFO]
[INFO] --- maven-install-plugin:2.3.1:install (default-install) @ myfaces-core-project ---
[INFO] Installing <https://builds.apache.org/job/myfaces-current22-1/ws/current22/core/parent/pom.xml> to /home/jenkins/jenkins-slave/maven-repositories/0/org/apache/myfaces/core/myfaces-core-project/2.2.4-SNAPSHOT/myfaces-core-project-2.2.4-SNAPSHOT.pom
[INFO] Installing <https://builds.apache.org/job/myfaces-current22-1/ws/current22/core/parent/target/myfaces-core-project-2.2.4-SNAPSHOT-site.xml> to /home/jenkins/jenkins-slave/maven-repositories/0/org/apache/myfaces/core/myfaces-core-project/2.2.4-SNAPSHOT/myfaces-core-project-2.2.4-SNAPSHOT-site.xml
[INFO]
[INFO] --- maven-remote-resources-plugin:1.4:process (default) @ myfaces-core-project ---
[WARNING] Failed to getClass for org.apache.maven.plugin.source.SourceJarMojo
[INFO]
[INFO] --- maven-source-plugin:2.2.1:jar (attach-source) @ myfaces-core-project ---
[INFO]
[INFO] --- maven-site-plugin:3.3:attach-descriptor (attach-descriptor) @ myfaces-core-project ---
[WARNING] Artifact org.apache.myfaces.core:myfaces-core-project:xml:site:2.2.4-SNAPSHOT already attached to project, ignoring duplicate
[INFO]
[INFO] --- maven-checkstyle-plugin:2.7:check (verify-style) @ myfaces-core-project ---
[INFO] Starting audit...
Audit done.
[INFO]
[INFO] --- maven-install-plugin:2.3.1:install (default-install) @ myfaces-core-project ---
[INFO] Installing <https://builds.apache.org/job/myfaces-current22-1/ws/current22/core/parent/pom.xml> to /home/jenkins/jenkins-slave/maven-repositories/0/org/apache/myfaces/core/myfaces-core-project/2.2.4-SNAPSHOT/myfaces-core-project-2.2.4-SNAPSHOT.pom
[INFO] Installing <https://builds.apache.org/job/myfaces-current22-1/ws/current22/core/parent/target/myfaces-core-project-2.2.4-SNAPSHOT-site.xml> to /home/jenkins/jenkins-slave/maven-repositories/0/org/apache/myfaces/core/myfaces-core-project/2.2.4-SNAPSHOT/myfaces-core-project-2.2.4-SNAPSHOT-site.xml
[INFO]
[INFO] --- maven-deploy-plugin:2.7:deploy (default-deploy) @ myfaces-core-project ---
Downloading: https://repository.apache.org/content/repositories/snapshots/org/apache/myfaces/core/myfaces-core-project/2.2.4-SNAPSHOT/maven-metadata.xml
Downloaded: https://repository.apache.org/content/repositories/snapshots/org/apache/myfaces/core/myfaces-core-project/2.2.4-SNAPSHOT/maven-metadata.xml (834 B at 3.1 KB/sec)
Uploading: https://repository.apache.org/content/repositories/snapshots/org/apache/myfaces/core/myfaces-core-project/2.2.4-SNAPSHOT/myfaces-core-project-2.2.4-20140614.214036-42.pom
Uploaded: https://repository.apache.org/content/repositories/snapshots/org/apache/myfaces/core/myfaces-core-project/2.2.4-SNAPSHOT/myfaces-core-project-2.2.4-20140614.214036-42.pom (26 KB at 72.4 KB/sec)
Downloading: https://repository.apache.org/content/repositories/snapshots/org/apache/myfaces/core/myfaces-core-project/maven-metadata.xml
Downloaded: https://repository.apache.org/content/repositories/snapshots/org/apache/myfaces/core/myfaces-core-project/maven-metadata.xml (581 B at 2.8 KB/sec)
Uploading: https://repository.apache.org/content/repositories/snapshots/org/apache/myfaces/core/myfaces-core-project/2.2.4-SNAPSHOT/maven-metadata.xml
Uploaded: https://repository.apache.org/content/repositories/snapshots/org/apache/myfaces/core/myfaces-core-project/2.2.4-SNAPSHOT/maven-metadata.xml (834 B at 2.8 KB/sec)
Uploading: https://repository.apache.org/content/repositories/snapshots/org/apache/myfaces/core/myfaces-core-project/maven-metadata.xml
Uploaded: https://repository.apache.org/content/repositories/snapshots/org/apache/myfaces/core/myfaces-core-project/maven-metadata.xml (581 B at 1.6 KB/sec)
Uploading: https://repository.apache.org/content/repositories/snapshots/org/apache/myfaces/core/myfaces-core-project/2.2.4-SNAPSHOT/myfaces-core-project-2.2.4-20140614.214036-42-site.xml
Uploaded: https://repository.apache.org/content/repositories/snapshots/org/apache/myfaces/core/myfaces-core-project/2.2.4-SNAPSHOT/myfaces-core-project-2.2.4-20140614.214036-42-site.xml (6 KB at 16.1 KB/sec)
Uploading: https://repository.apache.org/content/repositories/snapshots/org/apache/myfaces/core/myfaces-core-project/2.2.4-SNAPSHOT/maven-metadata.xml
Uploaded: https://repository.apache.org/content/repositories/snapshots/org/apache/myfaces/core/myfaces-core-project/2.2.4-SNAPSHOT/maven-metadata.xml (834 B at 2.5 KB/sec)
[INFO]
[INFO] ------------------------------------------------------------------------
[INFO] Building Apache MyFaces JSF-2.2 Core API 2.2.4-SNAPSHOT
[INFO] ------------------------------------------------------------------------
Downloading: http://repository.apache.org/snapshots/de/berlios/jsunit/jsunit-maven2-plugin/maven-metadata.xml
[WARNING] The POM for org.easymock:easymock:jar:2.3 is invalid, transitive dependencies (if any) will not be available, enable debug logging for more details
[WARNING] The POM for org.easymock:easymockclassextension:jar:2.3 is invalid, transitive dependencies (if any) will not be available, enable debug logging for more details
[INFO]
[INFO] --- maven-clean-plugin:2.5:clean (default-clean) @ myfaces-api ---
[INFO]
[INFO] --- myfaces-builder-plugin:1.0.10:build-metadata (default) @ myfaces-api ---
log4j:WARN No appenders could be found for logger (org.apache.myfaces.buildtools.maven2.plugin.builder.qdox.QdoxModelBuilder).
log4j:WARN Please initialize the log4j system properly.
[INFO]
[INFO] --- myfaces-builder-plugin:1.0.10:make-components (makecomp) @ myfaces-api ---
[INFO] Using template from file loader: <https://builds.apache.org/job/myfaces-current22-1/ws/current22/core/api/src/main/resources/META-INF/componentClass20.vm>
[WARNING] *******************************************************************
[WARNING] RuntimeInstance initializing.
[WARNING] Default ResourceManager initializing. (class org.apache.velocity.runtime.resource.ResourceManagerImpl)
[WARNING] FileResourceLoader : initialization starting.
[WARNING] FileResourceLoader : initialization complete.
[WARNING] RelativeClasspathResourceLoader : initialization complete.
[INFO] RelativeClasspathResourceLoader : adding path 'META-INF'
[WARNING] RelativeClasspathResourceLoader : initialization complete.
[WARNING] Default ResourceManager initialization complete.
[WARNING] Velocimacro : initialization starting.
[WARNING] Velocimacro : VM library registration complete.
[WARNING] Velocimacro : Velocimacro : initialization complete.
[WARNING] RuntimeInstance successfully initialized.
[INFO] Generating component class:javax.faces.component.UIMessage
[INFO] Generating component class:javax.faces.component.UIMessages
[INFO] Generating component class:javax.faces.component.UIParameter
[INFO] Generating component class:javax.faces.component.UISelectItem
[INFO] Generating component class:javax.faces.component.UISelectItems
[INFO] Generating component class:javax.faces.component.html.HtmlBody
[INFO] Generating component class:javax.faces.component.html.HtmlColumn
[INFO] Generating component class:javax.faces.component.html.HtmlCommandButton
[INFO] Generating component class:javax.faces.component.html.HtmlCommandLink
[INFO] Generating component class:javax.faces.component.html.HtmlDataTable
[INFO] Generating component class:javax.faces.component.html.HtmlDoctype
[INFO] Generating component class:javax.faces.component.html.HtmlForm
[INFO] Generating component class:javax.faces.component.html.HtmlGraphicImage
[INFO] Generating component class:javax.faces.component.html.HtmlHead
[INFO] Generating component class:javax.faces.component.html.HtmlInputFile
[INFO] Generating component class:javax.faces.component.html.HtmlInputSecret
[INFO] Generating component class:javax.faces.component.html.HtmlInputText
[INFO] Generating component class:javax.faces.component.html.HtmlInputTextarea
[INFO] Generating component class:javax.faces.component.html.HtmlMessage
[INFO] Generating component class:javax.faces.component.html.HtmlMessages
[INFO] Generating component class:javax.faces.component.html.HtmlOutcomeTargetButton
[INFO] Generating component class:javax.faces.component.html.HtmlOutcomeTargetLink
[INFO] Generating component class:javax.faces.component.html.HtmlOutputFormat
[INFO] Generating component class:javax.faces.component.html.HtmlOutputLabel
[INFO] Generating component class:javax.faces.component.html.HtmlOutputLink
[INFO] Generating component class:javax.faces.component.html.HtmlOutputText
[INFO] Generating component class:javax.faces.component.html.HtmlPanelGrid
[INFO] Generating component class:javax.faces.component.html.HtmlPanelGroup
[INFO] Generating component class:javax.faces.component.html.HtmlSelectBooleanCheckbox
[INFO] Generating component class:javax.faces.component.html.HtmlSelectManyCheckbox
[INFO] Generating component class:javax.faces.component.html.HtmlSelectManyListbox
[INFO] Generating component class:javax.faces.component.html.HtmlSelectManyMenu
[INFO] Generating component class:javax.faces.component.html.HtmlSelectOneListbox
[INFO] Generating component class:javax.faces.component.html.HtmlSelectOneMenu
[INFO] Generating component class:javax.faces.component.html.HtmlSelectOneRadio
[INFO]
[INFO] --- maven-remote-resources-plugin:1.4:process (default) @ myfaces-api ---
[INFO] ------------------------------------------------------------------------
[INFO] Reactor Summary:
[INFO]
[INFO] Apache MyFaces Shared For JSF 2.2 - Project ....... SUCCESS [32.858s]
[INFO] Apache MyFaces Shared For JSF 2.2 - Core Mirror ... SUCCESS [41.300s]
[INFO] MyFaces Shared Tomahawk ........................... SUCCESS [20.699s]
[INFO] Apache MyFaces JSF-2.2 Core Project ............... SUCCESS [9.174s]
[INFO] Apache MyFaces JSF-2.2 Core API ................... FAILURE [12.636s]
[INFO] Apache MyFaces Shared Public API For JSF 2.2 - Core SKIPPED
[INFO] Apache MyFaces Core For JSF 2.2 - Shared .......... SKIPPED
[INFO] Apache MyFaces JSF-2.2 Core Impl .................. SKIPPED
[INFO] Apache MyFaces JSF-2.2 Core OSGi Bundle ........... SKIPPED
[INFO] Apache MyFaces JSF-2.2 Impl Test .................. SKIPPED
[INFO] Apache MyFaces JSF-2.2 Core Module ................ SKIPPED
[INFO] Apache MyFaces Composite Build .................... SKIPPED
[INFO] ------------------------------------------------------------------------
[INFO] BUILD FAILURE
[INFO] ------------------------------------------------------------------------
[INFO] Total time: 2:06.983s
[INFO] Finished at: Sat Jun 14 21:40:54 UTC 2014
[INFO] Final Memory: 66M/223M
[INFO] ------------------------------------------------------------------------
Waiting for Jenkins to finish collecting data[ERROR] Failed to execute goal org.apache.maven.plugins:maven-remote-resources-plugin:1.4:process (default) on project myfaces-api: Execution default of goal org.apache.maven.plugins:maven-remote-resources-plugin:1.4:process failed: For artifact {null:null:null:jar}: The groupId cannot be empty. -> [Help 1]
[ERROR]
[ERROR] To see the full stack trace of the errors, re-run Maven with the -e switch.
[ERROR] Re-run Maven using the -X switch to enable full debug logging.
[ERROR]
[ERROR] For more information about the errors and possible solutions, please read the following articles:
[ERROR] [Help 1] http://cwiki.apache.org/confluence/display/MAVEN/PluginExecutionException
[ERROR]
[ERROR] After correcting the problems, you can resume the build with the command
[ERROR] mvn <goals> -rf :myfaces-api
[JENKINS] Archiving <https://builds.apache.org/job/myfaces-current22-1/ws/current22/shared/shared-tomahawk/pom.xml> to org.apache.myfaces.shared/myfaces-shared-tomahawk/4.2.3-SNAPSHOT/myfaces-shared-tomahawk-4.2.3-SNAPSHOT.pom
[JENKINS] Archiving <https://builds.apache.org/job/myfaces-current22-1/ws/current22/shared/shared-tomahawk/target/myfaces-shared-tomahawk-4.2.3-SNAPSHOT.jar> to org.apache.myfaces.shared/myfaces-shared-tomahawk/4.2.3-20140614.214022-44/myfaces-shared-tomahawk-4.2.3-20140614.214022-44.jar
[JENKINS] Archiving <https://builds.apache.org/job/myfaces-current22-1/ws/current22/shared/shared-tomahawk/target/myfaces-shared-tomahawk-4.2.3-SNAPSHOT-sources.jar> to org.apache.myfaces.shared/myfaces-shared-tomahawk/4.2.3-20140614.214022-44/myfaces-shared-tomahawk-4.2.3-20140614.214022-44-sources.jar
Sending artifact delta relative to myfaces-current22-1 ? MyFaces Shared Tomahawk #1328
Archived 3 artifacts
Archive block size is 32768
Received 0 blocks and 865167 bytes
Compression is 0.0%
Took 0.66 sec
[JENKINS] Archiving <https://builds.apache.org/job/myfaces-current22-1/ws/current22/core/shared-public/pom.xml> to org.apache.myfaces.core.internal/myfaces-impl-shared-public/2.2.4-SNAPSHOT/myfaces-impl-shared-public-2.2.4-SNAPSHOT.pom
Sending artifact delta relative to myfaces-current22-1 ? Apache MyFaces Shared Public API For JSF 2.2 - Core #1328
Archived 1 artifacts
Archive block size is 32768
Received 0 blocks and 7047 bytes
Compression is 0.0%
Took 0.14 sec
[JENKINS] Archiving <https://builds.apache.org/job/myfaces-current22-1/ws/current22/core/impl-test/pom.xml> to org.apache.myfaces.core/myfaces-impl-test/2.2.4-SNAPSHOT/myfaces-impl-test-2.2.4-SNAPSHOT.pom
Sending artifact delta relative to myfaces-current22-1 ? Apache MyFaces JSF-2.2 Impl Test #1328
Archived 1 artifacts
Archive block size is 32768
Received 0 blocks and 9288 bytes
Compression is 0.0%
Took 1.5 sec
[JENKINS] Archiving <https://builds.apache.org/job/myfaces-current22-1/ws/current22/core/impl/pom.xml> to org.apache.myfaces.core/myfaces-impl/2.2.4-SNAPSHOT/myfaces-impl-2.2.4-SNAPSHOT.pom
Sending artifact delta relative to myfaces-current22-1 ? Apache MyFaces JSF-2.2 Core Impl #1328
Archived 1 artifacts
Archive block size is 32768
Received 1 blocks and 29632 bytes
Compression is 52.5%
Took 0.24 sec
[JENKINS] Archiving <https://builds.apache.org/job/myfaces-current22-1/ws/current22/shared/core/pom.xml> to org.apache.myfaces.shared/myfaces-shared-core/4.2.3-SNAPSHOT/myfaces-shared-core-4.2.3-SNAPSHOT.pom
[JENKINS] Archiving <https://builds.apache.org/job/myfaces-current22-1/ws/current22/shared/core/target/myfaces-shared-core-4.2.3-SNAPSHOT.jar> to org.apache.myfaces.shared/myfaces-shared-core/4.2.3-20140614.214002-45/myfaces-shared-core-4.2.3-20140614.214002-45.jar
[JENKINS] Archiving <https://builds.apache.org/job/myfaces-current22-1/ws/current22/shared/core/target/myfaces-shared-core-4.2.3-SNAPSHOT-sources.jar> to org.apache.myfaces.shared/myfaces-shared-core/4.2.3-20140614.214002-45/myfaces-shared-core-4.2.3-20140614.214002-45-sources.jar
Sending artifact delta relative to myfaces-current22-1 ? Apache MyFaces Shared For JSF 2.2 - Core Mirror #1328
Archived 3 artifacts
Archive block size is 32768
Received 0 blocks and 936183 bytes
Compression is 0.0%
Took 0.74 sec
[JENKINS] Archiving <https://builds.apache.org/job/myfaces-current22-1/ws/current22/core/bundle/pom.xml> to org.apache.myfaces.core/myfaces-bundle/2.2.4-SNAPSHOT/myfaces-bundle-2.2.4-SNAPSHOT.pom
Sending artifact delta relative to myfaces-current22-1 ? Apache MyFaces JSF-2.2 Core OSGi Bundle #1328
Archived 1 artifacts
Archive block size is 32768
Received 0 blocks and 8555 bytes
Compression is 0.0%
Took 0.27 sec
[JENKINS] Archiving <https://builds.apache.org/job/myfaces-current22-1/ws/current22/core/api/pom.xml> to org.apache.myfaces.core/myfaces-api/2.2.4-SNAPSHOT/myfaces-api-2.2.4-SNAPSHOT.pom
Sending artifact delta relative to myfaces-current22-1 ? Apache MyFaces JSF-2.2 Core API #1328
Archived 1 artifacts
Archive block size is 32768
Received 0 blocks and 33461 bytes
Compression is 0.0%
Took 0.15 sec
[JENKINS] Archiving <https://builds.apache.org/job/myfaces-current22-1/ws/current22/shared/pom.xml> to org.apache.myfaces.shared/myfaces-shared-project/4.2.3-SNAPSHOT/myfaces-shared-project-4.2.3-SNAPSHOT.pom
[JENKINS] Archiving <https://builds.apache.org/job/myfaces-current22-1/ws/current22/shared/target/myfaces-shared-project-4.2.3-SNAPSHOT-site.xml> to org.apache.myfaces.shared/myfaces-shared-project/4.2.3-20140614.213922-49/myfaces-shared-project-4.2.3-20140614.213922-49-site.xml
Sending artifact delta relative to myfaces-current22-1 ? Apache MyFaces Shared For JSF 2.2 - Project #1328
Archived 2 artifacts
Archive block size is 32768
Received 0 blocks and 11129 bytes
Compression is 0.0%
Took 0.14 sec
[JENKINS] Archiving <https://builds.apache.org/job/myfaces-current22-1/ws/current22/core/parent/pom.xml> to org.apache.myfaces.core/myfaces-core-project/2.2.4-SNAPSHOT/myfaces-core-project-2.2.4-SNAPSHOT.pom
[JENKINS] Archiving <https://builds.apache.org/job/myfaces-current22-1/ws/current22/core/parent/target/myfaces-core-project-2.2.4-SNAPSHOT-site.xml> to org.apache.myfaces.core/myfaces-core-project/2.2.4-20140614.214036-42/myfaces-core-project-2.2.4-20140614.214036-42-site.xml
Sending artifact delta relative to myfaces-current22-1 ? Apache MyFaces JSF-2.2 Core Project #1328
Archived 2 artifacts
Archive block size is 32768
Received 0 blocks and 32027 bytes
Compression is 0.0%
Took 0.13 sec
[JENKINS] Archiving <https://builds.apache.org/job/myfaces-current22-1/ws/current22/core/pom.xml> to org.apache.myfaces.core/myfaces-core-module/2.2.4-SNAPSHOT/myfaces-core-module-2.2.4-SNAPSHOT.pom
Sending artifact delta relative to myfaces-current22-1 ? Apache MyFaces JSF-2.2 Core Module #1328
Archived 1 artifacts
Archive block size is 32768
Received 0 blocks and 8428 bytes
Compression is 0.0%
Took 83 ms
[JENKINS] Archiving <https://builds.apache.org/job/myfaces-current22-1/ws/current22/pom.xml> to org.apache.myfaces/myfaces-base/2.2.0-SNAPSHOT/myfaces-base-2.2.0-SNAPSHOT.pom
Sending artifact delta relative to myfaces-current22-1 ? Apache MyFaces Composite Build #1328
Archived 1 artifacts
Archive block size is 32768
Received 0 blocks and 2225 bytes
Compression is 0.0%
Took 0.25 sec
[JENKINS] Archiving <https://builds.apache.org/job/myfaces-current22-1/ws/current22/core/shared/pom.xml> to org.apache.myfaces.core.internal/myfaces-impl-shared/2.2.4-SNAPSHOT/myfaces-impl-shared-2.2.4-SNAPSHOT.pom
Sending artifact delta relative to myfaces-current22-1 ? Apache MyFaces Core For JSF 2.2 - Shared #1328
Archived 1 artifacts
Archive block size is 32768
Received 0 blocks and 11915 bytes
Compression is 0.0%
Took 0.24 sec
Sending e-mails to: commits@myfaces.apache.org grantsmith@apache.org
channel stopped
Jenkins build is back to normal : myfaces-current22-1 #1330
Posted by Apache Jenkins Server <je...@builds.apache.org>.
See <https://builds.apache.org/job/myfaces-current22-1/1330/>