You are viewing a plain text version of this content. The canonical link for it is here.
Posted to builds@beam.apache.org by Apache Jenkins Server <je...@builds.apache.org> on 2020/09/05 19:11:24 UTC
Build failed in Jenkins: beam_PostCommit_Python37 #2805
See <https://ci-beam.apache.org/job/beam_PostCommit_Python37/2805/display/redirect>
Changes:
------------------------------------------
[...truncated 21.71 MB...]
"parallel_input": {
"@type": "OutputReference",
"output_name": "out",
"step_name": "s4"
},
"serialized_fn": "QlpoOTFBWSZTWWeYg/EAApJ/8H/////////////cwr///+ZjwCAAYEBAAvYZlAZGGqZKeap6nqaD1Bk2o9T9UeoGgAaAaDQaNPSeoaD1PUAGnqeoMj0gZNBKmiZNCYmI1J4mSbSYg0yZAAGgABoDQaABoNAyMgGmSIQ0pspptTYiDTTQNBgQyaAGIyAGg0Bp6BNqeoGgeoOAAAAAAAAAAaAAAAAAAAAADvptRksy3rYqqrRyJX2qH0NSOBctdVUdLQAm1Vh2UANxiG8xcsPs2/V+wqRYe1ULTTsFGP9a61H8xkkgE7und2KQKCYLXStXLn3eFthcDyETfV4UGFKZNeBBEHUSJLWyzBEAWMCthwxMLlv1cDyano9cgF8al+wdq5r/REAkG1Xg8aacyW/LCkBXoTuB4iGoncNkgf7kZTycpPhEogIUlcmUXbLXkkTvSvGWUVI8gorCTQi4qGCTsUwnjQkyt2ZyOO9OYuufzYucYr+tb6skz+fLbYmGltqvc0ZyO62U1BN/063ZqwM9sHukMYDtXzQzuCo6I8hcg9bN+uA5zVxEToRovLZIoOS0PpZ6DtewoIpXjNEHdMET2MhmBwtiJO/7kFGvRXCBJCR3E0VT+tlPoVcp7u8FEolFZEAQgtDOCFCYBounGasGioKCtPYuiTpMtBVhRemCeN1kw3xz7+O3HdpAYYCUXQKJCFvkypPA1qn+cbuIJzJofIN2BcCmDlvIBCstlwFz2aQYXYogZO/bA/V1tacCaIv1lmiMtOWCxQ22hA4/JeLrKatgfimoi1XTBYqKI1UlwpqoFFxMxI7eKk1vELwoiakO73oRuciOUowiTwDyilzBw1LIP03KHIxylREq0IIBlhEEIgRqAmRKSZspXcY8WJZc1S79gLtt2o65KoRUptqAP0C0mEjQrLUMMdcwvLxdDZ2YWF3a2YmEc6V3Flq/zGko0q1i7CE9F60VVmlLVbxGN1Kc8GIjGCmM2+eg7pKnM7xezfVKYmJBAxbGHNEIVArMrZhiGweBLCVomDBhtYxZft2DIMzallLUjBweKHOZYLJJaYlEbRaHX4A2iWd0kmIYgPGrVkkFdUkblNPWmlouz7UYWBJGThIYIMpTkP5/pJL782MpXbJs/HJr2mwipgUqF1LL6WhjchFIhEb70ijjxamTOr2EAb6pUqdP+qQ4F4FkIiHj/i7kinChIM8xB+I=",
"user_name": "m_out"
}
}
],
"type": "JOB_TYPE_BATCH"
}
INFO:apache_beam.runners.dataflow.internal.apiclient:Create job: <Job
createTime: '2020-09-05T19:03:54.539521Z'
currentStateTime: '1970-01-01T00:00:00Z'
id: '2020-09-05_12_03_53-14060888207664167103'
location: 'us-central1'
name: 'beamapp-jenkins-0905190347-041411'
projectId: 'apache-beam-testing'
stageStates: []
startTime: '2020-09-05T19:03:54.539521Z'
steps: []
tempFiles: []
type: TypeValueValuesEnum(JOB_TYPE_BATCH, 1)>
INFO:apache_beam.runners.dataflow.internal.apiclient:Created job with id: [2020-09-05_12_03_53-14060888207664167103]
INFO:apache_beam.runners.dataflow.internal.apiclient:Submitted job: 2020-09-05_12_03_53-14060888207664167103
INFO:apache_beam.runners.dataflow.internal.apiclient:To access the Dataflow monitoring console, please navigate to https://console.cloud.google.com/dataflow/jobs/us-central1/2020-09-05_12_03_53-14060888207664167103?project=apache-beam-testing
INFO:oauth2client.transport:Refreshing due to a 401 (attempt 1/2)
INFO:oauth2client.transport:Refreshing due to a 401 (attempt 1/2)
INFO:oauth2client.transport:Refreshing due to a 401 (attempt 1/2)
INFO:apache_beam.runners.dataflow.dataflow_runner:Job 2020-09-05_12_03_53-14060888207664167103 is in state JOB_STATE_RUNNING
INFO:apache_beam.runners.dataflow.dataflow_runner:2020-09-05T19:03:53.310Z: JOB_MESSAGE_DETAILED: Autoscaling is enabled for job 2020-09-05_12_03_53-14060888207664167103. The number of workers will be between 1 and 1000.
INFO:apache_beam.runners.dataflow.dataflow_runner:2020-09-05T19:03:53.310Z: JOB_MESSAGE_DETAILED: Autoscaling was automatically enabled for job 2020-09-05_12_03_53-14060888207664167103.
INFO:apache_beam.runners.dataflow.dataflow_runner:2020-09-05T19:03:56.862Z: JOB_MESSAGE_BASIC: Worker configuration: n1-standard-1 in us-central1-a.
INFO:apache_beam.runners.dataflow.dataflow_runner:2020-09-05T19:03:57.639Z: JOB_MESSAGE_DETAILED: Expanding CoGroupByKey operations into optimizable parts.
INFO:apache_beam.runners.dataflow.dataflow_runner:2020-09-05T19:03:57.669Z: JOB_MESSAGE_DEBUG: Combiner lifting skipped for step GroupByKey: GroupByKey not followed by a combiner.
INFO:apache_beam.runners.dataflow.dataflow_runner:2020-09-05T19:03:57.696Z: JOB_MESSAGE_DETAILED: Expanding GroupByKey operations into optimizable parts.
INFO:apache_beam.runners.dataflow.dataflow_runner:2020-09-05T19:03:57.724Z: JOB_MESSAGE_DETAILED: Lifting ValueCombiningMappingFns into MergeBucketsMappingFns
INFO:apache_beam.runners.dataflow.dataflow_runner:2020-09-05T19:03:57.765Z: JOB_MESSAGE_DEBUG: Annotating graph with Autotuner information.
INFO:apache_beam.runners.dataflow.dataflow_runner:2020-09-05T19:03:57.805Z: JOB_MESSAGE_DETAILED: Fusing adjacent ParDo, Read, Write, and Flatten operations
INFO:apache_beam.runners.dataflow.dataflow_runner:2020-09-05T19:03:57.825Z: JOB_MESSAGE_DETAILED: Fusing consumer metrics into Create/Read
INFO:apache_beam.runners.dataflow.dataflow_runner:2020-09-05T19:03:57.859Z: JOB_MESSAGE_DETAILED: Fusing consumer map_to_common_key into metrics
INFO:apache_beam.runners.dataflow.dataflow_runner:2020-09-05T19:03:57.892Z: JOB_MESSAGE_DETAILED: Fusing consumer GroupByKey/Reify into map_to_common_key
INFO:apache_beam.runners.dataflow.dataflow_runner:2020-09-05T19:03:57.927Z: JOB_MESSAGE_DETAILED: Fusing consumer GroupByKey/Write into GroupByKey/Reify
INFO:apache_beam.runners.dataflow.dataflow_runner:2020-09-05T19:03:57.975Z: JOB_MESSAGE_DETAILED: Fusing consumer GroupByKey/GroupByWindow into GroupByKey/Read
INFO:apache_beam.runners.dataflow.dataflow_runner:2020-09-05T19:03:58.011Z: JOB_MESSAGE_DETAILED: Fusing consumer m_out into GroupByKey/GroupByWindow
INFO:apache_beam.runners.dataflow.dataflow_runner:2020-09-05T19:03:58.045Z: JOB_MESSAGE_DEBUG: Workflow config is missing a default resource spec.
INFO:apache_beam.runners.dataflow.dataflow_runner:2020-09-05T19:03:58.099Z: JOB_MESSAGE_DEBUG: Adding StepResource setup and teardown to workflow graph.
INFO:apache_beam.runners.dataflow.dataflow_runner:2020-09-05T19:03:58.122Z: JOB_MESSAGE_DEBUG: Adding workflow start and stop steps.
INFO:apache_beam.runners.dataflow.dataflow_runner:2020-09-05T19:03:58.155Z: JOB_MESSAGE_DEBUG: Assigning stage ids.
INFO:apache_beam.runners.dataflow.dataflow_runner:2020-09-05T19:03:58.307Z: JOB_MESSAGE_DEBUG: Executing wait step start13
INFO:apache_beam.runners.dataflow.dataflow_runner:2020-09-05T19:03:58.401Z: JOB_MESSAGE_BASIC: Executing operation GroupByKey/Create
INFO:apache_beam.runners.dataflow.dataflow_runner:2020-09-05T19:03:58.443Z: JOB_MESSAGE_DEBUG: Starting worker pool setup.
INFO:apache_beam.runners.dataflow.dataflow_runner:2020-09-05T19:03:58.467Z: JOB_MESSAGE_BASIC: Starting 1 workers in us-central1-a...
INFO:apache_beam.runners.dataflow.dataflow_runner:2020-09-05T19:03:58.509Z: JOB_MESSAGE_BASIC: Finished operation GroupByKey/Create
INFO:apache_beam.runners.dataflow.dataflow_runner:2020-09-05T19:03:58.561Z: JOB_MESSAGE_DEBUG: Value "GroupByKey/Session" materialized.
INFO:apache_beam.runners.dataflow.dataflow_runner:2020-09-05T19:03:58.631Z: JOB_MESSAGE_BASIC: Executing operation Create/Read+metrics+map_to_common_key+GroupByKey/Reify+GroupByKey/Write
INFO:apache_beam.runners.dataflow.dataflow_runner:2020-09-05T19:04:00.092Z: JOB_MESSAGE_DETAILED: Workers have started successfully.
INFO:apache_beam.runners.dataflow.dataflow_runner:2020-09-05T19:04:00.132Z: JOB_MESSAGE_DETAILED: Workers have started successfully.
INFO:apache_beam.runners.dataflow.dataflow_runner:2020-09-05T19:04:15.868Z: JOB_MESSAGE_WARNING: Your project already contains 100 Dataflow-created metric descriptors and Stackdriver will not create new Dataflow custom metrics for this job. Each unique user-defined metric name (independent of the DoFn in which it is defined) produces a new metric descriptor. To delete old / unused metric descriptors see https://developers.google.com/apis-explorer/#p/monitoring/v3/monitoring.projects.metricDescriptors.list and https://developers.google.com/apis-explorer/#p/monitoring/v3/monitoring.projects.metricDescriptors.delete
INFO:apache_beam.runners.dataflow.dataflow_runner:2020-09-05T19:04:24.813Z: JOB_MESSAGE_DETAILED: Autoscaling: Raised the number of workers to 1 based on the rate of progress in the currently running stage(s).
INFO:apache_beam.runners.dataflow.dataflow_runner:2020-09-05T19:06:17.113Z: JOB_MESSAGE_DETAILED: Workers have started successfully.
INFO:apache_beam.runners.dataflow.dataflow_runner:2020-09-05T19:06:17.142Z: JOB_MESSAGE_DETAILED: Workers have started successfully.
INFO:apache_beam.runners.dataflow.dataflow_runner:2020-09-05T19:07:06.372Z: JOB_MESSAGE_BASIC: Finished operation assert_that/Create/Read+assert_that/Group/pair_with_0+assert_that/Group/GroupByKey/Reify+assert_that/Group/GroupByKey/Write
INFO:apache_beam.runners.dataflow.dataflow_runner:2020-09-05T19:07:08.517Z: JOB_MESSAGE_BASIC: Finished operation Create/Read+ExternalTransform(simple)/Map(<lambda at external_it_test.py:43>)+assert_that/WindowInto(WindowIntoFn)+assert_that/ToVoidKey+assert_that/Group/pair_with_1+assert_that/Group/GroupByKey/Reify+assert_that/Group/GroupByKey/Write
INFO:apache_beam.runners.dataflow.dataflow_runner:2020-09-05T19:07:08.589Z: JOB_MESSAGE_BASIC: Executing operation assert_that/Group/GroupByKey/Close
INFO:apache_beam.runners.dataflow.dataflow_runner:2020-09-05T19:07:08.653Z: JOB_MESSAGE_BASIC: Finished operation assert_that/Group/GroupByKey/Close
INFO:apache_beam.runners.dataflow.dataflow_runner:2020-09-05T19:07:08.719Z: JOB_MESSAGE_BASIC: Executing operation assert_that/Group/GroupByKey/Read+assert_that/Group/GroupByKey/GroupByWindow+assert_that/Group/Map(_merge_tagged_vals_under_key)+assert_that/Unkey+assert_that/Match
INFO:apache_beam.runners.dataflow.dataflow_runner:2020-09-05T19:07:16.914Z: JOB_MESSAGE_BASIC: Finished operation assert_that/Group/GroupByKey/Read+assert_that/Group/GroupByKey/GroupByWindow+assert_that/Group/Map(_merge_tagged_vals_under_key)+assert_that/Unkey+assert_that/Match
INFO:apache_beam.runners.dataflow.dataflow_runner:2020-09-05T19:07:16.976Z: JOB_MESSAGE_DEBUG: Executing success step success19
INFO:apache_beam.runners.dataflow.dataflow_runner:2020-09-05T19:07:17.054Z: JOB_MESSAGE_DETAILED: Cleaning up.
INFO:apache_beam.runners.dataflow.dataflow_runner:2020-09-05T19:07:17.095Z: JOB_MESSAGE_DEBUG: Starting worker pool teardown.
INFO:apache_beam.runners.dataflow.dataflow_runner:2020-09-05T19:07:17.122Z: JOB_MESSAGE_BASIC: Stopping worker pool...
INFO:apache_beam.runners.dataflow.dataflow_runner:2020-09-05T19:07:21.834Z: JOB_MESSAGE_BASIC: Finished operation Type matches/Create/Read+Type matches/Group/pair_with_0+Type matches/Group/GroupByKey/Reify+Type matches/Group/GroupByKey/Write
INFO:apache_beam.runners.dataflow.dataflow_runner:2020-09-05T19:07:25.535Z: JOB_MESSAGE_BASIC: Finished operation Create/Read+InspectForDetails/ParDo(_InspectFn)+ParDo(CallableWrapperDoFn)/ParDo(CallableWrapperDoFn)+Type matches/WindowInto(WindowIntoFn)+Type matches/ToVoidKey+Type matches/Group/pair_with_1+Type matches/Group/GroupByKey/Reify+Type matches/Group/GroupByKey/Write
INFO:apache_beam.runners.dataflow.dataflow_runner:2020-09-05T19:07:25.616Z: JOB_MESSAGE_BASIC: Executing operation Type matches/Group/GroupByKey/Close
INFO:apache_beam.runners.dataflow.dataflow_runner:2020-09-05T19:07:25.665Z: JOB_MESSAGE_BASIC: Finished operation Type matches/Group/GroupByKey/Close
INFO:apache_beam.runners.dataflow.dataflow_runner:2020-09-05T19:07:25.735Z: JOB_MESSAGE_BASIC: Executing operation Type matches/Group/GroupByKey/Read+Type matches/Group/GroupByKey/GroupByWindow+Type matches/Group/Map(_merge_tagged_vals_under_key)+Type matches/Unkey+Type matches/Match
INFO:apache_beam.runners.dataflow.dataflow_runner:2020-09-05T19:07:34.937Z: JOB_MESSAGE_BASIC: Finished operation Type matches/Group/GroupByKey/Read+Type matches/Group/GroupByKey/GroupByWindow+Type matches/Group/Map(_merge_tagged_vals_under_key)+Type matches/Unkey+Type matches/Match
INFO:apache_beam.runners.dataflow.dataflow_runner:2020-09-05T19:07:35.013Z: JOB_MESSAGE_DEBUG: Executing success step success19
INFO:apache_beam.runners.dataflow.dataflow_runner:2020-09-05T19:07:35.084Z: JOB_MESSAGE_DETAILED: Cleaning up.
INFO:apache_beam.runners.dataflow.dataflow_runner:2020-09-05T19:07:35.149Z: JOB_MESSAGE_DEBUG: Starting worker pool teardown.
INFO:apache_beam.runners.dataflow.dataflow_runner:2020-09-05T19:07:35.186Z: JOB_MESSAGE_BASIC: Stopping worker pool...
INFO:apache_beam.runners.dataflow.dataflow_runner:2020-09-05T19:08:03.886Z: JOB_MESSAGE_DETAILED: Autoscaling: Resized worker pool from 1 to 0.
INFO:apache_beam.runners.dataflow.dataflow_runner:2020-09-05T19:08:03.929Z: JOB_MESSAGE_BASIC: Worker pool stopped.
INFO:apache_beam.runners.dataflow.dataflow_runner:2020-09-05T19:08:03.963Z: JOB_MESSAGE_DEBUG: Tearing down pending resources...
INFO:apache_beam.runners.dataflow.dataflow_runner:Job 2020-09-05_12_01_07-13959526198212445030 is in state JOB_STATE_DONE
INFO:apache_beam.runners.dataflow.dataflow_runner:2020-09-05T19:08:32.055Z: JOB_MESSAGE_DETAILED: Autoscaling: Resized worker pool from 1 to 0.
INFO:apache_beam.runners.dataflow.dataflow_runner:2020-09-05T19:08:32.122Z: JOB_MESSAGE_BASIC: Worker pool stopped.
INFO:apache_beam.runners.dataflow.dataflow_runner:2020-09-05T19:08:32.156Z: JOB_MESSAGE_DEBUG: Tearing down pending resources...
INFO:apache_beam.runners.dataflow.dataflow_runner:Job 2020-09-05_12_01_21-6981245580610865822 is in state JOB_STATE_DONE
INFO:apache_beam.runners.dataflow.dataflow_runner:2020-09-05T19:10:06.056Z: JOB_MESSAGE_BASIC: Finished operation Create/Read+metrics+map_to_common_key+GroupByKey/Reify+GroupByKey/Write
INFO:apache_beam.runners.dataflow.dataflow_runner:2020-09-05T19:10:06.118Z: JOB_MESSAGE_BASIC: Executing operation GroupByKey/Close
INFO:apache_beam.runners.dataflow.dataflow_runner:2020-09-05T19:10:06.170Z: JOB_MESSAGE_BASIC: Finished operation GroupByKey/Close
INFO:apache_beam.runners.dataflow.dataflow_runner:2020-09-05T19:10:06.246Z: JOB_MESSAGE_BASIC: Executing operation GroupByKey/Read+GroupByKey/GroupByWindow+m_out
INFO:apache_beam.runners.dataflow.dataflow_runner:2020-09-05T19:10:15.341Z: JOB_MESSAGE_BASIC: Finished operation GroupByKey/Read+GroupByKey/GroupByWindow+m_out
INFO:apache_beam.runners.dataflow.dataflow_runner:2020-09-05T19:10:15.409Z: JOB_MESSAGE_DEBUG: Executing success step success11
INFO:apache_beam.runners.dataflow.dataflow_runner:2020-09-05T19:10:15.483Z: JOB_MESSAGE_DETAILED: Cleaning up.
INFO:apache_beam.runners.dataflow.dataflow_runner:2020-09-05T19:10:15.555Z: JOB_MESSAGE_DEBUG: Starting worker pool teardown.
INFO:apache_beam.runners.dataflow.dataflow_runner:2020-09-05T19:10:15.576Z: JOB_MESSAGE_BASIC: Stopping worker pool...
INFO:apache_beam.runners.dataflow.dataflow_runner:2020-09-05T19:11:09.908Z: JOB_MESSAGE_DETAILED: Autoscaling: Resized worker pool from 1 to 0.
INFO:apache_beam.runners.dataflow.dataflow_runner:2020-09-05T19:11:09.960Z: JOB_MESSAGE_BASIC: Worker pool stopped.
INFO:apache_beam.runners.dataflow.dataflow_runner:2020-09-05T19:11:09.990Z: JOB_MESSAGE_DEBUG: Tearing down pending resources...
INFO:apache_beam.runners.dataflow.dataflow_runner:Job 2020-09-05_12_03_53-14060888207664167103 is in state JOB_STATE_DONE
test_autocomplete_it (apache_beam.examples.complete.autocomplete_test.AutocompleteTest) ... ok
test_streaming_wordcount_debugging_it (apache_beam.examples.streaming_wordcount_debugging_it_test.StreamingWordcountDebuggingIT) ... SKIP: Skipped due to [BEAM-3377]: assert_that not working for streaming
test_datastore_wordcount_it (apache_beam.examples.cookbook.datastore_wordcount_it_test.DatastoreWordCountIT) ... ok
test_bigquery_tornadoes_it (apache_beam.examples.cookbook.bigquery_tornadoes_it_test.BigqueryTornadoesIT) ... ok
test_leader_board_it (apache_beam.examples.complete.game.leader_board_it_test.LeaderBoardIT) ... ok
test_game_stats_it (apache_beam.examples.complete.game.game_stats_it_test.GameStatsIT) ... ok
test_streaming_wordcount_it (apache_beam.examples.streaming_wordcount_it_test.StreamingWordCountIT) ... ok
test_wordcount_fnapi_it (apache_beam.examples.wordcount_it_test.WordCountIT) ... ok
test_user_score_it (apache_beam.examples.complete.game.user_score_it_test.UserScoreIT) ... ok
test_wordcount_it (apache_beam.examples.wordcount_it_test.WordCountIT) ... ok
test_hourly_team_score_it (apache_beam.examples.complete.game.hourly_team_score_it_test.HourlyTeamScoreIT) ... ok
test_avro_it (apache_beam.examples.fastavro_it_test.FastavroIT) ... ok
test_read_via_sql (apache_beam.io.gcp.experimental.spannerio_read_it_test.SpannerReadIntegrationTest) ... ok
test_read_via_table (apache_beam.io.gcp.experimental.spannerio_read_it_test.SpannerReadIntegrationTest) ... ok
test_bigquery_read_1M_python (apache_beam.io.gcp.bigquery_io_read_it_test.BigqueryIOReadIT) ... ok
test_bigquery_read_custom_1M_python (apache_beam.io.gcp.bigquery_io_read_it_test.BigqueryIOReadIT) ... ok
test_iobase_source (apache_beam.io.gcp.bigquery_read_it_test.ReadNewTypesTests) ... ok
test_native_source (apache_beam.io.gcp.bigquery_read_it_test.ReadNewTypesTests) ... ok
test_iobase_source (apache_beam.io.gcp.bigquery_read_it_test.ReadTests) ... ok
test_native_source (apache_beam.io.gcp.bigquery_read_it_test.ReadTests) ... ok
test_avro_file_load (apache_beam.io.gcp.bigquery_test.BigQueryFileLoadsIntegrationTests) ... ok
test_bqfl_streaming (apache_beam.io.gcp.bigquery_file_loads_test.BigQueryFileLoadsIT) ... SKIP: TestStream is not supported on TestDataflowRunner
test_multiple_destinations_transform (apache_beam.io.gcp.bigquery_file_loads_test.BigQueryFileLoadsIT) ... ok
test_one_job_fails_all_jobs_fail (apache_beam.io.gcp.bigquery_file_loads_test.BigQueryFileLoadsIT) ... ok
test_spanner_error (apache_beam.io.gcp.experimental.spannerio_write_it_test.SpannerWriteIntegrationTest) ... ok
test_spanner_update (apache_beam.io.gcp.experimental.spannerio_write_it_test.SpannerWriteIntegrationTest) ... ok
test_write_batches (apache_beam.io.gcp.experimental.spannerio_write_it_test.SpannerWriteIntegrationTest) ... ok
test_copy (apache_beam.io.gcp.gcsio_integration_test.GcsIOIntegrationTest) ... ok
test_copy_batch (apache_beam.io.gcp.gcsio_integration_test.GcsIOIntegrationTest) ... ok
test_copy_batch_kms (apache_beam.io.gcp.gcsio_integration_test.GcsIOIntegrationTest) ... ok
test_copy_batch_rewrite_token (apache_beam.io.gcp.gcsio_integration_test.GcsIOIntegrationTest) ... ok
test_copy_kms (apache_beam.io.gcp.gcsio_integration_test.GcsIOIntegrationTest) ... ok
test_copy_rewrite_token (apache_beam.io.gcp.gcsio_integration_test.GcsIOIntegrationTest) ... ok
test_value_provider_transform (apache_beam.io.gcp.bigquery_test.BigQueryStreamingInsertTransformIntegrationTests) ... ok
test_multiple_destinations_transform (apache_beam.io.gcp.bigquery_test.BigQueryStreamingInsertTransformIntegrationTests) ... ok
test_transform_on_gcs (apache_beam.io.fileio_test.MatchIntegrationTest) ... ok
test_parquetio_it (apache_beam.io.parquetio_it_test.TestParquetIT) ... ok
test_datastore_write_limit (apache_beam.io.gcp.datastore.v1new.datastore_write_it_test.DatastoreWriteIT) ... ok
test_file_loads (apache_beam.io.gcp.bigquery_test.PubSubBigQueryIT) ... SKIP: https://issuetracker.google.com/issues/118375066
test_streaming_inserts (apache_beam.io.gcp.bigquery_test.PubSubBigQueryIT) ... ok
test_dicom_search_instances (apache_beam.io.gcp.dicomio_integration_test.DICOMIoIntegrationTest) ... ok
test_dicom_store_instance_from_gcs (apache_beam.io.gcp.dicomio_integration_test.DICOMIoIntegrationTest) ... ok
test_streaming_data_only (apache_beam.io.gcp.pubsub_integration_test.PubSubIntegrationTest) ... ok
test_streaming_with_attributes (apache_beam.io.gcp.pubsub_integration_test.PubSubIntegrationTest) ... ok
test_big_query_legacy_sql (apache_beam.io.gcp.big_query_query_to_table_it_test.BigQueryQueryToTableIT) ... ok
test_big_query_new_types (apache_beam.io.gcp.big_query_query_to_table_it_test.BigQueryQueryToTableIT) ... ok
test_big_query_new_types_avro (apache_beam.io.gcp.big_query_query_to_table_it_test.BigQueryQueryToTableIT) ... ok
test_big_query_new_types_native (apache_beam.io.gcp.big_query_query_to_table_it_test.BigQueryQueryToTableIT) ... ERROR
test_big_query_standard_sql (apache_beam.io.gcp.big_query_query_to_table_it_test.BigQueryQueryToTableIT) ... ok
test_big_query_standard_sql_kms_key_native (apache_beam.io.gcp.big_query_query_to_table_it_test.BigQueryQueryToTableIT) ... ok
test_analyzing_syntax (apache_beam.ml.gcp.naturallanguageml_test_it.NaturalLanguageMlTestIT) ... ok
test_basic_execution (apache_beam.testing.test_stream_it_test.TestStreamIntegrationTests) ... SKIP: The "TestDataflowRunner", does not support the TestStream transform. Supported runners: ['DirectRunner', 'SwitchingDirectRunner']
Tests that the TestStream supports emitting to multiple PCollections. ... SKIP: The "TestDataflowRunner", does not support the TestStream transform. Supported runners: ['DirectRunner', 'SwitchingDirectRunner']
Tests that the TestStream can independently control output watermarks. ... SKIP: The "TestDataflowRunner", does not support the TestStream transform. Supported runners: ['DirectRunner', 'SwitchingDirectRunner']
test_label_detection_with_video_context (apache_beam.ml.gcp.videointelligenceml_test_it.VideoIntelligenceMlTestIT) ... ok
test_text_detection_with_language_hint (apache_beam.ml.gcp.visionml_test_it.VisionMlTestIT) ... ok
Runs streaming Dataflow job and verifies that user metrics are reported ... ok
test_big_query_write (apache_beam.io.gcp.bigquery_write_it_test.BigQueryWriteIntegrationTests) ... ok
test_big_query_write_new_types (apache_beam.io.gcp.bigquery_write_it_test.BigQueryWriteIntegrationTests) ... ok
test_big_query_write_schema_autodetect (apache_beam.io.gcp.bigquery_write_it_test.BigQueryWriteIntegrationTests) ... SKIP: DataflowRunner does not support schema autodetection
test_big_query_write_without_schema (apache_beam.io.gcp.bigquery_write_it_test.BigQueryWriteIntegrationTests) ... ok
test_job_python_from_python_it (apache_beam.transforms.external_it_test.ExternalTransformIT) ... ok
test_deidentification (apache_beam.ml.gcp.cloud_dlp_it_test.CloudDLPIT) ... ok
test_inspection (apache_beam.ml.gcp.cloud_dlp_it_test.CloudDLPIT) ... ok
test_metrics_fnapi_it (apache_beam.runners.dataflow.dataflow_exercise_metrics_pipeline_test.ExerciseMetricsPipelineTest) ... ok
test_metrics_it (apache_beam.runners.dataflow.dataflow_exercise_metrics_pipeline_test.ExerciseMetricsPipelineTest) ... ok
======================================================================
ERROR: test_big_query_new_types_native (apache_beam.io.gcp.big_query_query_to_table_it_test.BigQueryQueryToTableIT)
----------------------------------------------------------------------
Traceback (most recent call last):
File "<https://ci-beam.apache.org/job/beam_PostCommit_Python37/ws/src/sdks/python/apache_beam/io/gcp/big_query_query_to_table_it_test.py",> line 310, in test_big_query_new_types_native
big_query_query_to_table_pipeline.run_bq_pipeline(options)
File "<https://ci-beam.apache.org/job/beam_PostCommit_Python37/ws/src/sdks/python/apache_beam/io/gcp/big_query_query_to_table_pipeline.py",> line 113, in run_bq_pipeline
result = p.run()
File "<https://ci-beam.apache.org/job/beam_PostCommit_Python37/ws/src/sdks/python/apache_beam/testing/test_pipeline.py",> line 112, in run
False if self.not_use_test_runner_api else test_runner_api))
File "<https://ci-beam.apache.org/job/beam_PostCommit_Python37/ws/src/sdks/python/apache_beam/pipeline.py",> line 550, in run
return self.runner.run_pipeline(self, self._options)
File "<https://ci-beam.apache.org/job/beam_PostCommit_Python37/ws/src/sdks/python/apache_beam/runners/dataflow/test_dataflow_runner.py",> line 57, in run_pipeline
self).run_pipeline(pipeline, options)
File "<https://ci-beam.apache.org/job/beam_PostCommit_Python37/ws/src/sdks/python/apache_beam/runners/dataflow/dataflow_runner.py",> line 479, in run_pipeline
artifacts=environments.python_sdk_dependencies(options)))
File "<https://ci-beam.apache.org/job/beam_PostCommit_Python37/ws/src/sdks/python/apache_beam/transforms/environments.py",> line 614, in python_sdk_dependencies
staged_name in stager.Stager.create_job_resources(options, tmp_dir))
File "<https://ci-beam.apache.org/job/beam_PostCommit_Python37/ws/src/sdks/python/apache_beam/runners/portability/stager.py",> line 172, in create_job_resources
setup_options.requirements_file, requirements_cache_path)
File "<https://ci-beam.apache.org/job/beam_PostCommit_Python37/ws/src/sdks/python/apache_beam/utils/retry.py",> line 236, in wrapper
return fun(*args, **kwargs)
File "<https://ci-beam.apache.org/job/beam_PostCommit_Python37/ws/src/sdks/python/apache_beam/runners/portability/stager.py",> line 558, in _populate_requirements_cache
processes.check_output(cmd_args, stderr=processes.STDOUT)
File "<https://ci-beam.apache.org/job/beam_PostCommit_Python37/ws/src/sdks/python/apache_beam/utils/processes.py",> line 99, in check_output
.format(traceback.format_exc(), args[0][6], error.output))
RuntimeError: Full traceback: Traceback (most recent call last):
File "<https://ci-beam.apache.org/job/beam_PostCommit_Python37/ws/src/sdks/python/apache_beam/utils/processes.py",> line 91, in check_output
out = subprocess.check_output(*args, **kwargs)
File "/usr/lib/python3.7/subprocess.py", line 395, in check_output
**kwargs).stdout
File "/usr/lib/python3.7/subprocess.py", line 487, in run
output=stdout, stderr=stderr)
subprocess.CalledProcessError: Command '['<https://ci-beam.apache.org/job/beam_PostCommit_Python37/ws/src/build/gradleenv/-1734967052/bin/python',> '-m', 'pip', 'download', '--dest', '/tmp/dataflow-requirements-cache', '-r', 'postcommit_requirements.txt', '--exists-action', 'i', '--no-binary', ':all:']' returned non-zero exit status 1.
Pip install failed for package: -r
Output from execution of subprocess: b'Collecting pyhamcrest!=1.10.0,<2.0.0\n File was already downloaded /tmp/dataflow-requirements-cache/PyHamcrest-1.10.1.tar.gz\nCollecting mock<3.0.0\n File was already downloaded /tmp/dataflow-requirements-cache/mock-2.0.0.tar.gz\n ERROR: Command errored out with exit status 1:\n command: <https://ci-beam.apache.org/job/beam_PostCommit_Python37/ws/src/build/gradleenv/-1734967052/bin/python> -c \'import sys, setuptools, tokenize; sys.argv[0] = \'"\'"\'/tmp/pip-download-rgpz3mtr/mock/setup.py\'"\'"\'; __file__=\'"\'"\'/tmp/pip-download-rgpz3mtr/mock/setup.py\'"\'"\';f=getattr(tokenize, \'"\'"\'open\'"\'"\', open)(__file__);code=f.read().replace(\'"\'"\'\\r\\n\'"\'"\', \'"\'"\'\\n\'"\'"\');f.close();exec(compile(code, __file__, \'"\'"\'exec\'"\'"\'))\' egg_info --egg-base /tmp/pip-pip-egg-info-wc6c5wle\n cwd: /tmp/pip-download-rgpz3mtr/mock/\n Complete output (18 lines):\n <https://ci-beam.apache.org/job/beam_PostCommit_Python37/ws/src/build/gradleenv/-1734967052/lib/python3.7/site-packages/nose/plugins/manager.py>:395: RuntimeWarning: Unable to load plugin beam_test_plugin = test_config:BeamTestPlugin: No module named \'test_config\'\n RuntimeWarning)\n ERROR:root:Error parsing\n Traceback (most recent call last):\n File "<https://ci-beam.apache.org/job/beam_PostCommit_Python37/ws/src/build/gradleenv/-1734967052/lib/python3.7/site-packages/pbr/core.py",> line 96, in pbr\n attrs = util.cfg_to_args(path, dist.script_args)\n File "<https://ci-beam.apache.org/job/beam_PostCommit_Python37/ws/src/build/gradleenv/-1734967052/lib/python3.7/site-packages/pbr/util.py",> line 272, in cfg_to_args\n pbr.hooks.setup_hook(config)\n File "<https://ci-beam.apache.org/job/beam_PostCommit_Python37/ws/src/build/gradleenv/-1734967052/lib/python3.7/site-packages/pbr/hooks/__init__.py",> line 25, in setup_hook\n metadata_config.run()\n File "<https://ci-beam.apache.org/job/beam_PostCommit_Python37/ws/src/build/gradleenv/-1734967052/lib/python3.7/site-packages/pbr/hooks/base.py",> line 27, in run\n self.hook()\n File "<https://ci-beam.apache.org/job/beam_PostCommit_Python37/ws/src/build/gradleenv/-1734967052/lib/python3.7/site-packages/pbr/hooks/metadata.py",> line 26, in hook\n self.config[\'name\'], self.config.get(\'version\', None))\n File "<https://ci-beam.apache.org/job/beam_PostCommit_Python37/ws/src/build/gradleenv/-1734967052/lib/python3.7/site-packages/pbr/packaging.py",> line 876, in get_version\n name=package_name))\n Exception: Versioning for this project requires either an sdist tarball, or access to an upstream git repository. It\'s also possible that there is a mismatch between the package name in setup.cfg and the argument given to pbr.version.VersionInfo. Project name mock was given, but was not able to be found.\n error in setup command: Error parsing /tmp/pip-download-rgpz3mtr/mock/setup.cfg: Exception: Versioning for this project requires either an sdist tarball, or access to an upstream git repository. It\'s also possible that there is a mismatch between the package name in setup.cfg and the argument given to pbr.version.VersionInfo. Project name mock was given, but was not able to be found.\n ----------------------------------------\nERROR: Command errored out with exit status 1: python setup.py egg_info Check the logs for full command output.\n'
-------------------- >> begin captured logging << --------------------
apache_beam.runners.portability.stager: INFO: Executing command: ['<https://ci-beam.apache.org/job/beam_PostCommit_Python37/ws/src/build/gradleenv/-1734967052/bin/python',> '-m', 'pip', 'download', '--dest', '/tmp/dataflow-requirements-cache', '-r', 'postcommit_requirements.txt', '--exists-action', 'i', '--no-binary', ':all:']
--------------------- >> end captured logging << ---------------------
----------------------------------------------------------------------
XML: nosetests-postCommitIT-df-py37.xml
----------------------------------------------------------------------
XML: <https://ci-beam.apache.org/job/beam_PostCommit_Python37/ws/src/sdks/python/nosetests.xml>
----------------------------------------------------------------------
Ran 66 tests in 4078.908s
FAILED (SKIP=7, errors=1)
> Task :sdks:python:test-suites:dataflow:py37:postCommitIT FAILED
FAILURE: Build failed with an exception.
* Where:
Script '<https://ci-beam.apache.org/job/beam_PostCommit_Python37/ws/src/sdks/python/test-suites/dataflow/common.gradle'> line: 118
* What went wrong:
Execution failed for task ':sdks:python:test-suites:dataflow:py37:postCommitIT'.
> Process 'command 'sh'' finished with non-zero exit value 1
* Try:
Run with --stacktrace option to get the stack trace. Run with --info or --debug option to get more log output. Run with --scan to get full insights.
* Get more help at https://help.gradle.org
Deprecated Gradle features were used in this build, making it incompatible with Gradle 6.0.
Use '--warning-mode all' to show the individual deprecation warnings.
See https://docs.gradle.org/5.2.1/userguide/command_line_interface.html#sec:command_line_warnings
BUILD FAILED in 1h 10m 56s
171 actionable tasks: 131 executed, 36 from cache, 4 up-to-date
Publishing build scan...
https://gradle.com/s/vlc6jhk2ibjei
Build step 'Invoke Gradle script' changed build result to FAILURE
Build step 'Invoke Gradle script' marked build as failure
---------------------------------------------------------------------
To unsubscribe, e-mail: builds-unsubscribe@beam.apache.org
For additional commands, e-mail: builds-help@beam.apache.org
Jenkins build is back to normal : beam_PostCommit_Python37 #2807
Posted by Apache Jenkins Server <je...@builds.apache.org>.
See <https://ci-beam.apache.org/job/beam_PostCommit_Python37/2807/display/redirect>
---------------------------------------------------------------------
To unsubscribe, e-mail: builds-unsubscribe@beam.apache.org
For additional commands, e-mail: builds-help@beam.apache.org
Build failed in Jenkins: beam_PostCommit_Python37 #2806
Posted by Apache Jenkins Server <je...@builds.apache.org>.
See <https://ci-beam.apache.org/job/beam_PostCommit_Python37/2806/display/redirect>
Changes:
------------------------------------------
[...truncated 15.61 MB...]
"pipeline_proto_coder_id": "ref_Coder_FastPrimitivesCoder_6"
}
],
"is_pair_like": true,
"pipeline_proto_coder_id": "ref_Coder_FastPrimitivesCoder_6"
},
{
"@type": "kind:global_window"
}
],
"is_wrapper": true
},
"output_name": "None",
"user_name": "m_out.out"
}
],
"parallel_input": {
"@type": "OutputReference",
"output_name": "out",
"step_name": "s4"
},
"serialized_fn": "QlpoOTFBWSZTWWeYg/EAApJ/8H/////////////cwr///+ZjwCAAYEBAAvYZlAZGGqZKeap6nqaD1Bk2o9T9UeoGgAaAaDQaNPSeoaD1PUAGnqeoMj0gZNBKmiZNCYmI1J4mSbSYg0yZAAGgABoDQaABoNAyMgGmSIQ0pspptTYiDTTQNBgQyaAGIyAGg0Bp6BNqeoGgeoOAAAAAAAAAAaAAAAAAAAAADvptRksy3rYqqrRyJX2qH0NSOBctdVUdLQAm1Vh2UANxiG8xcsPs2/V+wqRYe1ULTTsFGP9a61H8xkkgE7und2KQKCYLXStXLn3eFthcDyETfV4UGFKZNeBBEHUSJLWyzBEAWMCthwxMLlv1cDyano9cgF8al+wdq5r/REAkG1Xg8aacyW/LCkBXoTuB4iGoncNkgf7kZTycpPhEogIUlcmUXbLXkkTvSvGWUVI8gorCTQi4qGCTsUwnjQkyt2ZyOO9OYuufzYucYr+tb6skz+fLbYmGltqvc0ZyO62U1BN/063ZqwM9sHukMYDtXzQzuCo6I8hcg9bN+uA5zVxEToRovLZIoOS0PpZ6DtewoIpXjNEHdMET2MhmBwtiJO/7kFGvRXCBJCR3E0VT+tlPoVcp7u8FEolFZEAQgtDOCFCYBounGasGioKCtPYuiTpMtBVhRemCeN1kw3xz7+O3HdpAYYCUXQKJCFvkypPA1qn+cbuIJzJofIN2BcCmDlvIBCstlwFz2aQYXYogZO/bA/V1tacCaIv1lmiMtOWCxQ22hA4/JeLrKatgfimoi1XTBYqKI1UlwpqoFFxMxI7eKk1vELwoiakO73oRuciOUowiTwDyilzBw1LIP03KHIxylREq0IIBlhEEIgRqAmRKSZspXcY8WJZc1S79gLtt2o65KoRUptqAP0C0mEjQrLUMMdcwvLxdDZ2YWF3a2YmEc6V3Flq/zGko0q1i7CE9F60VVmlLVbxGN1Kc8GIjGCmM2+eg7pKnM7xezfVKYmJBAxbGHNEIVArMrZhiGweBLCVomDBhtYxZft2DIMzallLUjBweKHOZYLJJaYlEbRaHX4A2iWd0kmIYgPGrVkkFdUkblNPWmlouz7UYWBJGThIYIMpTkP5/pJL782MpXbJs/HJr2mwipgUqF1LL6WhjchFIhEb70ijjxamTOr2EAb6pUqdP+qQ4F4FkIiHj/i7kinChIM8xB+I=",
"user_name": "m_out"
}
}
],
"type": "JOB_TYPE_BATCH"
}
INFO:apache_beam.runners.dataflow.internal.apiclient:Create job: <Job
createTime: '2020-09-06T01:05:38.395968Z'
currentStateTime: '1970-01-01T00:00:00Z'
id: '2020-09-05_18_05_36-16157204679181081886'
location: 'us-central1'
name: 'beamapp-jenkins-0906010530-174888'
projectId: 'apache-beam-testing'
stageStates: []
startTime: '2020-09-06T01:05:38.395968Z'
steps: []
tempFiles: []
type: TypeValueValuesEnum(JOB_TYPE_BATCH, 1)>
INFO:apache_beam.runners.dataflow.internal.apiclient:Created job with id: [2020-09-05_18_05_36-16157204679181081886]
INFO:apache_beam.runners.dataflow.internal.apiclient:Submitted job: 2020-09-05_18_05_36-16157204679181081886
INFO:apache_beam.runners.dataflow.internal.apiclient:To access the Dataflow monitoring console, please navigate to https://console.cloud.google.com/dataflow/jobs/us-central1/2020-09-05_18_05_36-16157204679181081886?project=apache-beam-testing
INFO:apache_beam.runners.dataflow.dataflow_runner:2020-09-06T01:05:38.399Z: JOB_MESSAGE_DETAILED: Workers have started successfully.
INFO:apache_beam.runners.dataflow.dataflow_runner:2020-09-06T01:05:38.432Z: JOB_MESSAGE_DETAILED: Workers have started successfully.
INFO:apache_beam.runners.dataflow.dataflow_runner:Job 2020-09-05_18_05_36-16157204679181081886 is in state JOB_STATE_RUNNING
INFO:apache_beam.runners.dataflow.dataflow_runner:2020-09-06T01:05:36.806Z: JOB_MESSAGE_DETAILED: Autoscaling is enabled for job 2020-09-05_18_05_36-16157204679181081886. The number of workers will be between 1 and 1000.
INFO:apache_beam.runners.dataflow.dataflow_runner:2020-09-06T01:05:36.806Z: JOB_MESSAGE_DETAILED: Autoscaling was automatically enabled for job 2020-09-05_18_05_36-16157204679181081886.
INFO:apache_beam.runners.dataflow.dataflow_runner:2020-09-06T01:05:40.975Z: JOB_MESSAGE_BASIC: Worker configuration: n1-standard-1 in us-central1-a.
INFO:apache_beam.runners.dataflow.dataflow_runner:2020-09-06T01:05:41.747Z: JOB_MESSAGE_DETAILED: Expanding CoGroupByKey operations into optimizable parts.
INFO:apache_beam.runners.dataflow.dataflow_runner:2020-09-06T01:05:41.775Z: JOB_MESSAGE_DEBUG: Combiner lifting skipped for step GroupByKey: GroupByKey not followed by a combiner.
INFO:apache_beam.runners.dataflow.dataflow_runner:2020-09-06T01:05:41.813Z: JOB_MESSAGE_DETAILED: Expanding GroupByKey operations into optimizable parts.
INFO:apache_beam.runners.dataflow.dataflow_runner:2020-09-06T01:05:41.841Z: JOB_MESSAGE_DETAILED: Lifting ValueCombiningMappingFns into MergeBucketsMappingFns
INFO:apache_beam.runners.dataflow.dataflow_runner:2020-09-06T01:05:41.901Z: JOB_MESSAGE_DEBUG: Annotating graph with Autotuner information.
INFO:apache_beam.runners.dataflow.dataflow_runner:2020-09-06T01:05:41.949Z: JOB_MESSAGE_DETAILED: Fusing adjacent ParDo, Read, Write, and Flatten operations
INFO:apache_beam.runners.dataflow.dataflow_runner:2020-09-06T01:05:41.983Z: JOB_MESSAGE_DETAILED: Fusing consumer metrics into Create/Read
INFO:apache_beam.runners.dataflow.dataflow_runner:2020-09-06T01:05:42.020Z: JOB_MESSAGE_DETAILED: Fusing consumer map_to_common_key into metrics
INFO:apache_beam.runners.dataflow.dataflow_runner:2020-09-06T01:05:42.047Z: JOB_MESSAGE_DETAILED: Fusing consumer GroupByKey/Reify into map_to_common_key
INFO:apache_beam.runners.dataflow.dataflow_runner:2020-09-06T01:05:42.070Z: JOB_MESSAGE_DETAILED: Fusing consumer GroupByKey/Write into GroupByKey/Reify
INFO:apache_beam.runners.dataflow.dataflow_runner:2020-09-06T01:05:42.090Z: JOB_MESSAGE_DETAILED: Fusing consumer GroupByKey/GroupByWindow into GroupByKey/Read
INFO:apache_beam.runners.dataflow.dataflow_runner:2020-09-06T01:05:42.118Z: JOB_MESSAGE_DETAILED: Fusing consumer m_out into GroupByKey/GroupByWindow
INFO:apache_beam.runners.dataflow.dataflow_runner:2020-09-06T01:05:42.154Z: JOB_MESSAGE_DEBUG: Workflow config is missing a default resource spec.
INFO:apache_beam.runners.dataflow.dataflow_runner:2020-09-06T01:05:42.190Z: JOB_MESSAGE_DEBUG: Adding StepResource setup and teardown to workflow graph.
INFO:apache_beam.runners.dataflow.dataflow_runner:2020-09-06T01:05:42.223Z: JOB_MESSAGE_DEBUG: Adding workflow start and stop steps.
INFO:apache_beam.runners.dataflow.dataflow_runner:2020-09-06T01:05:42.257Z: JOB_MESSAGE_DEBUG: Assigning stage ids.
INFO:apache_beam.runners.dataflow.dataflow_runner:2020-09-06T01:05:42.428Z: JOB_MESSAGE_DEBUG: Executing wait step start13
INFO:apache_beam.runners.dataflow.dataflow_runner:2020-09-06T01:05:42.485Z: JOB_MESSAGE_BASIC: Executing operation GroupByKey/Create
INFO:apache_beam.runners.dataflow.dataflow_runner:2020-09-06T01:05:42.524Z: JOB_MESSAGE_DEBUG: Starting worker pool setup.
INFO:apache_beam.runners.dataflow.dataflow_runner:2020-09-06T01:05:42.560Z: JOB_MESSAGE_BASIC: Starting 1 workers in us-central1-a...
INFO:apache_beam.runners.dataflow.dataflow_runner:2020-09-06T01:05:42.595Z: JOB_MESSAGE_BASIC: Finished operation GroupByKey/Create
INFO:apache_beam.runners.dataflow.dataflow_runner:2020-09-06T01:05:42.656Z: JOB_MESSAGE_DEBUG: Value "GroupByKey/Session" materialized.
INFO:apache_beam.runners.dataflow.dataflow_runner:2020-09-06T01:05:42.727Z: JOB_MESSAGE_BASIC: Executing operation Create/Read+metrics+map_to_common_key+GroupByKey/Reify+GroupByKey/Write
INFO:apache_beam.runners.dataflow.dataflow_runner:2020-09-06T01:05:54.630Z: JOB_MESSAGE_WARNING: Your project already contains 100 Dataflow-created metric descriptors and Stackdriver will not create new Dataflow custom metrics for this job. Each unique user-defined metric name (independent of the DoFn in which it is defined) produces a new metric descriptor. To delete old / unused metric descriptors see https://developers.google.com/apis-explorer/#p/monitoring/v3/monitoring.projects.metricDescriptors.list and https://developers.google.com/apis-explorer/#p/monitoring/v3/monitoring.projects.metricDescriptors.delete
INFO:apache_beam.runners.dataflow.dataflow_runner:2020-09-06T01:05:58.891Z: JOB_MESSAGE_DETAILED: Workers have started successfully.
INFO:apache_beam.runners.dataflow.dataflow_runner:2020-09-06T01:05:58.922Z: JOB_MESSAGE_DETAILED: Workers have started successfully.
INFO:apache_beam.runners.dataflow.dataflow_runner:2020-09-06T01:06:10.656Z: JOB_MESSAGE_DETAILED: Autoscaling: Raised the number of workers to 1 based on the rate of progress in the currently running stage(s).
INFO:apache_beam.runners.dataflow.dataflow_runner:2020-09-06T01:08:13.275Z: JOB_MESSAGE_DETAILED: Workers have started successfully.
INFO:apache_beam.runners.dataflow.dataflow_runner:2020-09-06T01:08:13.311Z: JOB_MESSAGE_DETAILED: Workers have started successfully.
INFO:apache_beam.runners.dataflow.dataflow_runner:2020-09-06T01:08:46.858Z: JOB_MESSAGE_BASIC: Finished operation Create/Read+InspectForDetails/ParDo(_InspectFn)+ParDo(CallableWrapperDoFn)/ParDo(CallableWrapperDoFn)+Type matches/WindowInto(WindowIntoFn)+Type matches/ToVoidKey+Type matches/Group/pair_with_1+Type matches/Group/GroupByKey/Reify+Type matches/Group/GroupByKey/Write
INFO:apache_beam.runners.dataflow.dataflow_runner:2020-09-06T01:08:48.972Z: JOB_MESSAGE_BASIC: Finished operation Type matches/Create/Read+Type matches/Group/pair_with_0+Type matches/Group/GroupByKey/Reify+Type matches/Group/GroupByKey/Write
INFO:apache_beam.runners.dataflow.dataflow_runner:2020-09-06T01:08:49.066Z: JOB_MESSAGE_BASIC: Executing operation Type matches/Group/GroupByKey/Close
INFO:apache_beam.runners.dataflow.dataflow_runner:2020-09-06T01:08:49.117Z: JOB_MESSAGE_BASIC: Finished operation Type matches/Group/GroupByKey/Close
INFO:apache_beam.runners.dataflow.dataflow_runner:2020-09-06T01:08:49.178Z: JOB_MESSAGE_BASIC: Executing operation Type matches/Group/GroupByKey/Read+Type matches/Group/GroupByKey/GroupByWindow+Type matches/Group/Map(_merge_tagged_vals_under_key)+Type matches/Unkey+Type matches/Match
INFO:apache_beam.runners.dataflow.dataflow_runner:2020-09-06T01:08:57.967Z: JOB_MESSAGE_BASIC: Executing BigQuery import job "dataflow_job_13207546698108790988". You can check its status with the bq tool: "bq show -j --project_id=apache-beam-testing dataflow_job_13207546698108790988".
INFO:apache_beam.runners.dataflow.dataflow_runner:2020-09-06T01:08:56.599Z: JOB_MESSAGE_BASIC: Finished operation Type matches/Group/GroupByKey/Read+Type matches/Group/GroupByKey/GroupByWindow+Type matches/Group/Map(_merge_tagged_vals_under_key)+Type matches/Unkey+Type matches/Match
INFO:apache_beam.runners.dataflow.dataflow_runner:2020-09-06T01:08:56.673Z: JOB_MESSAGE_DEBUG: Executing success step success19
INFO:apache_beam.runners.dataflow.dataflow_runner:2020-09-06T01:08:56.745Z: JOB_MESSAGE_DETAILED: Cleaning up.
INFO:apache_beam.runners.dataflow.dataflow_runner:2020-09-06T01:08:56.789Z: JOB_MESSAGE_DEBUG: Starting worker pool teardown.
INFO:apache_beam.runners.dataflow.dataflow_runner:2020-09-06T01:08:56.823Z: JOB_MESSAGE_BASIC: Stopping worker pool...
INFO:apache_beam.runners.dataflow.dataflow_runner:2020-09-06T01:09:08.737Z: JOB_MESSAGE_BASIC: BigQuery import job "dataflow_job_13207546698108790988" done.
INFO:apache_beam.runners.dataflow.dataflow_runner:2020-09-06T01:09:09.489Z: JOB_MESSAGE_BASIC: Finished operation read+write/NativeWrite
INFO:apache_beam.runners.dataflow.dataflow_runner:2020-09-06T01:09:09.618Z: JOB_MESSAGE_DEBUG: Executing success step success1
INFO:apache_beam.runners.dataflow.dataflow_runner:2020-09-06T01:09:09.691Z: JOB_MESSAGE_DETAILED: Cleaning up.
INFO:apache_beam.runners.dataflow.dataflow_runner:2020-09-06T01:09:09.864Z: JOB_MESSAGE_DEBUG: Starting worker pool teardown.
INFO:apache_beam.runners.dataflow.dataflow_runner:2020-09-06T01:09:09.893Z: JOB_MESSAGE_BASIC: Stopping worker pool...
INFO:apache_beam.runners.dataflow.dataflow_runner:2020-09-06T01:09:21.256Z: JOB_MESSAGE_BASIC: Finished operation Create/Read+ExternalTransform(simple)/Map(<lambda at external_it_test.py:43>)+assert_that/WindowInto(WindowIntoFn)+assert_that/ToVoidKey+assert_that/Group/pair_with_1+assert_that/Group/GroupByKey/Reify+assert_that/Group/GroupByKey/Write
INFO:apache_beam.runners.dataflow.dataflow_runner:2020-09-06T01:09:24.370Z: JOB_MESSAGE_BASIC: Finished operation assert_that/Create/Read+assert_that/Group/pair_with_0+assert_that/Group/GroupByKey/Reify+assert_that/Group/GroupByKey/Write
INFO:apache_beam.runners.dataflow.dataflow_runner:2020-09-06T01:09:24.432Z: JOB_MESSAGE_BASIC: Executing operation assert_that/Group/GroupByKey/Close
INFO:apache_beam.runners.dataflow.dataflow_runner:2020-09-06T01:09:24.480Z: JOB_MESSAGE_BASIC: Finished operation assert_that/Group/GroupByKey/Close
INFO:apache_beam.runners.dataflow.dataflow_runner:2020-09-06T01:09:24.540Z: JOB_MESSAGE_BASIC: Executing operation assert_that/Group/GroupByKey/Read+assert_that/Group/GroupByKey/GroupByWindow+assert_that/Group/Map(_merge_tagged_vals_under_key)+assert_that/Unkey+assert_that/Match
INFO:apache_beam.runners.dataflow.dataflow_runner:2020-09-06T01:09:33.746Z: JOB_MESSAGE_BASIC: Finished operation assert_that/Group/GroupByKey/Read+assert_that/Group/GroupByKey/GroupByWindow+assert_that/Group/Map(_merge_tagged_vals_under_key)+assert_that/Unkey+assert_that/Match
INFO:apache_beam.runners.dataflow.dataflow_runner:2020-09-06T01:09:33.812Z: JOB_MESSAGE_DEBUG: Executing success step success19
INFO:apache_beam.runners.dataflow.dataflow_runner:2020-09-06T01:09:33.886Z: JOB_MESSAGE_DETAILED: Cleaning up.
INFO:apache_beam.runners.dataflow.dataflow_runner:2020-09-06T01:09:33.934Z: JOB_MESSAGE_DEBUG: Starting worker pool teardown.
INFO:apache_beam.runners.dataflow.dataflow_runner:2020-09-06T01:09:33.964Z: JOB_MESSAGE_BASIC: Stopping worker pool...
INFO:apache_beam.runners.dataflow.dataflow_runner:2020-09-06T01:09:46.581Z: JOB_MESSAGE_DETAILED: Autoscaling: Resized worker pool from 1 to 0.
INFO:apache_beam.runners.dataflow.dataflow_runner:2020-09-06T01:09:46.622Z: JOB_MESSAGE_BASIC: Worker pool stopped.
INFO:apache_beam.runners.dataflow.dataflow_runner:2020-09-06T01:09:46.656Z: JOB_MESSAGE_DEBUG: Tearing down pending resources...
INFO:apache_beam.runners.dataflow.dataflow_runner:Job 2020-09-05_18_03_01-15169284252007985362 is in state JOB_STATE_DONE
INFO:apache_beam.runners.dataflow.dataflow_runner:2020-09-06T01:10:03.800Z: JOB_MESSAGE_DETAILED: Autoscaling: Resized worker pool from 1 to 0.
INFO:apache_beam.runners.dataflow.dataflow_runner:2020-09-06T01:10:03.845Z: JOB_MESSAGE_BASIC: Worker pool stopped.
INFO:apache_beam.runners.dataflow.dataflow_runner:2020-09-06T01:10:03.880Z: JOB_MESSAGE_DEBUG: Tearing down pending resources...
INFO:apache_beam.runners.dataflow.dataflow_runner:Job 2020-09-05_18_03_25-4889680441208418919 is in state JOB_STATE_DONE
INFO:apache_beam.io.gcp.tests.bigquery_matcher:Attempting to perform query SELECT fruit from `python_query_to_table_15993541956155.output_table`; to BQ
DEBUG:google.auth._default:Checking None for explicit credentials as part of auth process...
DEBUG:google.auth._default:Checking Cloud SDK credentials as part of auth process...
DEBUG:google.auth._default:Cloud SDK credentials not found on disk; not using them
DEBUG:google.auth._default:Checking for App Engine runtime as part of auth process...
DEBUG:google.auth._default:No App Engine library was found so cannot authentication via App Engine Identity Credentials.
DEBUG:google.auth.transport._http_client:Making request: GET http://169.254.169.254
DEBUG:google.auth.transport._http_client:Making request: GET http://metadata.google.internal/computeMetadata/v1/project/project-id
DEBUG:urllib3.util.retry:Converted retries value: 3 -> Retry(total=3, connect=None, read=None, redirect=None, status=None)
DEBUG:google.auth.transport.requests:Making request: GET http://metadata.google.internal/computeMetadata/v1/instance/service-accounts/default/?recursive=true
DEBUG:urllib3.connectionpool:Starting new HTTP connection (1): metadata.google.internal:80
DEBUG:urllib3.connectionpool:http://metadata.google.internal:80 "GET /computeMetadata/v1/instance/service-accounts/default/?recursive=true HTTP/1.1" 200 144
DEBUG:google.auth.transport.requests:Making request: GET http://metadata.google.internal/computeMetadata/v1/instance/service-accounts/844138762903-compute@developer.gserviceaccount.com/token
DEBUG:urllib3.connectionpool:http://metadata.google.internal:80 "GET /computeMetadata/v1/instance/service-accounts/844138762903-compute@developer.gserviceaccount.com/token HTTP/1.1" 200 221
DEBUG:urllib3.connectionpool:Starting new HTTPS connection (1): bigquery.googleapis.com:443
DEBUG:urllib3.connectionpool:https://bigquery.googleapis.com:443 "POST /bigquery/v2/projects/apache-beam-testing/jobs HTTP/1.1" 200 None
DEBUG:urllib3.connectionpool:https://bigquery.googleapis.com:443 "GET /bigquery/v2/projects/apache-beam-testing/queries/8a83cc4c-1ba0-46b5-88b8-74165806b74e?maxResults=0&location=US HTTP/1.1" 200 None
DEBUG:urllib3.connectionpool:https://bigquery.googleapis.com:443 "GET /bigquery/v2/projects/apache-beam-testing/datasets/_7357fab0f784d2a7327ddbe81cdd1f4ca7e429cd/tables/anondb1a185f1112eceaad380288510abaef3d63cb70/data HTTP/1.1" 200 None
INFO:apache_beam.io.gcp.tests.bigquery_matcher:Read from given query (SELECT fruit from `python_query_to_table_15993541956155.output_table`;), total rows 2
INFO:apache_beam.io.gcp.tests.bigquery_matcher:Generate checksum: 158a8ea1c254fcf40d4ed3e7c0242c3ea0a29e72
INFO:apache_beam.runners.dataflow.dataflow_runner:2020-09-06T01:10:37.455Z: JOB_MESSAGE_DETAILED: Autoscaling: Resized worker pool from 1 to 0.
INFO:apache_beam.runners.dataflow.dataflow_runner:2020-09-06T01:10:37.503Z: JOB_MESSAGE_BASIC: Worker pool stopped.
INFO:apache_beam.runners.dataflow.dataflow_runner:2020-09-06T01:10:37.538Z: JOB_MESSAGE_DEBUG: Tearing down pending resources...
INFO:apache_beam.runners.dataflow.dataflow_runner:Job 2020-09-05_18_03_28-15830784340263647761 is in state JOB_STATE_DONE
INFO:apache_beam.runners.dataflow.dataflow_runner:2020-09-06T01:11:59.444Z: JOB_MESSAGE_BASIC: Finished operation Create/Read+metrics+map_to_common_key+GroupByKey/Reify+GroupByKey/Write
INFO:apache_beam.runners.dataflow.dataflow_runner:2020-09-06T01:11:59.536Z: JOB_MESSAGE_BASIC: Executing operation GroupByKey/Close
INFO:apache_beam.runners.dataflow.dataflow_runner:2020-09-06T01:11:59.589Z: JOB_MESSAGE_BASIC: Finished operation GroupByKey/Close
INFO:apache_beam.runners.dataflow.dataflow_runner:2020-09-06T01:11:59.659Z: JOB_MESSAGE_BASIC: Executing operation GroupByKey/Read+GroupByKey/GroupByWindow+m_out
INFO:apache_beam.runners.dataflow.dataflow_runner:2020-09-06T01:12:08.751Z: JOB_MESSAGE_BASIC: Finished operation GroupByKey/Read+GroupByKey/GroupByWindow+m_out
INFO:apache_beam.runners.dataflow.dataflow_runner:2020-09-06T01:12:08.851Z: JOB_MESSAGE_DEBUG: Executing success step success11
INFO:apache_beam.runners.dataflow.dataflow_runner:2020-09-06T01:12:08.921Z: JOB_MESSAGE_DETAILED: Cleaning up.
INFO:apache_beam.runners.dataflow.dataflow_runner:2020-09-06T01:12:08.974Z: JOB_MESSAGE_DEBUG: Starting worker pool teardown.
INFO:apache_beam.runners.dataflow.dataflow_runner:2020-09-06T01:12:09.009Z: JOB_MESSAGE_BASIC: Stopping worker pool...
INFO:apache_beam.runners.dataflow.dataflow_runner:2020-09-06T01:13:01.681Z: JOB_MESSAGE_DETAILED: Autoscaling: Resized worker pool from 1 to 0.
INFO:apache_beam.runners.dataflow.dataflow_runner:2020-09-06T01:13:01.728Z: JOB_MESSAGE_BASIC: Worker pool stopped.
INFO:apache_beam.runners.dataflow.dataflow_runner:2020-09-06T01:13:01.766Z: JOB_MESSAGE_DEBUG: Tearing down pending resources...
INFO:apache_beam.runners.dataflow.dataflow_runner:Job 2020-09-05_18_05_36-16157204679181081886 is in state JOB_STATE_DONE
test_autocomplete_it (apache_beam.examples.complete.autocomplete_test.AutocompleteTest) ... ok
test_streaming_wordcount_debugging_it (apache_beam.examples.streaming_wordcount_debugging_it_test.StreamingWordcountDebuggingIT) ... SKIP: Skipped due to [BEAM-3377]: assert_that not working for streaming
test_datastore_wordcount_it (apache_beam.examples.cookbook.datastore_wordcount_it_test.DatastoreWordCountIT) ... ok
test_bigquery_tornadoes_it (apache_beam.examples.cookbook.bigquery_tornadoes_it_test.BigqueryTornadoesIT) ... ok
test_leader_board_it (apache_beam.examples.complete.game.leader_board_it_test.LeaderBoardIT) ... ok
test_game_stats_it (apache_beam.examples.complete.game.game_stats_it_test.GameStatsIT) ... ok
test_streaming_wordcount_it (apache_beam.examples.streaming_wordcount_it_test.StreamingWordCountIT) ... ok
test_wordcount_it (apache_beam.examples.wordcount_it_test.WordCountIT) ... ok
test_wordcount_fnapi_it (apache_beam.examples.wordcount_it_test.WordCountIT) ... ok
test_user_score_it (apache_beam.examples.complete.game.user_score_it_test.UserScoreIT) ... ok
test_hourly_team_score_it (apache_beam.examples.complete.game.hourly_team_score_it_test.HourlyTeamScoreIT) ... ok
test_avro_it (apache_beam.examples.fastavro_it_test.FastavroIT) ... ok
test_read_via_sql (apache_beam.io.gcp.experimental.spannerio_read_it_test.SpannerReadIntegrationTest) ... ok
test_read_via_table (apache_beam.io.gcp.experimental.spannerio_read_it_test.SpannerReadIntegrationTest) ... ok
test_iobase_source (apache_beam.io.gcp.bigquery_read_it_test.ReadNewTypesTests) ... ok
test_native_source (apache_beam.io.gcp.bigquery_read_it_test.ReadNewTypesTests) ... ok
test_bigquery_read_1M_python (apache_beam.io.gcp.bigquery_io_read_it_test.BigqueryIOReadIT) ... ok
test_bigquery_read_custom_1M_python (apache_beam.io.gcp.bigquery_io_read_it_test.BigqueryIOReadIT) ... ok
test_iobase_source (apache_beam.io.gcp.bigquery_read_it_test.ReadTests) ... ok
test_native_source (apache_beam.io.gcp.bigquery_read_it_test.ReadTests) ... ok
test_bqfl_streaming (apache_beam.io.gcp.bigquery_file_loads_test.BigQueryFileLoadsIT) ... SKIP: TestStream is not supported on TestDataflowRunner
test_multiple_destinations_transform (apache_beam.io.gcp.bigquery_file_loads_test.BigQueryFileLoadsIT) ... ok
test_one_job_fails_all_jobs_fail (apache_beam.io.gcp.bigquery_file_loads_test.BigQueryFileLoadsIT) ... ok
test_avro_file_load (apache_beam.io.gcp.bigquery_test.BigQueryFileLoadsIntegrationTests) ... ok
test_spanner_error (apache_beam.io.gcp.experimental.spannerio_write_it_test.SpannerWriteIntegrationTest) ... ok
test_spanner_update (apache_beam.io.gcp.experimental.spannerio_write_it_test.SpannerWriteIntegrationTest) ... ok
test_write_batches (apache_beam.io.gcp.experimental.spannerio_write_it_test.SpannerWriteIntegrationTest) ... ok
test_copy (apache_beam.io.gcp.gcsio_integration_test.GcsIOIntegrationTest) ... ok
test_copy_batch (apache_beam.io.gcp.gcsio_integration_test.GcsIOIntegrationTest) ... ok
test_copy_batch_kms (apache_beam.io.gcp.gcsio_integration_test.GcsIOIntegrationTest) ... ok
test_copy_batch_rewrite_token (apache_beam.io.gcp.gcsio_integration_test.GcsIOIntegrationTest) ... ok
test_copy_kms (apache_beam.io.gcp.gcsio_integration_test.GcsIOIntegrationTest) ... ok
test_copy_rewrite_token (apache_beam.io.gcp.gcsio_integration_test.GcsIOIntegrationTest) ... ok
test_multiple_destinations_transform (apache_beam.io.gcp.bigquery_test.BigQueryStreamingInsertTransformIntegrationTests) ... ok
test_value_provider_transform (apache_beam.io.gcp.bigquery_test.BigQueryStreamingInsertTransformIntegrationTests) ... ok
test_datastore_write_limit (apache_beam.io.gcp.datastore.v1new.datastore_write_it_test.DatastoreWriteIT) ... ok
test_transform_on_gcs (apache_beam.io.fileio_test.MatchIntegrationTest) ... ok
test_parquetio_it (apache_beam.io.parquetio_it_test.TestParquetIT) ... ok
test_file_loads (apache_beam.io.gcp.bigquery_test.PubSubBigQueryIT) ... SKIP: https://issuetracker.google.com/issues/118375066
test_streaming_inserts (apache_beam.io.gcp.bigquery_test.PubSubBigQueryIT) ... ok
test_dicom_search_instances (apache_beam.io.gcp.dicomio_integration_test.DICOMIoIntegrationTest) ... ok
test_dicom_store_instance_from_gcs (apache_beam.io.gcp.dicomio_integration_test.DICOMIoIntegrationTest) ... ok
test_streaming_data_only (apache_beam.io.gcp.pubsub_integration_test.PubSubIntegrationTest) ... ok
test_streaming_with_attributes (apache_beam.io.gcp.pubsub_integration_test.PubSubIntegrationTest) ... ok
test_analyzing_syntax (apache_beam.ml.gcp.naturallanguageml_test_it.NaturalLanguageMlTestIT) ... ok
test_text_detection_with_language_hint (apache_beam.ml.gcp.visionml_test_it.VisionMlTestIT) ... ok
test_basic_execution (apache_beam.testing.test_stream_it_test.TestStreamIntegrationTests) ... SKIP: The "TestDataflowRunner", does not support the TestStream transform. Supported runners: ['DirectRunner', 'SwitchingDirectRunner']
Tests that the TestStream supports emitting to multiple PCollections. ... SKIP: The "TestDataflowRunner", does not support the TestStream transform. Supported runners: ['DirectRunner', 'SwitchingDirectRunner']
Tests that the TestStream can independently control output watermarks. ... SKIP: The "TestDataflowRunner", does not support the TestStream transform. Supported runners: ['DirectRunner', 'SwitchingDirectRunner']
test_big_query_write (apache_beam.io.gcp.bigquery_write_it_test.BigQueryWriteIntegrationTests) ... ok
test_big_query_write_new_types (apache_beam.io.gcp.bigquery_write_it_test.BigQueryWriteIntegrationTests) ... ok
test_big_query_write_schema_autodetect (apache_beam.io.gcp.bigquery_write_it_test.BigQueryWriteIntegrationTests) ... SKIP: DataflowRunner does not support schema autodetection
test_big_query_write_without_schema (apache_beam.io.gcp.bigquery_write_it_test.BigQueryWriteIntegrationTests) ... ok
test_label_detection_with_video_context (apache_beam.ml.gcp.videointelligenceml_test_it.VideoIntelligenceMlTestIT) ... ok
Runs streaming Dataflow job and verifies that user metrics are reported ... ok
test_deidentification (apache_beam.ml.gcp.cloud_dlp_it_test.CloudDLPIT) ... ok
test_inspection (apache_beam.ml.gcp.cloud_dlp_it_test.CloudDLPIT) ... ok
test_big_query_legacy_sql (apache_beam.io.gcp.big_query_query_to_table_it_test.BigQueryQueryToTableIT) ... ok
test_big_query_new_types (apache_beam.io.gcp.big_query_query_to_table_it_test.BigQueryQueryToTableIT) ... ok
test_big_query_new_types_avro (apache_beam.io.gcp.big_query_query_to_table_it_test.BigQueryQueryToTableIT) ... ok
test_big_query_new_types_native (apache_beam.io.gcp.big_query_query_to_table_it_test.BigQueryQueryToTableIT) ... ok
test_big_query_standard_sql (apache_beam.io.gcp.big_query_query_to_table_it_test.BigQueryQueryToTableIT) ... ok
test_big_query_standard_sql_kms_key_native (apache_beam.io.gcp.big_query_query_to_table_it_test.BigQueryQueryToTableIT) ... ok
test_job_python_from_python_it (apache_beam.transforms.external_it_test.ExternalTransformIT) ... ok
test_metrics_fnapi_it (apache_beam.runners.dataflow.dataflow_exercise_metrics_pipeline_test.ExerciseMetricsPipelineTest) ... ok
test_metrics_it (apache_beam.runners.dataflow.dataflow_exercise_metrics_pipeline_test.ExerciseMetricsPipelineTest) ... ok
----------------------------------------------------------------------
XML: nosetests-postCommitIT-df-py37.xml
----------------------------------------------------------------------
XML: <https://ci-beam.apache.org/job/beam_PostCommit_Python37/ws/src/sdks/python/nosetests.xml>
----------------------------------------------------------------------
Ran 66 tests in 4133.638s
OK (SKIP=7)
FAILURE: Build failed with an exception.
* What went wrong:
Execution failed for task ':release:go-licenses:java:dockerRun'.
> Process 'command 'docker'' finished with non-zero exit value 125
* Try:
Run with --stacktrace option to get the stack trace. Run with --info or --debug option to get more log output. Run with --scan to get full insights.
* Get more help at https://help.gradle.org
Deprecated Gradle features were used in this build, making it incompatible with Gradle 6.0.
Use '--warning-mode all' to show the individual deprecation warnings.
See https://docs.gradle.org/5.2.1/userguide/command_line_interface.html#sec:command_line_warnings
BUILD FAILED in 1h 12m 58s
167 actionable tasks: 127 executed, 36 from cache, 4 up-to-date
Publishing build scan...
https://gradle.com/s/f4vnjdv6p6ork
Build step 'Invoke Gradle script' changed build result to FAILURE
Build step 'Invoke Gradle script' marked build as failure
---------------------------------------------------------------------
To unsubscribe, e-mail: builds-unsubscribe@beam.apache.org
For additional commands, e-mail: builds-help@beam.apache.org