You are viewing a plain text version of this content. The canonical link for it is here.
Posted to builds@cassandra.apache.org by Apache Jenkins Server <je...@builds.apache.org> on 2022/01/21 02:30:10 UTC

Build complete: Cassandra-trunk #912 [UNSTABLE] 9577fd36d681266ea2d4758c51ed506e940d0d0e

-------------------------------------------------------------------------------
Build Cassandra-trunk #912 Unstable
URL: https://ci-cassandra.apache.org/job/Cassandra-trunk/912/
-------------------------------------------------------------------------------
Changes:
[Brandon Williams] Remove path for unused geomet package in cqlsh


-------------------------------------------------------------------------------
Failed Tests:
15 tests failed.
FAILED:  dtest.cqlsh_tests.test_cqlsh_copy.TestCqlshCopy.test_bulk_round_trip_with_timeouts
FAILED:  org.apache.cassandra.distributed.test.NetstatsBootstrapWithEntireSSTablesCompressionStreamingTest.testWithStreamingEntireSSTablesWithoutCompression
FAILED:  org.apache.cassandra.distributed.test.NetstatsRepairStreamingTest.testWithCompressionEnabled
FAILED:  org.apache.cassandra.db.commitlog.CommitLogSegmentManagerCDCTest.testNonblockingShouldMaintainSteadyDiskUsage
FAILED:  org.apache.cassandra.db.commitlog.CommitLogSegmentManagerCDCTest.testNonblockingShouldMaintainSteadyDiskUsage
FAILED:  org.apache.cassandra.db.commitlog.CommitLogSegmentManagerCDCTest.testNonblockingShouldMaintainSteadyDiskUsage
FAILED:  org.apache.cassandra.db.commitlog.CommitLogSegmentManagerCDCTest.testNonblockingShouldMaintainSteadyDiskUsage
FAILED:  org.apache.cassandra.db.commitlog.CommitLogSegmentManagerCDCTest.testNonblockingShouldMaintainSteadyDiskUsage
FAILED:  org.apache.cassandra.db.compaction.DateTieredCompactionStrategyTest.testDropExpiredSSTables-compression
FAILED:  org.apache.cassandra.db.compaction.DateTieredCompactionStrategyTest.testFilterOldSSTables-compression
FAILED:  org.apache.cassandra.tools.BulkLoaderTest.testBulkLoader_WithArgs2-compression
FAILED:  dtest-upgrade.upgrade_tests.upgrade_through_versions_test.TestProtoV3Upgrade_AllVersions_EndsAt_3_11_X.test_rolling_upgrade
FAILED:  dtest-upgrade.upgrade_tests.upgrade_through_versions_test.TestProtoV3Upgrade_AllVersions_EndsAt_3_11_X.test_rolling_upgrade_with_internode_ssl
FAILED:  dtest-upgrade.upgrade_tests.upgrade_through_versions_test.TestProtoV3Upgrade_AllVersions_RandomPartitioner_EndsAt_3_11_X_HEAD.test_rolling_upgrade
FAILED:  dtest-upgrade.upgrade_tests.upgrade_through_versions_test.TestProtoV3Upgrade_AllVersions_RandomPartitioner_EndsAt_3_11_X_HEAD.test_rolling_upgrade_with_internode_ssl

-------------------------------------------------------------------------------
For complete test report and logs see https://nightlies.apache.org/cassandra/Cassandra-trunk/912/