You are viewing a plain text version of this content. The canonical link for it is here.
Posted to issues@ambari.apache.org by "Mohammad Arshad (Jira)" <ji...@apache.org> on 2023/07/24 10:47:00 UTC

[jira] [Commented] (AMBARI-25974) Branch-2.7 metrics build is failing because some dependency versions are not available

    [ https://issues.apache.org/jira/browse/AMBARI-25974?page=com.atlassian.jira.plugin.system.issuetabpanels:comment-tabpanel&focusedCommentId=17746372#comment-17746372 ] 

Mohammad Arshad commented on AMBARI-25974:
------------------------------------------

Detailed log
{code:java}
INFO] ambari-utility 1.0.0.0-SNAPSHOT .................... SUCCESS [ 43.509 s]

[INFO] ambari-metrics 2.7.8.0.0 ........................... SUCCESS [  0.837 s]

[INFO] Ambari Metrics Common 2.7.8.0.0 .................... SUCCESS [ 29.457 s]

[INFO] Ambari Metrics Hadoop Sink 2.7.8.0.0 ............... FAILURE [01:38 min]

[INFO] Ambari Metrics Flume Sink 2.7.8.0.0 ................ SUCCESS [01:01 min]

[INFO] Ambari Metrics Kafka Sink 2.7.8.0.0 ................ SUCCESS [ 54.448 s]

[INFO] Ambari Metrics Storm Sink 2.7.8.0.0 ................ SUCCESS [ 54.939 s]

[INFO] Ambari Metrics Storm Sink (Legacy) 2.7.8.0.0 ....... FAILURE [  9.393 s]

[INFO] Ambari Metrics Collector 2.7.8.0.0 ................. FAILURE [06:29 min]

[INFO] Ambari Metrics Monitor 2.7.8.0.0 ................... SUCCESS [  2.709 s]

[INFO] Ambari Metrics Grafana 2.7.8.0.0 ................... SUCCESS [  4.659 s]

[INFO] Ambari Metrics Host Aggregator 2.7.8.0.0 ........... FAILURE [01:55 min]

[INFO] Ambari Metrics Assembly 2.7.8.0.0 .................. SKIPPED

[INFO] ------------------------------------------------------------------------

[INFO] BUILD FAILURE

[INFO] ------------------------------------------------------------------------

[INFO] Total time:  07:43 min (Wall Clock)

[INFO] Finished at: 2023-07-22T15:15:35Z

[INFO] ------------------------------------------------------------------------

[ERROR] Failed to execute goal on project ambari-metrics-storm-sink-legacy: Could not resolve dependencies for project org.apache.ambari:ambari-metrics-storm-sink-legacy:jar:2.7.8.0.0: The following artifacts could not be resolved: org.apache.storm:storm-core:jar:0.10.0.2.3.0.0-2557 (absent): Could not find artifact org.apache.storm:storm-core:jar:0.10.0.2.3.0.0-2557 in apache-hadoop (https://repo.hortonworks.com/content/groups/public/) -> [Help 1]

org.apache.maven.lifecycle.LifecycleExecutionException: Failed to execute goal on project ambari-metrics-storm-sink-legacy: Could not resolve dependencies for project org.apache.ambari:ambari-metrics-storm-sink-legacy:jar:2.7.8.0.0: The following artifacts could not be resolved: org.apache.storm:storm-core:jar:0.10.0.2.3.0.0-2557 (absent): Could not find artifact org.apache.storm:storm-core:jar:0.10.0.2.3.0.0-2557 in apache-hadoop (https://repo.hortonworks.com/content/groups/public/)

    at org.apache.maven.lifecycle.internal.LifecycleDependencyResolver.getDependencies (LifecycleDependencyResolver.java:243)

    at org.apache.maven.lifecycle.internal.LifecycleDependencyResolver.resolveProjectDependencies (LifecycleDependencyResolver.java:136)

    at org.apache.maven.lifecycle.internal.MojoExecutor.ensureDependenciesAreResolved (MojoExecutor.java:355)

    at org.apache.maven.lifecycle.internal.MojoExecutor.doExecute (MojoExecutor.java:313)

    at org.apache.maven.lifecycle.internal.MojoExecutor.execute (MojoExecutor.java:212)

    at org.apache.maven.lifecycle.internal.MojoExecutor.execute (MojoExecutor.java:174)

    at org.apache.maven.lifecycle.internal.MojoExecutor.access$000 (MojoExecutor.java:75)

    at org.apache.maven.lifecycle.internal.MojoExecutor$1.run (MojoExecutor.java:162)

    at org.apache.maven.plugin.DefaultMojosExecutionStrategy.execute (DefaultMojosExecutionStrategy.java:39)

    at org.apache.maven.lifecycle.internal.MojoExecutor.execute (MojoExecutor.java:159)

    at org.apache.maven.lifecycle.internal.LifecycleModuleBuilder.buildProject (LifecycleModuleBuilder.java:105)

    at org.apache.maven.lifecycle.internal.builder.multithreaded.MultiThreadedBuilder$1.call (MultiThreadedBuilder.java:193)

    at org.apache.maven.lifecycle.internal.builder.multithreaded.MultiThreadedBuilder$1.call (MultiThreadedBuilder.java:180)

    at java.util.concurrent.FutureTask.run (FutureTask.java:266)

    at java.util.concurrent.Executors$RunnableAdapter.call (Executors.java:511)

    at java.util.concurrent.FutureTask.run (FutureTask.java:266)

    at java.util.concurrent.ThreadPoolExecutor.runWorker (ThreadPoolExecutor.java:1149)

    at java.util.concurrent.ThreadPoolExecutor$Worker.run (ThreadPoolExecutor.java:624)

    at java.lang.Thread.run (Thread.java:750)

Caused by: org.apache.maven.project.DependencyResolutionException: Could not resolve dependencies for project org.apache.ambari:ambari-metrics-storm-sink-legacy:jar:2.7.8.0.0: The following artifacts could not be resolved: org.apache.storm:storm-core:jar:0.10.0.2.3.0.0-2557 (absent): Could not find artifact org.apache.storm:storm-core:jar:0.10.0.2.3.0.0-2557 in apache-hadoop (https://repo.hortonworks.com/content/groups/public/)

    at org.apache.maven.project.DefaultProjectDependenciesResolver.resolve (DefaultProjectDependenciesResolver.java:187)

    at org.apache.maven.lifecycle.internal.LifecycleDependencyResolver.getDependencies (LifecycleDependencyResolver.java:224)

    at org.apache.maven.lifecycle.internal.LifecycleDependencyResolver.resolveProjectDependencies (LifecycleDependencyResolver.java:136)

    at org.apache.maven.lifecycle.internal.MojoExecutor.ensureDependenciesAreResolved (MojoExecutor.java:355)

    at org.apache.maven.lifecycle.internal.MojoExecutor.doExecute (MojoExecutor.java:313)

    at org.apache.maven.lifecycle.internal.MojoExecutor.execute (MojoExecutor.java:212)

    at org.apache.maven.lifecycle.internal.MojoExecutor.execute (MojoExecutor.java:174)

    at org.apache.maven.lifecycle.internal.MojoExecutor.access$000 (MojoExecutor.java:75)

    at org.apache.maven.lifecycle.internal.MojoExecutor$1.run (MojoExecutor.java:162)

    at org.apache.maven.plugin.DefaultMojosExecutionStrategy.execute (DefaultMojosExecutionStrategy.java:39)

    at org.apache.maven.lifecycle.internal.MojoExecutor.execute (MojoExecutor.java:159)

    at org.apache.maven.lifecycle.internal.LifecycleModuleBuilder.buildProject (LifecycleModuleBuilder.java:105)

    at org.apache.maven.lifecycle.internal.builder.multithreaded.MultiThreadedBuilder$1.call (MultiThreadedBuilder.java:193)

    at org.apache.maven.lifecycle.internal.builder.multithreaded.MultiThreadedBuilder$1.call (MultiThreadedBuilder.java:180)

    at java.util.concurrent.FutureTask.run (FutureTask.java:266)

    at java.util.concurrent.Executors$RunnableAdapter.call (Executors.java:511)

    at java.util.concurrent.FutureTask.run (FutureTask.java:266)

    at java.util.concurrent.ThreadPoolExecutor.runWorker (ThreadPoolExecutor.java:1149)

    at java.util.concurrent.ThreadPoolExecutor$Worker.run (ThreadPoolExecutor.java:624)

    at java.lang.Thread.run (Thread.java:750)

Caused by: org.eclipse.aether.resolution.DependencyResolutionException: The following artifacts could not be resolved: org.apache.storm:storm-core:jar:0.10.0.2.3.0.0-2557 (absent): Could not find artifact org.apache.storm:storm-core:jar:0.10.0.2.3.0.0-2557 in apache-hadoop (https://repo.hortonworks.com/content/groups/public/)

    at org.eclipse.aether.internal.impl.DefaultRepositorySystem.resolveDependencies (DefaultRepositorySystem.java:364)

    at org.apache.maven.project.DefaultProjectDependenciesResolver.resolve (DefaultProjectDependenciesResolver.java:182)

    at org.apache.maven.lifecycle.internal.LifecycleDependencyResolver.getDependencies (LifecycleDependencyResolver.java:224)

    at org.apache.maven.lifecycle.internal.LifecycleDependencyResolver.resolveProjectDependencies (LifecycleDependencyResolver.java:136)

    at org.apache.maven.lifecycle.internal.MojoExecutor.ensureDependenciesAreResolved (MojoExecutor.java:355)

    at org.apache.maven.lifecycle.internal.MojoExecutor.doExecute (MojoExecutor.java:313)

    at org.apache.maven.lifecycle.internal.MojoExecutor.execute (MojoExecutor.java:212)

    at org.apache.maven.lifecycle.internal.MojoExecutor.execute (MojoExecutor.java:174)

    at org.apache.maven.lifecycle.internal.MojoExecutor.access$000 (MojoExecutor.java:75)

    at org.apache.maven.lifecycle.internal.MojoExecutor$1.run (MojoExecutor.java:162)

    at org.apache.maven.plugin.DefaultMojosExecutionStrategy.execute (DefaultMojosExecutionStrategy.java:39)

    at org.apache.maven.lifecycle.internal.MojoExecutor.execute (MojoExecutor.java:159)

    at org.apache.maven.lifecycle.internal.LifecycleModuleBuilder.buildProject (LifecycleModuleBuilder.java:105)

    at org.apache.maven.lifecycle.internal.builder.multithreaded.MultiThreadedBuilder$1.call (MultiThreadedBuilder.java:193)

    at org.apache.maven.lifecycle.internal.builder.multithreaded.MultiThreadedBuilder$1.call (MultiThreadedBuilder.java:180)

    at java.util.concurrent.FutureTask.run (FutureTask.java:266)

    at java.util.concurrent.Executors$RunnableAdapter.call (Executors.java:511)

    at java.util.concurrent.FutureTask.run (FutureTask.java:266)

    at java.util.concurrent.ThreadPoolExecutor.runWorker (ThreadPoolExecutor.java:1149)

    at java.util.concurrent.ThreadPoolExecutor$Worker.run (ThreadPoolExecutor.java:624)

    at java.lang.Thread.run (Thread.java:750)

Caused by: org.eclipse.aether.resolution.ArtifactResolutionException: The following artifacts could not be resolved: org.apache.storm:storm-core:jar:0.10.0.2.3.0.0-2557 (absent): Could not find artifact org.apache.storm:storm-core:jar:0.10.0.2.3.0.0-2557 in apache-hadoop (https://repo.hortonworks.com/content/groups/public/)

    at org.eclipse.aether.internal.impl.DefaultArtifactResolver.resolve (DefaultArtifactResolver.java:459)

    at org.eclipse.aether.internal.impl.DefaultArtifactResolver.resolveArtifacts (DefaultArtifactResolver.java:259)

    at org.eclipse.aether.internal.impl.DefaultRepositorySystem.resolveDependencies (DefaultRepositorySystem.java:352)

    at org.apache.maven.project.DefaultProjectDependenciesResolver.resolve (DefaultProjectDependenciesResolver.java:182)

    at org.apache.maven.lifecycle.internal.LifecycleDependencyResolver.getDependencies (LifecycleDependencyResolver.java:224)

    at org.apache.maven.lifecycle.internal.LifecycleDependencyResolver.resolveProjectDependencies (LifecycleDependencyResolver.java:136)

    at org.apache.maven.lifecycle.internal.MojoExecutor.ensureDependenciesAreResolved (MojoExecutor.java:355)

    at org.apache.maven.lifecycle.internal.MojoExecutor.doExecute (MojoExecutor.java:313)

    at org.apache.maven.lifecycle.internal.MojoExecutor.execute (MojoExecutor.java:212)

    at org.apache.maven.lifecycle.internal.MojoExecutor.execute (MojoExecutor.java:174)

    at org.apache.maven.lifecycle.internal.MojoExecutor.access$000 (MojoExecutor.java:75)

    at org.apache.maven.lifecycle.internal.MojoExecutor$1.run (MojoExecutor.java:162)

    at org.apache.maven.plugin.DefaultMojosExecutionStrategy.execute (DefaultMojosExecutionStrategy.java:39)

    at org.apache.maven.lifecycle.internal.MojoExecutor.execute (MojoExecutor.java:159)

    at org.apache.maven.lifecycle.internal.LifecycleModuleBuilder.buildProject (LifecycleModuleBuilder.java:105)

    at org.apache.maven.lifecycle.internal.builder.multithreaded.MultiThreadedBuilder$1.call (MultiThreadedBuilder.java:193)

    at org.apache.maven.lifecycle.internal.builder.multithreaded.MultiThreadedBuilder$1.call (MultiThreadedBuilder.java:180)

    at java.util.concurrent.FutureTask.run (FutureTask.java:266)

    at java.util.concurrent.Executors$RunnableAdapter.call (Executors.java:511)

    at java.util.concurrent.FutureTask.run (FutureTask.java:266)

    at java.util.concurrent.ThreadPoolExecutor.runWorker (ThreadPoolExecutor.java:1149)

    at java.util.concurrent.ThreadPoolExecutor$Worker.run (ThreadPoolExecutor.java:624)

    at java.lang.Thread.run (Thread.java:750)

Caused by: org.eclipse.aether.transfer.ArtifactNotFoundException: Could not find artifact org.apache.storm:storm-core:jar:0.10.0.2.3.0.0-2557 in apache-hadoop (https://repo.hortonworks.com/content/groups/public/)

    at org.eclipse.aether.connector.basic.ArtifactTransportListener.transferFailed (ArtifactTransportListener.java:42)

    at org.eclipse.aether.connector.basic.BasicRepositoryConnector$TaskRunner.run (BasicRepositoryConnector.java:417)

    at org.eclipse.aether.util.concurrency.RunnableErrorForwarder.lambda$wrap$0 (RunnableErrorForwarder.java:66)

    at java.util.concurrent.ThreadPoolExecutor.runWorker (ThreadPoolExecutor.java:1149)

    at java.util.concurrent.ThreadPoolExecutor$Worker.run (ThreadPoolExecutor.java:624)

    at java.lang.Thread.run (Thread.java:750)

[ERROR] Failed to execute goal on project ambari-metrics-hadoop-sink: Could not resolve dependencies for project org.apache.ambari:ambari-metrics-hadoop-sink:jar:2.7.8.0.0: The following artifacts could not be resolved: net.minidev:json-smart:jar:2.3 (present, but unavailable): Could not transfer artifact net.minidev:json-smart:jar:2.3 from/to apache-hadoop (https://repo.hortonworks.com/content/groups/public/): status code: 429, reason phrase: Too Many Requests (429) -> [Help 1]

org.apache.maven.lifecycle.LifecycleExecutionException: Failed to execute goal on project ambari-metrics-hadoop-sink: Could not resolve dependencies for project org.apache.ambari:ambari-metrics-hadoop-sink:jar:2.7.8.0.0: The following artifacts could not be resolved: net.minidev:json-smart:jar:2.3 (present, but unavailable): Could not transfer artifact net.minidev:json-smart:jar:2.3 from/to apache-hadoop (https://repo.hortonworks.com/content/groups/public/): status code: 429, reason phrase: Too Many Requests (429)

    at org.apache.maven.lifecycle.internal.LifecycleDependencyResolver.getDependencies (LifecycleDependencyResolver.java:243)

    at org.apache.maven.lifecycle.internal.LifecycleDependencyResolver.resolveProjectDependencies (LifecycleDependencyResolver.java:136)

    at org.apache.maven.lifecycle.internal.MojoExecutor.ensureDependenciesAreResolved (MojoExecutor.java:355)

    at org.apache.maven.lifecycle.internal.MojoExecutor.doExecute (MojoExecutor.java:313)

    at org.apache.maven.lifecycle.internal.MojoExecutor.execute (MojoExecutor.java:212)

    at org.apache.maven.lifecycle.internal.MojoExecutor.execute (MojoExecutor.java:174)

    at org.apache.maven.lifecycle.internal.MojoExecutor.access$000 (MojoExecutor.java:75)

    at org.apache.maven.lifecycle.internal.MojoExecutor$1.run (MojoExecutor.java:162)

    at org.apache.maven.plugin.DefaultMojosExecutionStrategy.execute (DefaultMojosExecutionStrategy.java:39)

    at org.apache.maven.lifecycle.internal.MojoExecutor.execute (MojoExecutor.java:159)

    at org.apache.maven.lifecycle.internal.LifecycleModuleBuilder.buildProject (LifecycleModuleBuilder.java:105)

    at org.apache.maven.lifecycle.internal.builder.multithreaded.MultiThreadedBuilder$1.call (MultiThreadedBuilder.java:193)

    at org.apache.maven.lifecycle.internal.builder.multithreaded.MultiThreadedBuilder$1.call (MultiThreadedBuilder.java:180)

    at java.util.concurrent.FutureTask.run (FutureTask.java:266)

    at java.util.concurrent.Executors$RunnableAdapter.call (Executors.java:511)

    at java.util.concurrent.FutureTask.run (FutureTask.java:266)

    at java.util.concurrent.ThreadPoolExecutor.runWorker (ThreadPoolExecutor.java:1149)

    at java.util.concurrent.ThreadPoolExecutor$Worker.run (ThreadPoolExecutor.java:624)

    at java.lang.Thread.run (Thread.java:750)

Caused by: org.apache.maven.project.DependencyResolutionException: Could not resolve dependencies for project org.apache.ambari:ambari-metrics-hadoop-sink:jar:2.7.8.0.0: The following artifacts could not be resolved: net.minidev:json-smart:jar:2.3 (present, but unavailable): Could not transfer artifact net.minidev:json-smart:jar:2.3 from/to apache-hadoop (https://repo.hortonworks.com/content/groups/public/): status code: 429, reason phrase: Too Many Requests (429)

    at org.apache.maven.project.DefaultProjectDependenciesResolver.resolve (DefaultProjectDependenciesResolver.java:187)

    at org.apache.maven.lifecycle.internal.LifecycleDependencyResolver.getDependencies (LifecycleDependencyResolver.java:224)

    at org.apache.maven.lifecycle.internal.LifecycleDependencyResolver.resolveProjectDependencies (LifecycleDependencyResolver.java:136)

    at org.apache.maven.lifecycle.internal.MojoExecutor.ensureDependenciesAreResolved (MojoExecutor.java:355)

    at org.apache.maven.lifecycle.internal.MojoExecutor.doExecute (MojoExecutor.java:313)

    at org.apache.maven.lifecycle.internal.MojoExecutor.execute (MojoExecutor.java:212)

    at org.apache.maven.lifecycle.internal.MojoExecutor.execute (MojoExecutor.java:174)

    at org.apache.maven.lifecycle.internal.MojoExecutor.access$000 (MojoExecutor.java:75)

    at org.apache.maven.lifecycle.internal.MojoExecutor$1.run (MojoExecutor.java:162)

    at org.apache.maven.plugin.DefaultMojosExecutionStrategy.execute (DefaultMojosExecutionStrategy.java:39)

    at org.apache.maven.lifecycle.internal.MojoExecutor.execute (MojoExecutor.java:159)

    at org.apache.maven.lifecycle.internal.LifecycleModuleBuilder.buildProject (LifecycleModuleBuilder.java:105)

    at org.apache.maven.lifecycle.internal.builder.multithreaded.MultiThreadedBuilder$1.call (MultiThreadedBuilder.java:193)

    at org.apache.maven.lifecycle.internal.builder.multithreaded.MultiThreadedBuilder$1.call (MultiThreadedBuilder.java:180)

    at java.util.concurrent.FutureTask.run (FutureTask.java:266)

    at java.util.concurrent.Executors$RunnableAdapter.call (Executors.java:511)

    at java.util.concurrent.FutureTask.run (FutureTask.java:266)

    at java.util.concurrent.ThreadPoolExecutor.runWorker (ThreadPoolExecutor.java:1149)

    at java.util.concurrent.ThreadPoolExecutor$Worker.run (ThreadPoolExecutor.java:624)

    at java.lang.Thread.run (Thread.java:750)

Caused by: org.eclipse.aether.resolution.DependencyResolutionException: The following artifacts could not be resolved: net.minidev:json-smart:jar:2.3 (present, but unavailable): Could not transfer artifact net.minidev:json-smart:jar:2.3 from/to apache-hadoop (https://repo.hortonworks.com/content/groups/public/): status code: 429, reason phrase: Too Many Requests (429)

    at org.eclipse.aether.internal.impl.DefaultRepositorySystem.resolveDependencies (DefaultRepositorySystem.java:364)

    at org.apache.maven.project.DefaultProjectDependenciesResolver.resolve (DefaultProjectDependenciesResolver.java:182)

    at org.apache.maven.lifecycle.internal.LifecycleDependencyResolver.getDependencies (LifecycleDependencyResolver.java:224)

    at org.apache.maven.lifecycle.internal.LifecycleDependencyResolver.resolveProjectDependencies (LifecycleDependencyResolver.java:136)

    at org.apache.maven.lifecycle.internal.MojoExecutor.ensureDependenciesAreResolved (MojoExecutor.java:355)

    at org.apache.maven.lifecycle.internal.MojoExecutor.doExecute (MojoExecutor.java:313)

    at org.apache.maven.lifecycle.internal.MojoExecutor.execute (MojoExecutor.java:212)

    at org.apache.maven.lifecycle.internal.MojoExecutor.execute (MojoExecutor.java:174)

    at org.apache.maven.lifecycle.internal.MojoExecutor.access$000 (MojoExecutor.java:75)

    at org.apache.maven.lifecycle.internal.MojoExecutor$1.run (MojoExecutor.java:162)

    at org.apache.maven.plugin.DefaultMojosExecutionStrategy.execute (DefaultMojosExecutionStrategy.java:39)

    at org.apache.maven.lifecycle.internal.MojoExecutor.execute (MojoExecutor.java:159)

    at org.apache.maven.lifecycle.internal.LifecycleModuleBuilder.buildProject (LifecycleModuleBuilder.java:105)

    at org.apache.maven.lifecycle.internal.builder.multithreaded.MultiThreadedBuilder$1.call (MultiThreadedBuilder.java:193)

    at org.apache.maven.lifecycle.internal.builder.multithreaded.MultiThreadedBuilder$1.call (MultiThreadedBuilder.java:180)

    at java.util.concurrent.FutureTask.run (FutureTask.java:266)

    at java.util.concurrent.Executors$RunnableAdapter.call (Executors.java:511)

    at java.util.concurrent.FutureTask.run (FutureTask.java:266)

    at java.util.concurrent.ThreadPoolExecutor.runWorker (ThreadPoolExecutor.java:1149)

    at java.util.concurrent.ThreadPoolExecutor$Worker.run (ThreadPoolExecutor.java:624)

    at java.lang.Thread.run (Thread.java:750)

Caused by: org.eclipse.aether.resolution.ArtifactResolutionException: The following artifacts could not be resolved: net.minidev:json-smart:jar:2.3 (present, but unavailable): Could not transfer artifact net.minidev:json-smart:jar:2.3 from/to apache-hadoop (https://repo.hortonworks.com/content/groups/public/): status code: 429, reason phrase: Too Many Requests (429)

    at org.eclipse.aether.internal.impl.DefaultArtifactResolver.resolve (DefaultArtifactResolver.java:459)

    at org.eclipse.aether.internal.impl.DefaultArtifactResolver.resolveArtifacts (DefaultArtifactResolver.java:259)

    at org.eclipse.aether.internal.impl.DefaultRepositorySystem.resolveDependencies (DefaultRepositorySystem.java:352)

    at org.apache.maven.project.DefaultProjectDependenciesResolver.resolve (DefaultProjectDependenciesResolver.java:182)

    at org.apache.maven.lifecycle.internal.LifecycleDependencyResolver.getDependencies (LifecycleDependencyResolver.java:224)

    at org.apache.maven.lifecycle.internal.LifecycleDependencyResolver.resolveProjectDependencies (LifecycleDependencyResolver.java:136)

    at org.apache.maven.lifecycle.internal.MojoExecutor.ensureDependenciesAreResolved (MojoExecutor.java:355)

    at org.apache.maven.lifecycle.internal.MojoExecutor.doExecute (MojoExecutor.java:313)

    at org.apache.maven.lifecycle.internal.MojoExecutor.execute (MojoExecutor.java:212)

    at org.apache.maven.lifecycle.internal.MojoExecutor.execute (MojoExecutor.java:174)

    at org.apache.maven.lifecycle.internal.MojoExecutor.access$000 (MojoExecutor.java:75)

    at org.apache.maven.lifecycle.internal.MojoExecutor$1.run (MojoExecutor.java:162)

    at org.apache.maven.plugin.DefaultMojosExecutionStrategy.execute (DefaultMojosExecutionStrategy.java:39)

    at org.apache.maven.lifecycle.internal.MojoExecutor.execute (MojoExecutor.java:159)

    at org.apache.maven.lifecycle.internal.LifecycleModuleBuilder.buildProject (LifecycleModuleBuilder.java:105)

    at org.apache.maven.lifecycle.internal.builder.multithreaded.MultiThreadedBuilder$1.call (MultiThreadedBuilder.java:193)

    at org.apache.maven.lifecycle.internal.builder.multithreaded.MultiThreadedBuilder$1.call (MultiThreadedBuilder.java:180)

    at java.util.concurrent.FutureTask.run (FutureTask.java:266)

    at java.util.concurrent.Executors$RunnableAdapter.call (Executors.java:511)

    at java.util.concurrent.FutureTask.run (FutureTask.java:266)

    at java.util.concurrent.ThreadPoolExecutor.runWorker (ThreadPoolExecutor.java:1149)

    at java.util.concurrent.ThreadPoolExecutor$Worker.run (ThreadPoolExecutor.java:624)

    at java.lang.Thread.run (Thread.java:750)

Caused by: org.eclipse.aether.transfer.ArtifactTransferException: Could not transfer artifact net.minidev:json-smart:jar:2.3 from/to apache-hadoop (https://repo.hortonworks.com/content/groups/public/): status code: 429, reason phrase: Too Many Requests (429)

    at org.eclipse.aether.connector.basic.ArtifactTransportListener.transferFailed (ArtifactTransportListener.java:44)

    at org.eclipse.aether.connector.basic.BasicRepositoryConnector$TaskRunner.run (BasicRepositoryConnector.java:417)

    at org.eclipse.aether.util.concurrency.RunnableErrorForwarder.lambda$wrap$0 (RunnableErrorForwarder.java:66)

    at java.util.concurrent.ThreadPoolExecutor.runWorker (ThreadPoolExecutor.java:1149)

    at java.util.concurrent.ThreadPoolExecutor$Worker.run (ThreadPoolExecutor.java:624)

    at java.lang.Thread.run (Thread.java:750)

Caused by: org.apache.http.client.HttpResponseException: status code: 429, reason phrase: Too Many Requests (429)

    at org.eclipse.aether.transport.http.HttpTransporter.handleStatus (HttpTransporter.java:552)

    at org.eclipse.aether.transport.http.HttpTransporter.execute (HttpTransporter.java:421)

    at org.eclipse.aether.transport.http.HttpTransporter.implPeek (HttpTransporter.java:348)

    at org.eclipse.aether.spi.connector.transport.AbstractTransporter.peek (AbstractTransporter.java:49)

    at org.eclipse.aether.connector.basic.BasicRepositoryConnector$PeekTaskRunner.runTask (BasicRepositoryConnector.java:432)

    at org.eclipse.aether.connector.basic.BasicRepositoryConnector$TaskRunner.run (BasicRepositoryConnector.java:414)

    at org.eclipse.aether.util.concurrency.RunnableErrorForwarder.lambda$wrap$0 (RunnableErrorForwarder.java:66)

    at java.util.concurrent.ThreadPoolExecutor.runWorker (ThreadPoolExecutor.java:1149)

    at java.util.concurrent.ThreadPoolExecutor$Worker.run (ThreadPoolExecutor.java:624)

    at java.lang.Thread.run (Thread.java:750)

[ERROR] Failed to execute goal on project ambari-metrics-host-aggregator: Could not resolve dependencies for project org.apache.ambari:ambari-metrics-host-aggregator:jar:2.7.8.0.0: The following artifacts could not be resolved: net.minidev:json-smart:jar:2.3 (present, but unavailable): net.minidev:json-smart:jar:2.3 failed to transfer from https://repo.hortonworks.com/content/groups/public/ during a previous attempt. This failure was cached in the local repository and resolution is not reattempted until the update interval of apache-hadoop has elapsed or updates are forced. Original error: Could not transfer artifact net.minidev:json-smart:jar:2.3 from/to apache-hadoop (https://repo.hortonworks.com/content/groups/public/): status code: 429, reason phrase: Too Many Requests (429) -> [Help 1]

org.apache.maven.lifecycle.LifecycleExecutionException: Failed to execute goal on project ambari-metrics-host-aggregator: Could not resolve dependencies for project org.apache.ambari:ambari-metrics-host-aggregator:jar:2.7.8.0.0: The following artifacts could not be resolved: net.minidev:json-smart:jar:2.3 (present, but unavailable): net.minidev:json-smart:jar:2.3 failed to transfer from https://repo.hortonworks.com/content/groups/public/ during a previous attempt. This failure was cached in the local repository and resolution is not reattempted until the update interval of apache-hadoop has elapsed or updates are forced. Original error: Could not transfer artifact net.minidev:json-smart:jar:2.3 from/to apache-hadoop (https://repo.hortonworks.com/content/groups/public/): status code: 429, reason phrase: Too Many Requests (429)

    at org.apache.maven.lifecycle.internal.LifecycleDependencyResolver.getDependencies (LifecycleDependencyResolver.java:243)

    at org.apache.maven.lifecycle.internal.LifecycleDependencyResolver.resolveProjectDependencies (LifecycleDependencyResolver.java:136)

    at org.apache.maven.lifecycle.internal.MojoExecutor.ensureDependenciesAreResolved (MojoExecutor.java:355)

    at org.apache.maven.lifecycle.internal.MojoExecutor.doExecute (MojoExecutor.java:313)

    at org.apache.maven.lifecycle.internal.MojoExecutor.execute (MojoExecutor.java:212)

    at org.apache.maven.lifecycle.internal.MojoExecutor.execute (MojoExecutor.java:174)

    at org.apache.maven.lifecycle.internal.MojoExecutor.access$000 (MojoExecutor.java:75)

    at org.apache.maven.lifecycle.internal.MojoExecutor$1.run (MojoExecutor.java:162)

    at org.apache.maven.plugin.DefaultMojosExecutionStrategy.execute (DefaultMojosExecutionStrategy.java:39)

    at org.apache.maven.lifecycle.internal.MojoExecutor.execute (MojoExecutor.java:159)

    at org.apache.maven.lifecycle.internal.LifecycleModuleBuilder.buildProject (LifecycleModuleBuilder.java:105)

    at org.apache.maven.lifecycle.internal.builder.multithreaded.MultiThreadedBuilder$1.call (MultiThreadedBuilder.java:193)

    at org.apache.maven.lifecycle.internal.builder.multithreaded.MultiThreadedBuilder$1.call (MultiThreadedBuilder.java:180)

    at java.util.concurrent.FutureTask.run (FutureTask.java:266)

    at java.util.concurrent.Executors$RunnableAdapter.call (Executors.java:511)

    at java.util.concurrent.FutureTask.run (FutureTask.java:266)

    at java.util.concurrent.ThreadPoolExecutor.runWorker (ThreadPoolExecutor.java:1149)

    at java.util.concurrent.ThreadPoolExecutor$Worker.run (ThreadPoolExecutor.java:624)

    at java.lang.Thread.run (Thread.java:750)

Caused by: org.apache.maven.project.DependencyResolutionException: Could not resolve dependencies for project org.apache.ambari:ambari-metrics-host-aggregator:jar:2.7.8.0.0: The following artifacts could not be resolved: net.minidev:json-smart:jar:2.3 (present, but unavailable): net.minidev:json-smart:jar:2.3 failed to transfer from https://repo.hortonworks.com/content/groups/public/ during a previous attempt. This failure was cached in the local repository and resolution is not reattempted until the update interval of apache-hadoop has elapsed or updates are forced. Original error: Could not transfer artifact net.minidev:json-smart:jar:2.3 from/to apache-hadoop (https://repo.hortonworks.com/content/groups/public/): status code: 429, reason phrase: Too Many Requests (429)

    at org.apache.maven.project.DefaultProjectDependenciesResolver.resolve (DefaultProjectDependenciesResolver.java:187)

    at org.apache.maven.lifecycle.internal.LifecycleDependencyResolver.getDependencies (LifecycleDependencyResolver.java:224)

    at org.apache.maven.lifecycle.internal.LifecycleDependencyResolver.resolveProjectDependencies (LifecycleDependencyResolver.java:136)

    at org.apache.maven.lifecycle.internal.MojoExecutor.ensureDependenciesAreResolved (MojoExecutor.java:355)

    at org.apache.maven.lifecycle.internal.MojoExecutor.doExecute (MojoExecutor.java:313)

    at org.apache.maven.lifecycle.internal.MojoExecutor.execute (MojoExecutor.java:212)

    at org.apache.maven.lifecycle.internal.MojoExecutor.execute (MojoExecutor.java:174)

    at org.apache.maven.lifecycle.internal.MojoExecutor.access$000 (MojoExecutor.java:75)

    at org.apache.maven.lifecycle.internal.MojoExecutor$1.run (MojoExecutor.java:162)

    at org.apache.maven.plugin.DefaultMojosExecutionStrategy.execute (DefaultMojosExecutionStrategy.java:39)

    at org.apache.maven.lifecycle.internal.MojoExecutor.execute (MojoExecutor.java:159)

    at org.apache.maven.lifecycle.internal.LifecycleModuleBuilder.buildProject (LifecycleModuleBuilder.java:105)

    at org.apache.maven.lifecycle.internal.builder.multithreaded.MultiThreadedBuilder$1.call (MultiThreadedBuilder.java:193)

    at org.apache.maven.lifecycle.internal.builder.multithreaded.MultiThreadedBuilder$1.call (MultiThreadedBuilder.java:180)

    at java.util.concurrent.FutureTask.run (FutureTask.java:266)

    at java.util.concurrent.Executors$RunnableAdapter.call (Executors.java:511)

    at java.util.concurrent.FutureTask.run (FutureTask.java:266)

    at java.util.concurrent.ThreadPoolExecutor.runWorker (ThreadPoolExecutor.java:1149)

    at java.util.concurrent.ThreadPoolExecutor$Worker.run (ThreadPoolExecutor.java:624)

    at java.lang.Thread.run (Thread.java:750)

Caused by: org.eclipse.aether.resolution.DependencyResolutionException: The following artifacts could not be resolved: net.minidev:json-smart:jar:2.3 (present, but unavailable): net.minidev:json-smart:jar:2.3 failed to transfer from https://repo.hortonworks.com/content/groups/public/ during a previous attempt. This failure was cached in the local repository and resolution is not reattempted until the update interval of apache-hadoop has elapsed or updates are forced. Original error: Could not transfer artifact net.minidev:json-smart:jar:2.3 from/to apache-hadoop (https://repo.hortonworks.com/content/groups/public/): status code: 429, reason phrase: Too Many Requests (429)

    at org.eclipse.aether.internal.impl.DefaultRepositorySystem.resolveDependencies (DefaultRepositorySystem.java:364)

    at org.apache.maven.project.DefaultProjectDependenciesResolver.resolve (DefaultProjectDependenciesResolver.java:182)

    at org.apache.maven.lifecycle.internal.LifecycleDependencyResolver.getDependencies (LifecycleDependencyResolver.java:224)

    at org.apache.maven.lifecycle.internal.LifecycleDependencyResolver.resolveProjectDependencies (LifecycleDependencyResolver.java:136)

    at org.apache.maven.lifecycle.internal.MojoExecutor.ensureDependenciesAreResolved (MojoExecutor.java:355)

    at org.apache.maven.lifecycle.internal.MojoExecutor.doExecute (MojoExecutor.java:313)

    at org.apache.maven.lifecycle.internal.MojoExecutor.execute (MojoExecutor.java:212)

    at org.apache.maven.lifecycle.internal.MojoExecutor.execute (MojoExecutor.java:174)

    at org.apache.maven.lifecycle.internal.MojoExecutor.access$000 (MojoExecutor.java:75)

    at org.apache.maven.lifecycle.internal.MojoExecutor$1.run (MojoExecutor.java:162)

    at org.apache.maven.plugin.DefaultMojosExecutionStrategy.execute (DefaultMojosExecutionStrategy.java:39)

    at org.apache.maven.lifecycle.internal.MojoExecutor.execute (MojoExecutor.java:159)

    at org.apache.maven.lifecycle.internal.LifecycleModuleBuilder.buildProject (LifecycleModuleBuilder.java:105)

    at org.apache.maven.lifecycle.internal.builder.multithreaded.MultiThreadedBuilder$1.call (MultiThreadedBuilder.java:193)

    at org.apache.maven.lifecycle.internal.builder.multithreaded.MultiThreadedBuilder$1.call (MultiThreadedBuilder.java:180)

    at java.util.concurrent.FutureTask.run (FutureTask.java:266)

    at java.util.concurrent.Executors$RunnableAdapter.call (Executors.java:511)

    at java.util.concurrent.FutureTask.run (FutureTask.java:266)

    at java.util.concurrent.ThreadPoolExecutor.runWorker (ThreadPoolExecutor.java:1149)

    at java.util.concurrent.ThreadPoolExecutor$Worker.run (ThreadPoolExecutor.java:624)

    at java.lang.Thread.run (Thread.java:750)

Caused by: org.eclipse.aether.resolution.ArtifactResolutionException: The following artifacts could not be resolved: net.minidev:json-smart:jar:2.3 (present, but unavailable): net.minidev:json-smart:jar:2.3 failed to transfer from https://repo.hortonworks.com/content/groups/public/ during a previous attempt. This failure was cached in the local repository and resolution is not reattempted until the update interval of apache-hadoop has elapsed or updates are forced. Original error: Could not transfer artifact net.minidev:json-smart:jar:2.3 from/to apache-hadoop (https://repo.hortonworks.com/content/groups/public/): status code: 429, reason phrase: Too Many Requests (429)

    at org.eclipse.aether.internal.impl.DefaultArtifactResolver.resolve (DefaultArtifactResolver.java:459)

    at org.eclipse.aether.internal.impl.DefaultArtifactResolver.resolveArtifacts (DefaultArtifactResolver.java:259)

    at org.eclipse.aether.internal.impl.DefaultRepositorySystem.resolveDependencies (DefaultRepositorySystem.java:352)

    at org.apache.maven.project.DefaultProjectDependenciesResolver.resolve (DefaultProjectDependenciesResolver.java:182)

    at org.apache.maven.lifecycle.internal.LifecycleDependencyResolver.getDependencies (LifecycleDependencyResolver.java:224)

    at org.apache.maven.lifecycle.internal.LifecycleDependencyResolver.resolveProjectDependencies (LifecycleDependencyResolver.java:136)

    at org.apache.maven.lifecycle.internal.MojoExecutor.ensureDependenciesAreResolved (MojoExecutor.java:355)

    at org.apache.maven.lifecycle.internal.MojoExecutor.doExecute (MojoExecutor.java:313)

    at org.apache.maven.lifecycle.internal.MojoExecutor.execute (MojoExecutor.java:212)

    at org.apache.maven.lifecycle.internal.MojoExecutor.execute (MojoExecutor.java:174)

    at org.apache.maven.lifecycle.internal.MojoExecutor.access$000 (MojoExecutor.java:75)

    at org.apache.maven.lifecycle.internal.MojoExecutor$1.run (MojoExecutor.java:162)

    at org.apache.maven.plugin.DefaultMojosExecutionStrategy.execute (DefaultMojosExecutionStrategy.java:39)

    at org.apache.maven.lifecycle.internal.MojoExecutor.execute (MojoExecutor.java:159)

    at org.apache.maven.lifecycle.internal.LifecycleModuleBuilder.buildProject (LifecycleModuleBuilder.java:105)

    at org.apache.maven.lifecycle.internal.builder.multithreaded.MultiThreadedBuilder$1.call (MultiThreadedBuilder.java:193)

    at org.apache.maven.lifecycle.internal.builder.multithreaded.MultiThreadedBuilder$1.call (MultiThreadedBuilder.java:180)

    at java.util.concurrent.FutureTask.run (FutureTask.java:266)

    at java.util.concurrent.Executors$RunnableAdapter.call (Executors.java:511)

    at java.util.concurrent.FutureTask.run (FutureTask.java:266)

    at java.util.concurrent.ThreadPoolExecutor.runWorker (ThreadPoolExecutor.java:1149)

    at java.util.concurrent.ThreadPoolExecutor$Worker.run (ThreadPoolExecutor.java:624)

    at java.lang.Thread.run (Thread.java:750)

Caused by: org.eclipse.aether.transfer.ArtifactTransferException: net.minidev:json-smart:jar:2.3 failed to transfer from https://repo.hortonworks.com/content/groups/public/ during a previous attempt. This failure was cached in the local repository and resolution is not reattempted until the update interval of apache-hadoop has elapsed or updates are forced. Original error: Could not transfer artifact net.minidev:json-smart:jar:2.3 from/to apache-hadoop (https://repo.hortonworks.com/content/groups/public/): status code: 429, reason phrase: Too Many Requests (429)

    at org.eclipse.aether.internal.impl.DefaultUpdateCheckManager.newException (DefaultUpdateCheckManager.java:233)

    at org.eclipse.aether.internal.impl.DefaultUpdateCheckManager.checkArtifact (DefaultUpdateCheckManager.java:186)

    at org.eclipse.aether.internal.impl.DefaultArtifactResolver.gatherDownloads (DefaultArtifactResolver.java:571)

    at org.eclipse.aether.internal.impl.DefaultArtifactResolver.performDownloads (DefaultArtifactResolver.java:510)

    at org.eclipse.aether.internal.impl.DefaultArtifactResolver.resolve (DefaultArtifactResolver.java:435)

    at org.eclipse.aether.internal.impl.DefaultArtifactResolver.resolveArtifacts (DefaultArtifactResolver.java:259)

    at org.eclipse.aether.internal.impl.DefaultRepositorySystem.resolveDependencies (DefaultRepositorySystem.java:352)

    at org.apache.maven.project.DefaultProjectDependenciesResolver.resolve (DefaultProjectDependenciesResolver.java:182)

    at org.apache.maven.lifecycle.internal.LifecycleDependencyResolver.getDependencies (LifecycleDependencyResolver.java:224)

    at org.apache.maven.lifecycle.internal.LifecycleDependencyResolver.resolveProjectDependencies (LifecycleDependencyResolver.java:136)

    at org.apache.maven.lifecycle.internal.MojoExecutor.ensureDependenciesAreResolved (MojoExecutor.java:355)

    at org.apache.maven.lifecycle.internal.MojoExecutor.doExecute (MojoExecutor.java:313)

    at org.apache.maven.lifecycle.internal.MojoExecutor.execute (MojoExecutor.java:212)

    at org.apache.maven.lifecycle.internal.MojoExecutor.execute (MojoExecutor.java:174)

    at org.apache.maven.lifecycle.internal.MojoExecutor.access$000 (MojoExecutor.java:75)

    at org.apache.maven.lifecycle.internal.MojoExecutor$1.run (MojoExecutor.java:162)

    at org.apache.maven.plugin.DefaultMojosExecutionStrategy.execute (DefaultMojosExecutionStrategy.java:39)

    at org.apache.maven.lifecycle.internal.MojoExecutor.execute (MojoExecutor.java:159)

    at org.apache.maven.lifecycle.internal.LifecycleModuleBuilder.buildProject (LifecycleModuleBuilder.java:105)

    at org.apache.maven.lifecycle.internal.builder.multithreaded.MultiThreadedBuilder$1.call (MultiThreadedBuilder.java:193)

    at org.apache.maven.lifecycle.internal.builder.multithreaded.MultiThreadedBuilder$1.call (MultiThreadedBuilder.java:180)

    at java.util.concurrent.FutureTask.run (FutureTask.java:266)

    at java.util.concurrent.Executors$RunnableAdapter.call (Executors.java:511)

    at java.util.concurrent.FutureTask.run (FutureTask.java:266)

    at java.util.concurrent.ThreadPoolExecutor.runWorker (ThreadPoolExecutor.java:1149)

    at java.util.concurrent.ThreadPoolExecutor$Worker.run (ThreadPoolExecutor.java:624)

    at java.lang.Thread.run (Thread.java:750)

[ERROR] Failed to execute goal on project ambari-metrics-timelineservice: Could not resolve dependencies for project org.apache.ambari:ambari-metrics-timelineservice:jar:2.7.8.0.0: The following artifacts could not be resolved: org.apache.zookeeper:zookeeper:jar:3.4.5.1.3.0.0-107 (absent): Could not find artifact org.apache.zookeeper:zookeeper:jar:3.4.5.1.3.0.0-107 in apache-hadoop (https://repo.hortonworks.com/content/groups/public/) -> [Help 1]

org.apache.maven.lifecycle.LifecycleExecutionException: Failed to execute goal on project ambari-metrics-timelineservice: Could not resolve dependencies for project org.apache.ambari:ambari-metrics-timelineservice:jar:2.7.8.0.0: The following artifacts could not be resolved: org.apache.zookeeper:zookeeper:jar:3.4.5.1.3.0.0-107 (absent): Could not find artifact org.apache.zookeeper:zookeeper:jar:3.4.5.1.3.0.0-107 in apache-hadoop (https://repo.hortonworks.com/content/groups/public/)

    at org.apache.maven.lifecycle.internal.LifecycleDependencyResolver.getDependencies (LifecycleDependencyResolver.java:243)

    at org.apache.maven.lifecycle.internal.LifecycleDependencyResolver.resolveProjectDependencies (LifecycleDependencyResolver.java:136)

    at org.apache.maven.lifecycle.internal.MojoExecutor.ensureDependenciesAreResolved (MojoExecutor.java:355)

    at org.apache.maven.lifecycle.internal.MojoExecutor.doExecute (MojoExecutor.java:313)

    at org.apache.maven.lifecycle.internal.MojoExecutor.execute (MojoExecutor.java:212)

    at org.apache.maven.lifecycle.internal.MojoExecutor.execute (MojoExecutor.java:174)

    at org.apache.maven.lifecycle.internal.MojoExecutor.access$000 (MojoExecutor.java:75)

    at org.apache.maven.lifecycle.internal.MojoExecutor$1.run (MojoExecutor.java:162)

    at org.apache.maven.plugin.DefaultMojosExecutionStrategy.execute (DefaultMojosExecutionStrategy.java:39)

    at org.apache.maven.lifecycle.internal.MojoExecutor.execute (MojoExecutor.java:159)

    at org.apache.maven.lifecycle.internal.LifecycleModuleBuilder.buildProject (LifecycleModuleBuilder.java:105)

    at org.apache.maven.lifecycle.internal.builder.multithreaded.MultiThreadedBuilder$1.call (MultiThreadedBuilder.java:193)

    at org.apache.maven.lifecycle.internal.builder.multithreaded.MultiThreadedBuilder$1.call (MultiThreadedBuilder.java:180)

    at java.util.concurrent.FutureTask.run (FutureTask.java:266)

    at java.util.concurrent.Executors$RunnableAdapter.call (Executors.java:511)

    at java.util.concurrent.FutureTask.run (FutureTask.java:266)

    at java.util.concurrent.ThreadPoolExecutor.runWorker (ThreadPoolExecutor.java:1149)

    at java.util.concurrent.ThreadPoolExecutor$Worker.run (ThreadPoolExecutor.java:624)

    at java.lang.Thread.run (Thread.java:750)

Caused by: org.apache.maven.project.DependencyResolutionException: Could not resolve dependencies for project org.apache.ambari:ambari-metrics-timelineservice:jar:2.7.8.0.0: The following artifacts could not be resolved: org.apache.zookeeper:zookeeper:jar:3.4.5.1.3.0.0-107 (absent): Could not find artifact org.apache.zookeeper:zookeeper:jar:3.4.5.1.3.0.0-107 in apache-hadoop (https://repo.hortonworks.com/content/groups/public/)

    at org.apache.maven.project.DefaultProjectDependenciesResolver.resolve (DefaultProjectDependenciesResolver.java:187)

    at org.apache.maven.lifecycle.internal.LifecycleDependencyResolver.getDependencies (LifecycleDependencyResolver.java:224)

    at org.apache.maven.lifecycle.internal.LifecycleDependencyResolver.resolveProjectDependencies (LifecycleDependencyResolver.java:136)

    at org.apache.maven.lifecycle.internal.MojoExecutor.ensureDependenciesAreResolved (MojoExecutor.java:355)

    at org.apache.maven.lifecycle.internal.MojoExecutor.doExecute (MojoExecutor.java:313)

    at org.apache.maven.lifecycle.internal.MojoExecutor.execute (MojoExecutor.java:212)

    at org.apache.maven.lifecycle.internal.MojoExecutor.execute (MojoExecutor.java:174)

    at org.apache.maven.lifecycle.internal.MojoExecutor.access$000 (MojoExecutor.java:75)

    at org.apache.maven.lifecycle.internal.MojoExecutor$1.run (MojoExecutor.java:162)

    at org.apache.maven.plugin.DefaultMojosExecutionStrategy.execute (DefaultMojosExecutionStrategy.java:39)

    at org.apache.maven.lifecycle.internal.MojoExecutor.execute (MojoExecutor.java:159)

    at org.apache.maven.lifecycle.internal.LifecycleModuleBuilder.buildProject (LifecycleModuleBuilder.java:105)

    at org.apache.maven.lifecycle.internal.builder.multithreaded.MultiThreadedBuilder$1.call (MultiThreadedBuilder.java:193)

    at org.apache.maven.lifecycle.internal.builder.multithreaded.MultiThreadedBuilder$1.call (MultiThreadedBuilder.java:180)

    at java.util.concurrent.FutureTask.run (FutureTask.java:266)

    at java.util.concurrent.Executors$RunnableAdapter.call (Executors.java:511)

    at java.util.concurrent.FutureTask.run (FutureTask.java:266)

    at java.util.concurrent.ThreadPoolExecutor.runWorker (ThreadPoolExecutor.java:1149)

    at java.util.concurrent.ThreadPoolExecutor$Worker.run (ThreadPoolExecutor.java:624)

    at java.lang.Thread.run (Thread.java:750)

Caused by: org.eclipse.aether.resolution.DependencyResolutionException: The following artifacts could not be resolved: org.apache.zookeeper:zookeeper:jar:3.4.5.1.3.0.0-107 (absent): Could not find artifact org.apache.zookeeper:zookeeper:jar:3.4.5.1.3.0.0-107 in apache-hadoop (https://repo.hortonworks.com/content/groups/public/)

    at org.eclipse.aether.internal.impl.DefaultRepositorySystem.resolveDependencies (DefaultRepositorySystem.java:364)

    at org.apache.maven.project.DefaultProjectDependenciesResolver.resolve (DefaultProjectDependenciesResolver.java:182)

    at org.apache.maven.lifecycle.internal.LifecycleDependencyResolver.getDependencies (LifecycleDependencyResolver.java:224)

    at org.apache.maven.lifecycle.internal.LifecycleDependencyResolver.resolveProjectDependencies (LifecycleDependencyResolver.java:136)

    at org.apache.maven.lifecycle.internal.MojoExecutor.ensureDependenciesAreResolved (MojoExecutor.java:355)

    at org.apache.maven.lifecycle.internal.MojoExecutor.doExecute (MojoExecutor.java:313)

    at org.apache.maven.lifecycle.internal.MojoExecutor.execute (MojoExecutor.java:212)

    at org.apache.maven.lifecycle.internal.MojoExecutor.execute (MojoExecutor.java:174)

    at org.apache.maven.lifecycle.internal.MojoExecutor.access$000 (MojoExecutor.java:75)

    at org.apache.maven.lifecycle.internal.MojoExecutor$1.run (MojoExecutor.java:162)

    at org.apache.maven.plugin.DefaultMojosExecutionStrategy.execute (DefaultMojosExecutionStrategy.java:39)

    at org.apache.maven.lifecycle.internal.MojoExecutor.execute (MojoExecutor.java:159)

    at org.apache.maven.lifecycle.internal.LifecycleModuleBuilder.buildProject (LifecycleModuleBuilder.java:105)

    at org.apache.maven.lifecycle.internal.builder.multithreaded.MultiThreadedBuilder$1.call (MultiThreadedBuilder.java:193)

    at org.apache.maven.lifecycle.internal.builder.multithreaded.MultiThreadedBuilder$1.call (MultiThreadedBuilder.java:180)

    at java.util.concurrent.FutureTask.run (FutureTask.java:266)

    at java.util.concurrent.Executors$RunnableAdapter.call (Executors.java:511)

    at java.util.concurrent.FutureTask.run (FutureTask.java:266)

    at java.util.concurrent.ThreadPoolExecutor.runWorker (ThreadPoolExecutor.java:1149)

    at java.util.concurrent.ThreadPoolExecutor$Worker.run (ThreadPoolExecutor.java:624)

    at java.lang.Thread.run (Thread.java:750)

Caused by: org.eclipse.aether.resolution.ArtifactResolutionException: The following artifacts could not be resolved: org.apache.zookeeper:zookeeper:jar:3.4.5.1.3.0.0-107 (absent): Could not find artifact org.apache.zookeeper:zookeeper:jar:3.4.5.1.3.0.0-107 in apache-hadoop (https://repo.hortonworks.com/content/groups/public/)

    at org.eclipse.aether.internal.impl.DefaultArtifactResolver.resolve (DefaultArtifactResolver.java:459)

    at org.eclipse.aether.internal.impl.DefaultArtifactResolver.resolveArtifacts (DefaultArtifactResolver.java:259)

    at org.eclipse.aether.internal.impl.DefaultRepositorySystem.resolveDependencies (DefaultRepositorySystem.java:352)

    at org.apache.maven.project.DefaultProjectDependenciesResolver.resolve (DefaultProjectDependenciesResolver.java:182)

    at org.apache.maven.lifecycle.internal.LifecycleDependencyResolver.getDependencies (LifecycleDependencyResolver.java:224)

    at org.apache.maven.lifecycle.internal.LifecycleDependencyResolver.resolveProjectDependencies (LifecycleDependencyResolver.java:136)

    at org.apache.maven.lifecycle.internal.MojoExecutor.ensureDependenciesAreResolved (MojoExecutor.java:355)

    at org.apache.maven.lifecycle.internal.MojoExecutor.doExecute (MojoExecutor.java:313)

    at org.apache.maven.lifecycle.internal.MojoExecutor.execute (MojoExecutor.java:212)

    at org.apache.maven.lifecycle.internal.MojoExecutor.execute (MojoExecutor.java:174)

    at org.apache.maven.lifecycle.internal.MojoExecutor.access$000 (MojoExecutor.java:75)

    at org.apache.maven.lifecycle.internal.MojoExecutor$1.run (MojoExecutor.java:162)

    at org.apache.maven.plugin.DefaultMojosExecutionStrategy.execute (DefaultMojosExecutionStrategy.java:39)

    at org.apache.maven.lifecycle.internal.MojoExecutor.execute (MojoExecutor.java:159)

    at org.apache.maven.lifecycle.internal.LifecycleModuleBuilder.buildProject (LifecycleModuleBuilder.java:105)

    at org.apache.maven.lifecycle.internal.builder.multithreaded.MultiThreadedBuilder$1.call (MultiThreadedBuilder.java:193)

    at org.apache.maven.lifecycle.internal.builder.multithreaded.MultiThreadedBuilder$1.call (MultiThreadedBuilder.java:180)

    at java.util.concurrent.FutureTask.run (FutureTask.java:266)

    at java.util.concurrent.Executors$RunnableAdapter.call (Executors.java:511)

    at java.util.concurrent.FutureTask.run (FutureTask.java:266)

    at java.util.concurrent.ThreadPoolExecutor.runWorker (ThreadPoolExecutor.java:1149)

    at java.util.concurrent.ThreadPoolExecutor$Worker.run (ThreadPoolExecutor.java:624)

    at java.lang.Thread.run (Thread.java:750)

Caused by: org.eclipse.aether.transfer.ArtifactNotFoundException: Could not find artifact org.apache.zookeeper:zookeeper:jar:3.4.5.1.3.0.0-107 in apache-hadoop (https://repo.hortonworks.com/content/groups/public/)

    at org.eclipse.aether.connector.basic.ArtifactTransportListener.transferFailed (ArtifactTransportListener.java:42)

    at org.eclipse.aether.connector.basic.BasicRepositoryConnector$TaskRunner.run (BasicRepositoryConnector.java:417)

    at org.eclipse.aether.util.concurrency.RunnableErrorForwarder.lambda$wrap$0 (RunnableErrorForwarder.java:66)

    at java.util.concurrent.ThreadPoolExecutor.runWorker (ThreadPoolExecutor.java:1149)

    at java.util.concurrent.ThreadPoolExecutor$Worker.run (ThreadPoolExecutor.java:624)

    at java.lang.Thread.run (Thread.java:750)

[ERROR] 

[ERROR] 

[ERROR] For more information about the errors and possible solutions, please read the following articles:

[ERROR] [Help 1] http://cwiki.apache.org/confluence/display/MAVEN/DependencyResolutionException

[ERROR] 

[ERROR] After correcting the problems, you can resume the build with the command

[ERROR]   mvn <args> -rf :ambari-metrics-storm-sink-legacy

[DEBUG] Shutting down adapter factory; available factories [file-lock, rwlock-local, semaphore-local, noop]; available name mappers [discriminating, file-gav, file-hgav, file-static, gav, static]

[DEBUG] Shutting down 'file-lock' factory

[DEBUG] Shutting down 'rwlock-local' factory

[DEBUG] Shutting down 'semaphore-local' factory

[DEBUG] Shutting down 'noop' factory

script returned exit code 1
{code}


> Branch-2.7 metrics build is failing because some dependency versions are not available
> --------------------------------------------------------------------------------------
>
>                 Key: AMBARI-25974
>                 URL: https://issues.apache.org/jira/browse/AMBARI-25974
>             Project: Ambari
>          Issue Type: Bug
>    Affects Versions: 2.7.7
>            Reporter: Mohammad Arshad
>            Assignee: Mohammad Arshad
>            Priority: Major
>
> {noformat}
> mvn -T 3C install -DskipSurefireTests -DskipPythonTests -Dmaven.test.failure.ignore -DskipTests -Dfindbugs.skip -Drat.skip -Dmaven.artifact.threads=10 -X
> {noformat}
> {code:java}
> [INFO] ambari-utility 1.0.0.0-SNAPSHOT .................... SUCCESS [ 43.509 s]
> [INFO] ambari-metrics 2.7.8.0.0 ........................... SUCCESS [  0.837 s]
> [INFO] Ambari Metrics Common 2.7.8.0.0 .................... SUCCESS [ 29.457 s]
> [INFO] Ambari Metrics Hadoop Sink 2.7.8.0.0 ............... FAILURE [01:38 min]
> [INFO] Ambari Metrics Flume Sink 2.7.8.0.0 ................ SUCCESS [01:01 min]
> [INFO] Ambari Metrics Kafka Sink 2.7.8.0.0 ................ SUCCESS [ 54.448 s]
> [INFO] Ambari Metrics Storm Sink 2.7.8.0.0 ................ SUCCESS [ 54.939 s]
> [INFO] Ambari Metrics Storm Sink (Legacy) 2.7.8.0.0 ....... FAILURE [  9.393 s]
> [INFO] Ambari Metrics Collector 2.7.8.0.0 ................. FAILURE [06:29 min]
> [INFO] Ambari Metrics Monitor 2.7.8.0.0 ................... SUCCESS [  2.709 s]
> [INFO] Ambari Metrics Grafana 2.7.8.0.0 ................... SUCCESS [  4.659 s]
> [INFO] Ambari Metrics Host Aggregator 2.7.8.0.0 ........... FAILURE [01:55 min]
> [INFO] Ambari Metrics Assembly 2.7.8.0.0 .................. SKIPPED
> [INFO] ------------------------------------------------------------------------
> [INFO] BUILD FAILURE
> [INFO] ------------------------------------------------------------------------
> [INFO] Total time:  07:43 min (Wall Clock)
> [INFO] Finished at: 2023-07-22T15:15:35Z
> [INFO] ------------------------------------------------------------------------
> [ERROR] Failed to execute goal on project ambari-metrics-storm-sink-legacy: Could not resolve dependencies for project org.apache.ambari:ambari-metrics-storm-sink-legacy:jar:2.7.8.0.0: The following artifacts could not be resolved: org.apache.storm:storm-core:jar:0.10.0.2.3.0.0-2557 (absent): Could not find artifact org.apache.storm:storm-core:jar:0.10.0.2.3.0.0-2557 in apache-hadoop (https://repo.hortonworks.com/content/groups/public/) -> [Help 1]
> org.apache.maven.lifecycle.LifecycleExecutionException: Failed to execute goal on project ambari-metrics-storm-sink-legacy: Could not resolve dependencies for project org.apache.ambari:ambari-metrics-storm-sink-legacy:jar:2.7.8.0.0: The following artifacts could not be resolved: org.apache.storm:storm-core:jar:0.10.0.2.3.0.0-2557 (absent): Could not find artifact org.apache.storm:storm-core:jar:0.10.0.2.3.0.0-2557 in apache-hadoop (https://repo.hortonworks.com/content/groups/public/)
> {code}



--
This message was sent by Atlassian Jira
(v8.20.10#820010)

---------------------------------------------------------------------
To unsubscribe, e-mail: issues-unsubscribe@ambari.apache.org
For additional commands, e-mail: issues-help@ambari.apache.org