You are viewing a plain text version of this content. The canonical link for it is here.
Posted to builds@beam.apache.org by Apache Jenkins Server <je...@builds.apache.org> on 2021/05/22 01:01:17 UTC
Build failed in Jenkins: beam_PostCommit_Py_ValCont #7805
See <https://ci-beam.apache.org/job/beam_PostCommit_Py_ValCont/7805/display/redirect?page=changes>
Changes:
[Kyle Weaver] [BEAM-12339] Implement CREATE FUNCTION statement in Calcite dialect.
[Kyle Weaver] [BEAM-12339] Move unparse tests to different class to avoid 'pipeline
[Kyle Weaver] Add Python Dataflow V2 test to jobs list.
[noreply] [BEAM-12246] Fix ib.collect(dataframe) indexing (#14778)
------------------------------------------
[...truncated 107.05 KB...]
# Run ValidatesRunner tests on Google Cloud Dataflow service
echo ">>> RUNNING DATAFLOW RUNNER VALIDATESCONTAINER TEST"
pytest -o junit_suite_name=$IMAGE_NAME \
-m="it_validatescontainer" \
--show-capture=no \
--numprocesses=1 \
--timeout=900 \
--junitxml=$XUNIT_FILE \
--ignore-glob '.*py3\d?\.py$' \
--log-cli-level=INFO \
--test-pipeline-options=" \
--runner=TestDataflowRunner \
--project=$PROJECT \
--region=$REGION \
--sdk_container_image=$CONTAINER:$TAG \
--staging_location=$GCS_LOCATION/staging-validatesrunner-test \
--temp_location=$GCS_LOCATION/temp-validatesrunner-test \
--output=$GCS_LOCATION/output \
--sdk_location=$SDK_LOCATION \
--num_workers=1 \
--prebuild_sdk_container_base_image=$CONTAINER:$TAG \
--docker_registry_push_url=$PREBUILD_SDK_CONTAINER_REGISTRY_PATH"
> Task :sdks:python:test-suites:dataflow:py37:validatesContainer
function cleanup_container {
# Delete the container locally and remotely
docker rmi $CONTAINER:$TAG || echo "Failed to remove container image"
for image in $(docker images --format '{{.Repository}}:{{.Tag}}' | grep $PREBUILD_SDK_CONTAINER_REGISTRY_PATH)
do docker rmi $image || echo "Failed to remove prebuilt sdk container image"
done
gcloud --quiet container images delete $CONTAINER:$TAG || echo "Failed to delete container"
for digest in $(gcloud container images list-tags $PREBUILD_SDK_CONTAINER_REGISTRY_PATH/beam_python_prebuilt_sdk --format="get(digest)")
do gcloud container images delete $PREBUILD_SDK_CONTAINER_REGISTRY_PATH/beam_python_prebuilt_sdk@$digest --force-delete-tags --quiet || echo "Failed to remove prebuilt sdk container image"
done
echo "Removed the container"
}
trap cleanup_container EXIT
echo ">>> Successfully built and push container $CONTAINER"
cd sdks/python
SDK_LOCATION=$2
# Run ValidatesRunner tests on Google Cloud Dataflow service
echo ">>> RUNNING DATAFLOW RUNNER VALIDATESCONTAINER TEST"
pytest -o junit_suite_name=$IMAGE_NAME \
-m="it_validatescontainer" \
--show-capture=no \
--numprocesses=1 \
--timeout=900 \
--junitxml=$XUNIT_FILE \
--ignore-glob '.*py3\d?\.py$' \
--log-cli-level=INFO \
--test-pipeline-options=" \
--runner=TestDataflowRunner \
--project=$PROJECT \
--region=$REGION \
--sdk_container_image=$CONTAINER:$TAG \
--staging_location=$GCS_LOCATION/staging-validatesrunner-test \
--temp_location=$GCS_LOCATION/temp-validatesrunner-test \
--output=$GCS_LOCATION/output \
--sdk_location=$SDK_LOCATION \
--num_workers=1 \
--prebuild_sdk_container_base_image=$CONTAINER:$TAG \
--docker_registry_push_url=$PREBUILD_SDK_CONTAINER_REGISTRY_PATH"
> Task :sdks:python:test-suites:dataflow:py38:validatesContainer
function cleanup_container {
# Delete the container locally and remotely
docker rmi $CONTAINER:$TAG || echo "Failed to remove container image"
for image in $(docker images --format '{{.Repository}}:{{.Tag}}' | grep $PREBUILD_SDK_CONTAINER_REGISTRY_PATH)
do docker rmi $image || echo "Failed to remove prebuilt sdk container image"
done
gcloud --quiet container images delete $CONTAINER:$TAG || echo "Failed to delete container"
for digest in $(gcloud container images list-tags $PREBUILD_SDK_CONTAINER_REGISTRY_PATH/beam_python_prebuilt_sdk --format="get(digest)")
do gcloud container images delete $PREBUILD_SDK_CONTAINER_REGISTRY_PATH/beam_python_prebuilt_sdk@$digest --force-delete-tags --quiet || echo "Failed to remove prebuilt sdk container image"
done
echo "Removed the container"
}
trap cleanup_container EXIT
echo ">>> Successfully built and push container $CONTAINER"
cd sdks/python
SDK_LOCATION=$2
# Run ValidatesRunner tests on Google Cloud Dataflow service
echo ">>> RUNNING DATAFLOW RUNNER VALIDATESCONTAINER TEST"
pytest -o junit_suite_name=$IMAGE_NAME \
-m="it_validatescontainer" \
--show-capture=no \
--numprocesses=1 \
--timeout=900 \
--junitxml=$XUNIT_FILE \
--ignore-glob '.*py3\d?\.py$' \
--log-cli-level=INFO \
--test-pipeline-options=" \
--runner=TestDataflowRunner \
--project=$PROJECT \
--region=$REGION \
--sdk_container_image=$CONTAINER:$TAG \
--staging_location=$GCS_LOCATION/staging-validatesrunner-test \
--temp_location=$GCS_LOCATION/temp-validatesrunner-test \
--output=$GCS_LOCATION/output \
--sdk_location=$SDK_LOCATION \
--num_workers=1 \
--prebuild_sdk_container_base_image=$CONTAINER:$TAG \
--docker_registry_push_url=$PREBUILD_SDK_CONTAINER_REGISTRY_PATH"
> Task :sdks:python:test-suites:dataflow:py36:validatesContainer
cleanup_container
docker images --format '{{.Repository}}:{{.Tag}}' | grep $PREBUILD_SDK_CONTAINER_REGISTRY_PATH
Digests:
- us.gcr.io/apache-beam-testing/jenkins/beam_python3.6_sdk@sha256:b75418ff997849c8059c642cb1d22b19b9a1673c6da4710214eebd749ef55a31
Associated tags:
- 20210522-001408881410834
Tags:
- us.gcr.io/apache-beam-testing/jenkins/beam_python3.6_sdk:20210522-001408881410834
Deleted [us.gcr.io/apache-beam-testing/jenkins/beam_python3.6_sdk:20210522-001408881410834].
Deleted [us.gcr.io/apache-beam-testing/jenkins/beam_python3.6_sdk@sha256:b75418ff997849c8059c642cb1d22b19b9a1673c6da4710214eebd749ef55a31].
gcloud container images list-tags $PREBUILD_SDK_CONTAINER_REGISTRY_PATH/beam_python_prebuilt_sdk --format="get(digest)"
Digests:
- us.gcr.io/apache-beam-testing/jenkins/prebuild_python36_sdk/beam_python_prebuilt_sdk@sha256:ecde719f1ef1da3fbd3e9e1ee8b47cbf05c72d98eb5b85ec18cdc5c91d13e108
Associated tags:
- 870223e8-1b4a-4b7a-9299-a1f913cac5c1
Deleted [us.gcr.io/apache-beam-testing/jenkins/prebuild_python36_sdk/beam_python_prebuilt_sdk:870223e8-1b4a-4b7a-9299-a1f913cac5c1].
Deleted [us.gcr.io/apache-beam-testing/jenkins/prebuild_python36_sdk/beam_python_prebuilt_sdk@sha256:ecde719f1ef1da3fbd3e9e1ee8b47cbf05c72d98eb5b85ec18cdc5c91d13e108].
Digests:
- us.gcr.io/apache-beam-testing/jenkins/prebuild_python36_sdk/beam_python_prebuilt_sdk@sha256:fa2cf31698257b0fd8d5b27d1d42ca0f0b008fb2b74bf99a99d7997f1f9453b0
Associated tags:
- 369ece22-cc23-43cd-966d-432387f3fc5a
Deleted [us.gcr.io/apache-beam-testing/jenkins/prebuild_python36_sdk/beam_python_prebuilt_sdk:369ece22-cc23-43cd-966d-432387f3fc5a].
Deleted [us.gcr.io/apache-beam-testing/jenkins/prebuild_python36_sdk/beam_python_prebuilt_sdk@sha256:fa2cf31698257b0fd8d5b27d1d42ca0f0b008fb2b74bf99a99d7997f1f9453b0].
> Task :sdks:python:test-suites:dataflow:py36:validatesContainer FAILED
> Task :sdks:python:test-suites:dataflow:py38:validatesContainer
cleanup_container
docker images --format '{{.Repository}}:{{.Tag}}' | grep $PREBUILD_SDK_CONTAINER_REGISTRY_PATH
Digests:
- us.gcr.io/apache-beam-testing/jenkins/beam_python3.8_sdk@sha256:bdf1d2ad582f68db32a11b219ddad5539c52e064853fabe0d90a9e79e56fc649
Associated tags:
- 20210522-001452246218175
Tags:
- us.gcr.io/apache-beam-testing/jenkins/beam_python3.8_sdk:20210522-001452246218175
Deleted [us.gcr.io/apache-beam-testing/jenkins/beam_python3.8_sdk:20210522-001452246218175].
Deleted [us.gcr.io/apache-beam-testing/jenkins/beam_python3.8_sdk@sha256:bdf1d2ad582f68db32a11b219ddad5539c52e064853fabe0d90a9e79e56fc649].
gcloud container images list-tags $PREBUILD_SDK_CONTAINER_REGISTRY_PATH/beam_python_prebuilt_sdk --format="get(digest)"
Digests:
- us.gcr.io/apache-beam-testing/jenkins/prebuild_python38_sdk/beam_python_prebuilt_sdk@sha256:86e81e8a096609c48199bac39dc539d8936c7a7e2ef5a2ddeded9c67c1e7a19b
Associated tags:
- f639ec2e-7eae-49ad-b5b9-622d34af7405
Deleted [us.gcr.io/apache-beam-testing/jenkins/prebuild_python38_sdk/beam_python_prebuilt_sdk:f639ec2e-7eae-49ad-b5b9-622d34af7405].
Deleted [us.gcr.io/apache-beam-testing/jenkins/prebuild_python38_sdk/beam_python_prebuilt_sdk@sha256:86e81e8a096609c48199bac39dc539d8936c7a7e2ef5a2ddeded9c67c1e7a19b].
Digests:
- us.gcr.io/apache-beam-testing/jenkins/prebuild_python38_sdk/beam_python_prebuilt_sdk@sha256:ecf0bb7b813a7cdca4dd44ab3785ba5e219b90d90e0ad61389dee91e92ea3e5e
Associated tags:
- 979c937d-166c-4317-b7e6-371d468f82d8
Deleted [us.gcr.io/apache-beam-testing/jenkins/prebuild_python38_sdk/beam_python_prebuilt_sdk:979c937d-166c-4317-b7e6-371d468f82d8].
Deleted [us.gcr.io/apache-beam-testing/jenkins/prebuild_python38_sdk/beam_python_prebuilt_sdk@sha256:ecf0bb7b813a7cdca4dd44ab3785ba5e219b90d90e0ad61389dee91e92ea3e5e].
> Task :sdks:python:test-suites:dataflow:py38:validatesContainer FAILED
> Task :sdks:python:test-suites:dataflow:py37:validatesContainer
cleanup_container
docker images --format '{{.Repository}}:{{.Tag}}' | grep $PREBUILD_SDK_CONTAINER_REGISTRY_PATH
Digests:
- us.gcr.io/apache-beam-testing/jenkins/beam_python3.7_sdk@sha256:4aea31a91ea3cb2a1769e131be6bb2cf5dae1bb65064df3e2d7a039cab3c0eec
Associated tags:
- 20210522-001408753984242
Tags:
- us.gcr.io/apache-beam-testing/jenkins/beam_python3.7_sdk:20210522-001408753984242
Deleted [us.gcr.io/apache-beam-testing/jenkins/beam_python3.7_sdk:20210522-001408753984242].
Deleted [us.gcr.io/apache-beam-testing/jenkins/beam_python3.7_sdk@sha256:4aea31a91ea3cb2a1769e131be6bb2cf5dae1bb65064df3e2d7a039cab3c0eec].
gcloud container images list-tags $PREBUILD_SDK_CONTAINER_REGISTRY_PATH/beam_python_prebuilt_sdk --format="get(digest)"
Digests:
- us.gcr.io/apache-beam-testing/jenkins/prebuild_python37_sdk/beam_python_prebuilt_sdk@sha256:f9f4c5d185f38474adbad7f6d2bd9a17ef74118399cb58e42654f2dce951c35b
Associated tags:
- ad155749-ccc1-4d0f-94cc-88b31fc2a906
Deleted [us.gcr.io/apache-beam-testing/jenkins/prebuild_python37_sdk/beam_python_prebuilt_sdk:ad155749-ccc1-4d0f-94cc-88b31fc2a906].
Deleted [us.gcr.io/apache-beam-testing/jenkins/prebuild_python37_sdk/beam_python_prebuilt_sdk@sha256:f9f4c5d185f38474adbad7f6d2bd9a17ef74118399cb58e42654f2dce951c35b].
Digests:
- us.gcr.io/apache-beam-testing/jenkins/prebuild_python37_sdk/beam_python_prebuilt_sdk@sha256:2b438ccff607197b8503f631f40346161a98873c88e0488e43ce611411e23a00
Associated tags:
- 55985609-67df-4cd5-a100-745c21987527
Deleted [us.gcr.io/apache-beam-testing/jenkins/prebuild_python37_sdk/beam_python_prebuilt_sdk:55985609-67df-4cd5-a100-745c21987527].
Deleted [us.gcr.io/apache-beam-testing/jenkins/prebuild_python37_sdk/beam_python_prebuilt_sdk@sha256:2b438ccff607197b8503f631f40346161a98873c88e0488e43ce611411e23a00].
> Task :sdks:python:test-suites:dataflow:py37:validatesContainer FAILED
FAILURE: Build completed with 3 failures.
1: Task failed with an exception.
-----------
* Where:
Script '<https://ci-beam.apache.org/job/beam_PostCommit_Py_ValCont/ws/src/sdks/python/test-suites/dataflow/common.gradle'> line: 286
* What went wrong:
Execution failed for task ':sdks:python:test-suites:dataflow:py36:validatesContainer'.
> Process 'command 'sh'' finished with non-zero exit value 1
* Try:
Run with --stacktrace option to get the stack trace. Run with --info or --debug option to get more log output. Run with --scan to get full insights.
==============================================================================
2: Task failed with an exception.
-----------
* Where:
Script '<https://ci-beam.apache.org/job/beam_PostCommit_Py_ValCont/ws/src/sdks/python/test-suites/dataflow/common.gradle'> line: 286
* What went wrong:
Execution failed for task ':sdks:python:test-suites:dataflow:py38:validatesContainer'.
> Process 'command 'sh'' finished with non-zero exit value 1
* Try:
Run with --stacktrace option to get the stack trace. Run with --info or --debug option to get more log output. Run with --scan to get full insights.
==============================================================================
3: Task failed with an exception.
-----------
* Where:
Script '<https://ci-beam.apache.org/job/beam_PostCommit_Py_ValCont/ws/src/sdks/python/test-suites/dataflow/common.gradle'> line: 286
* What went wrong:
Execution failed for task ':sdks:python:test-suites:dataflow:py37:validatesContainer'.
> Process 'command 'sh'' finished with non-zero exit value 1
* Try:
Run with --stacktrace option to get the stack trace. Run with --info or --debug option to get more log output. Run with --scan to get full insights.
==============================================================================
* Get more help at https://help.gradle.org
Deprecated Gradle features were used in this build, making it incompatible with Gradle 7.0.
Use '--warning-mode all' to show the individual deprecation warnings.
See https://docs.gradle.org/6.8.3/userguide/command_line_interface.html#sec:command_line_warnings
BUILD FAILED in 1h 0m 51s
51 actionable tasks: 47 executed, 4 up-to-date
Publishing build scan...
https://gradle.com/s/mmad7ne5p4iti
Build step 'Invoke Gradle script' changed build result to FAILURE
Build step 'Invoke Gradle script' marked build as failure
---------------------------------------------------------------------
To unsubscribe, e-mail: builds-unsubscribe@beam.apache.org
For additional commands, e-mail: builds-help@beam.apache.org
Jenkins build is back to normal : beam_PostCommit_Py_ValCont #7807
Posted by Apache Jenkins Server <je...@builds.apache.org>.
See <https://ci-beam.apache.org/job/beam_PostCommit_Py_ValCont/7807/display/redirect>
---------------------------------------------------------------------
To unsubscribe, e-mail: builds-unsubscribe@beam.apache.org
For additional commands, e-mail: builds-help@beam.apache.org
Build failed in Jenkins: beam_PostCommit_Py_ValCont #7806
Posted by Apache Jenkins Server <je...@builds.apache.org>.
See <https://ci-beam.apache.org/job/beam_PostCommit_Py_ValCont/7806/display/redirect?page=changes>
Changes:
[Boyuan Zhang] [BEAM-10670] Update Twister2Runner.runTest with the same logic as
[noreply] Graph java 8 and 11 metrics separately (#14860)
------------------------------------------
[...truncated 107.61 KB...]
--show-capture=no \
--numprocesses=1 \
--timeout=900 \
--junitxml=$XUNIT_FILE \
--ignore-glob '.*py3\d?\.py$' \
--log-cli-level=INFO \
--test-pipeline-options=" \
--runner=TestDataflowRunner \
--project=$PROJECT \
--region=$REGION \
--sdk_container_image=$CONTAINER:$TAG \
--staging_location=$GCS_LOCATION/staging-validatesrunner-test \
--temp_location=$GCS_LOCATION/temp-validatesrunner-test \
--output=$GCS_LOCATION/output \
--sdk_location=$SDK_LOCATION \
--num_workers=1 \
--prebuild_sdk_container_base_image=$CONTAINER:$TAG \
--docker_registry_push_url=$PREBUILD_SDK_CONTAINER_REGISTRY_PATH"
> Task :sdks:python:test-suites:dataflow:py36:validatesContainer
function cleanup_container {
# Delete the container locally and remotely
docker rmi $CONTAINER:$TAG || echo "Failed to remove container image"
for image in $(docker images --format '{{.Repository}}:{{.Tag}}' | grep $PREBUILD_SDK_CONTAINER_REGISTRY_PATH)
do docker rmi $image || echo "Failed to remove prebuilt sdk container image"
done
gcloud --quiet container images delete $CONTAINER:$TAG || echo "Failed to delete container"
for digest in $(gcloud container images list-tags $PREBUILD_SDK_CONTAINER_REGISTRY_PATH/beam_python_prebuilt_sdk --format="get(digest)")
do gcloud container images delete $PREBUILD_SDK_CONTAINER_REGISTRY_PATH/beam_python_prebuilt_sdk@$digest --force-delete-tags --quiet || echo "Failed to remove prebuilt sdk container image"
done
echo "Removed the container"
}
trap cleanup_container EXIT
echo ">>> Successfully built and push container $CONTAINER"
cd sdks/python
SDK_LOCATION=$2
# Run ValidatesRunner tests on Google Cloud Dataflow service
echo ">>> RUNNING DATAFLOW RUNNER VALIDATESCONTAINER TEST"
pytest -o junit_suite_name=$IMAGE_NAME \
-m="it_validatescontainer" \
--show-capture=no \
--numprocesses=1 \
--timeout=900 \
--junitxml=$XUNIT_FILE \
--ignore-glob '.*py3\d?\.py$' \
--log-cli-level=INFO \
--test-pipeline-options=" \
--runner=TestDataflowRunner \
--project=$PROJECT \
--region=$REGION \
--sdk_container_image=$CONTAINER:$TAG \
--staging_location=$GCS_LOCATION/staging-validatesrunner-test \
--temp_location=$GCS_LOCATION/temp-validatesrunner-test \
--output=$GCS_LOCATION/output \
--sdk_location=$SDK_LOCATION \
--num_workers=1 \
--prebuild_sdk_container_base_image=$CONTAINER:$TAG \
--docker_registry_push_url=$PREBUILD_SDK_CONTAINER_REGISTRY_PATH"
> Task :sdks:python:test-suites:dataflow:py38:validatesContainer
function cleanup_container {
# Delete the container locally and remotely
docker rmi $CONTAINER:$TAG || echo "Failed to remove container image"
for image in $(docker images --format '{{.Repository}}:{{.Tag}}' | grep $PREBUILD_SDK_CONTAINER_REGISTRY_PATH)
do docker rmi $image || echo "Failed to remove prebuilt sdk container image"
done
gcloud --quiet container images delete $CONTAINER:$TAG || echo "Failed to delete container"
for digest in $(gcloud container images list-tags $PREBUILD_SDK_CONTAINER_REGISTRY_PATH/beam_python_prebuilt_sdk --format="get(digest)")
do gcloud container images delete $PREBUILD_SDK_CONTAINER_REGISTRY_PATH/beam_python_prebuilt_sdk@$digest --force-delete-tags --quiet || echo "Failed to remove prebuilt sdk container image"
done
echo "Removed the container"
}
trap cleanup_container EXIT
echo ">>> Successfully built and push container $CONTAINER"
cd sdks/python
SDK_LOCATION=$2
# Run ValidatesRunner tests on Google Cloud Dataflow service
echo ">>> RUNNING DATAFLOW RUNNER VALIDATESCONTAINER TEST"
pytest -o junit_suite_name=$IMAGE_NAME \
-m="it_validatescontainer" \
--show-capture=no \
--numprocesses=1 \
--timeout=900 \
--junitxml=$XUNIT_FILE \
--ignore-glob '.*py3\d?\.py$' \
--log-cli-level=INFO \
--test-pipeline-options=" \
--runner=TestDataflowRunner \
--project=$PROJECT \
--region=$REGION \
--sdk_container_image=$CONTAINER:$TAG \
--staging_location=$GCS_LOCATION/staging-validatesrunner-test \
--temp_location=$GCS_LOCATION/temp-validatesrunner-test \
--output=$GCS_LOCATION/output \
--sdk_location=$SDK_LOCATION \
--num_workers=1 \
--prebuild_sdk_container_base_image=$CONTAINER:$TAG \
--docker_registry_push_url=$PREBUILD_SDK_CONTAINER_REGISTRY_PATH"
> Task :sdks:python:test-suites:dataflow:py36:validatesContainer
cleanup_container
docker images --format '{{.Repository}}:{{.Tag}}' | grep $PREBUILD_SDK_CONTAINER_REGISTRY_PATH
Digests:
- us.gcr.io/apache-beam-testing/jenkins/beam_python3.6_sdk@sha256:87f89b5513ada1c05c42fb91af375bc32018b4b21e82787d0394a0e87b4da84a
Associated tags:
- 20210522-061645378291569
Tags:
- us.gcr.io/apache-beam-testing/jenkins/beam_python3.6_sdk:20210522-061645378291569
Deleted [us.gcr.io/apache-beam-testing/jenkins/beam_python3.6_sdk:20210522-061645378291569].
Deleted [us.gcr.io/apache-beam-testing/jenkins/beam_python3.6_sdk@sha256:87f89b5513ada1c05c42fb91af375bc32018b4b21e82787d0394a0e87b4da84a].
gcloud container images list-tags $PREBUILD_SDK_CONTAINER_REGISTRY_PATH/beam_python_prebuilt_sdk --format="get(digest)"
Digests:
- us.gcr.io/apache-beam-testing/jenkins/prebuild_python36_sdk/beam_python_prebuilt_sdk@sha256:f27886cab3f0058af7f24a0357a72a176e77ff388dd09a26c5023eb5073b9af5
Associated tags:
- f7d170ea-1197-472c-9d2a-0ded230c5df1
Deleted [us.gcr.io/apache-beam-testing/jenkins/prebuild_python36_sdk/beam_python_prebuilt_sdk:f7d170ea-1197-472c-9d2a-0ded230c5df1].
Deleted [us.gcr.io/apache-beam-testing/jenkins/prebuild_python36_sdk/beam_python_prebuilt_sdk@sha256:f27886cab3f0058af7f24a0357a72a176e77ff388dd09a26c5023eb5073b9af5].
Digests:
- us.gcr.io/apache-beam-testing/jenkins/prebuild_python36_sdk/beam_python_prebuilt_sdk@sha256:28d1eb1beb5230b1b44a7875d0a535911b2e5e8aaddd724b7732840b14c650d1
Associated tags:
- cc856883-9f8b-457d-9c95-7990573f6841
Deleted [us.gcr.io/apache-beam-testing/jenkins/prebuild_python36_sdk/beam_python_prebuilt_sdk:cc856883-9f8b-457d-9c95-7990573f6841].
> Task :sdks:python:test-suites:dataflow:py37:validatesContainer
cleanup_container
docker images --format '{{.Repository}}:{{.Tag}}' | grep $PREBUILD_SDK_CONTAINER_REGISTRY_PATH
> Task :sdks:python:test-suites:dataflow:py36:validatesContainer FAILED
Deleted [us.gcr.io/apache-beam-testing/jenkins/prebuild_python36_sdk/beam_python_prebuilt_sdk@sha256:28d1eb1beb5230b1b44a7875d0a535911b2e5e8aaddd724b7732840b14c650d1].
> Task :sdks:python:test-suites:dataflow:py37:validatesContainer
Digests:
- us.gcr.io/apache-beam-testing/jenkins/beam_python3.7_sdk@sha256:0ac274ccd851dd75094af121dff6f9113f4320a079bc52309901f1c0c4b17598
Associated tags:
- 20210522-061645346807227
Tags:
- us.gcr.io/apache-beam-testing/jenkins/beam_python3.7_sdk:20210522-061645346807227
Deleted [us.gcr.io/apache-beam-testing/jenkins/beam_python3.7_sdk:20210522-061645346807227].
Deleted [us.gcr.io/apache-beam-testing/jenkins/beam_python3.7_sdk@sha256:0ac274ccd851dd75094af121dff6f9113f4320a079bc52309901f1c0c4b17598].
gcloud container images list-tags $PREBUILD_SDK_CONTAINER_REGISTRY_PATH/beam_python_prebuilt_sdk --format="get(digest)"
Digests:
- us.gcr.io/apache-beam-testing/jenkins/prebuild_python37_sdk/beam_python_prebuilt_sdk@sha256:942a9e568a1e5130c7f3bed3283b4c72391b6be6ab6590e4c321b0b403056d70
Associated tags:
- 04d4fc1a-ee70-40dc-ae31-513959bc753e
Deleted [us.gcr.io/apache-beam-testing/jenkins/prebuild_python37_sdk/beam_python_prebuilt_sdk:04d4fc1a-ee70-40dc-ae31-513959bc753e].
> Task :sdks:python:test-suites:dataflow:py38:validatesContainer
cleanup_container
docker images --format '{{.Repository}}:{{.Tag}}' | grep $PREBUILD_SDK_CONTAINER_REGISTRY_PATH
Digests:
- us.gcr.io/apache-beam-testing/jenkins/beam_python3.8_sdk@sha256:7a9645b22bc3e26537f2611fd1431363696915bf78dddeb57997cd908fa3500a
Associated tags:
- 20210522-061706064765394
Tags:
- us.gcr.io/apache-beam-testing/jenkins/beam_python3.8_sdk:20210522-061706064765394
Deleted [us.gcr.io/apache-beam-testing/jenkins/beam_python3.8_sdk:20210522-061706064765394].
> Task :sdks:python:test-suites:dataflow:py37:validatesContainer FAILED
Deleted [us.gcr.io/apache-beam-testing/jenkins/prebuild_python37_sdk/beam_python_prebuilt_sdk@sha256:942a9e568a1e5130c7f3bed3283b4c72391b6be6ab6590e4c321b0b403056d70].
Digests:
- us.gcr.io/apache-beam-testing/jenkins/prebuild_python37_sdk/beam_python_prebuilt_sdk@sha256:e82f05b7c7bb6f1ce3c8dd675917ff618b104ce76cf25985edd463973ae79049
Associated tags:
- 51a7edaa-2802-431e-a450-82f4284e6bb2
Deleted [us.gcr.io/apache-beam-testing/jenkins/prebuild_python37_sdk/beam_python_prebuilt_sdk:51a7edaa-2802-431e-a450-82f4284e6bb2].
Deleted [us.gcr.io/apache-beam-testing/jenkins/prebuild_python37_sdk/beam_python_prebuilt_sdk@sha256:e82f05b7c7bb6f1ce3c8dd675917ff618b104ce76cf25985edd463973ae79049].
> Task :sdks:python:test-suites:dataflow:py38:validatesContainer
Deleted [us.gcr.io/apache-beam-testing/jenkins/beam_python3.8_sdk@sha256:7a9645b22bc3e26537f2611fd1431363696915bf78dddeb57997cd908fa3500a].
gcloud container images list-tags $PREBUILD_SDK_CONTAINER_REGISTRY_PATH/beam_python_prebuilt_sdk --format="get(digest)"
Digests:
- us.gcr.io/apache-beam-testing/jenkins/prebuild_python38_sdk/beam_python_prebuilt_sdk@sha256:1b46da9a5c5b0574ebeb115fe4d464f345a47fe39ff72ae3eef6ab4ade578221
Associated tags:
- f2cf2ea6-861d-4002-9f90-90cfaff1ce62
Deleted [us.gcr.io/apache-beam-testing/jenkins/prebuild_python38_sdk/beam_python_prebuilt_sdk:f2cf2ea6-861d-4002-9f90-90cfaff1ce62].
Deleted [us.gcr.io/apache-beam-testing/jenkins/prebuild_python38_sdk/beam_python_prebuilt_sdk@sha256:1b46da9a5c5b0574ebeb115fe4d464f345a47fe39ff72ae3eef6ab4ade578221].
Digests:
- us.gcr.io/apache-beam-testing/jenkins/prebuild_python38_sdk/beam_python_prebuilt_sdk@sha256:9e258399be20a0c93ae27eae38f1c5fee784e58cc588921aeef1dbf21a8e96a8
Associated tags:
- 9d50b88b-545b-480b-a35d-49ef1374092b
Deleted [us.gcr.io/apache-beam-testing/jenkins/prebuild_python38_sdk/beam_python_prebuilt_sdk:9d50b88b-545b-480b-a35d-49ef1374092b].
Deleted [us.gcr.io/apache-beam-testing/jenkins/prebuild_python38_sdk/beam_python_prebuilt_sdk@sha256:9e258399be20a0c93ae27eae38f1c5fee784e58cc588921aeef1dbf21a8e96a8].
> Task :sdks:python:test-suites:dataflow:py38:validatesContainer FAILED
FAILURE: Build completed with 3 failures.
1: Task failed with an exception.
-----------
* Where:
Script '<https://ci-beam.apache.org/job/beam_PostCommit_Py_ValCont/ws/src/sdks/python/test-suites/dataflow/common.gradle'> line: 286
* What went wrong:
Execution failed for task ':sdks:python:test-suites:dataflow:py36:validatesContainer'.
> Process 'command 'sh'' finished with non-zero exit value 1
* Try:
Run with --stacktrace option to get the stack trace. Run with --info or --debug option to get more log output. Run with --scan to get full insights.
==============================================================================
2: Task failed with an exception.
-----------
* Where:
Script '<https://ci-beam.apache.org/job/beam_PostCommit_Py_ValCont/ws/src/sdks/python/test-suites/dataflow/common.gradle'> line: 286
* What went wrong:
Execution failed for task ':sdks:python:test-suites:dataflow:py37:validatesContainer'.
> Process 'command 'sh'' finished with non-zero exit value 1
* Try:
Run with --stacktrace option to get the stack trace. Run with --info or --debug option to get more log output. Run with --scan to get full insights.
==============================================================================
3: Task failed with an exception.
-----------
* Where:
Script '<https://ci-beam.apache.org/job/beam_PostCommit_Py_ValCont/ws/src/sdks/python/test-suites/dataflow/common.gradle'> line: 286
* What went wrong:
Execution failed for task ':sdks:python:test-suites:dataflow:py38:validatesContainer'.
> Process 'command 'sh'' finished with non-zero exit value 1
* Try:
Run with --stacktrace option to get the stack trace. Run with --info or --debug option to get more log output. Run with --scan to get full insights.
==============================================================================
* Get more help at https://help.gradle.org
Deprecated Gradle features were used in this build, making it incompatible with Gradle 7.0.
Use '--warning-mode all' to show the individual deprecation warnings.
See https://docs.gradle.org/6.8.3/userguide/command_line_interface.html#sec:command_line_warnings
BUILD FAILED in 1h 3m 2s
51 actionable tasks: 47 executed, 4 up-to-date
Publishing build scan...
https://gradle.com/s/dk4c6scgftrjy
Build step 'Invoke Gradle script' changed build result to FAILURE
Build step 'Invoke Gradle script' marked build as failure
---------------------------------------------------------------------
To unsubscribe, e-mail: builds-unsubscribe@beam.apache.org
For additional commands, e-mail: builds-help@beam.apache.org