You are viewing a plain text version of this content. The canonical link for it is here.
Posted to dev@geronimo.apache.org by ga...@apache.org on 2010/10/14 01:56:53 UTC
[BUILD] branches/2.2: Failed for Revision: 1022324
Geronimo Revision: 1022324 built with tests included
See the full build-2000.log file at http://people.apache.org/builds/geronimo/server/binaries/2.2/20101013/build-2000.log
See the unit test reports at http://people.apache.org/builds/geronimo/server/binaries/2.2/20101013/unit-test-reports
[INFO] Copying 6 resources
[INFO] skip non existing resourceDirectory /home/geronimo/geronimo/2.2/framework/modules/geronimo-service-builder/src/test/filtered-resources
[INFO] Copying 3 resources
[INFO] [compiler:testCompile {execution: default-testCompile}]
[INFO] Compiling 8 source files to /home/geronimo/geronimo/2.2/framework/modules/geronimo-service-builder/target/test-classes
[WARNING] /home/geronimo/geronimo/2.2/framework/modules/geronimo-service-builder/src/test/java/org/apache/geronimo/deployment/MockGBean.java:[98,19] [deprecation] addOperation(java.lang.String) in org.apache.geronimo.gbean.GBeanInfoBuilder has been deprecated
[WARNING] /home/geronimo/geronimo/2.2/framework/modules/geronimo-service-builder/src/test/java/org/apache/geronimo/deployment/MockGBean.java:[99,19] [deprecation] addOperation(java.lang.String,java.lang.Class[]) in org.apache.geronimo.gbean.GBeanInfoBuilder has been deprecated
[INFO] [surefire:test {execution: default-test}]
[WARNING] Component returned which is not the same manager. Ignored. component=org.apache.maven.profiles.activation.SystemPropertyProfileActivator@c7a0c7a
[INFO] Surefire report directory: /home/geronimo/geronimo/2.2/framework/modules/geronimo-service-builder/target/surefire-reports
-------------------------------------------------------
T E S T S
-------------------------------------------------------
Running org.apache.geronimo.deployment.service.EnvironmentBuilderTest
Tests run: 3, Failures: 0, Errors: 0, Skipped: 0, Time elapsed: 0.459 sec
Running org.apache.geronimo.deployment.service.ClassLoadingRulesUtilTest
Tests run: 1, Failures: 0, Errors: 0, Skipped: 0, Time elapsed: 0.044 sec
Running org.apache.geronimo.deployment.service.ServiceConfigBuilderTest
Tests run: 2, Failures: 0, Errors: 0, Skipped: 0, Time elapsed: 0.938 sec
Running org.apache.geronimo.deployment.service.JavaBeanXmlAttributeEditorTest
Tests run: 2, Failures: 0, Errors: 0, Skipped: 0, Time elapsed: 0.461 sec
Results :
Tests run: 8, Failures: 0, Errors: 0, Skipped: 0
[INFO] [jar:jar {execution: default-jar}]
[INFO] Building jar: /home/geronimo/geronimo/2.2/framework/modules/geronimo-service-builder/target/geronimo-service-builder-2.2.1-SNAPSHOT.jar
[INFO] [ianal:verify-legal-files {execution: default}]
[INFO] Checking legal files in: geronimo-service-builder-2.2.1-SNAPSHOT.jar
[INFO] [install:install {execution: default-install}]
[INFO] Installing /home/geronimo/geronimo/2.2/framework/modules/geronimo-service-builder/target/geronimo-service-builder-2.2.1-SNAPSHOT.jar to /home/geronimo/.m2/repository/org/apache/geronimo/framework/geronimo-service-builder/2.2.1-SNAPSHOT/geronimo-service-builder-2.2.1-SNAPSHOT.jar
[INFO] ------------------------------------------------------------------------
[INFO] Building Geronimo Framework, Modules :: Deploy Tool
[INFO] task-segment: [install]
[INFO] ------------------------------------------------------------------------
[INFO] [genesis:validate-configuration {execution: default}]
[INFO] [enforcer:enforce {execution: default}]
[INFO] [remote-resources:process {execution: default}]
[INFO] [resources:resources {execution: default-resources}]
[INFO] Using 'UTF-8' encoding to copy filtered resources.
[INFO] skip non existing resourceDirectory /home/geronimo/geronimo/2.2/framework/modules/geronimo-deploy-tool/src/main/resources
[INFO] skip non existing resourceDirectory /home/geronimo/geronimo/2.2/framework/modules/geronimo-deploy-tool/src/main/filtered-resources
[INFO] Copying 3 resources
[INFO] [compiler:compile {execution: default-compile}]
[INFO] Compiling 25 source files to /home/geronimo/geronimo/2.2/framework/modules/geronimo-deploy-tool/target/classes
[INFO] ------------------------------------------------------------------------
[ERROR] BUILD FAILURE
[INFO] ------------------------------------------------------------------------
[INFO] Compilation failure
/home/geronimo/geronimo/2.2/framework/modules/geronimo-deploy-tool/src/main/java/org/apache/geronimo/deployment/cli/CommandEncrypt.java:[53,38] cannot find symbol
symbol : class EncryptionManagerWrapperGBean
location: class org.apache.geronimo.deployment.cli.CommandEncrypt
[INFO] ------------------------------------------------------------------------
[INFO] Trace
org.apache.maven.BuildFailureException: Compilation failure
/home/geronimo/geronimo/2.2/framework/modules/geronimo-deploy-tool/src/main/java/org/apache/geronimo/deployment/cli/CommandEncrypt.java:[53,38] cannot find symbol
symbol : class EncryptionManagerWrapperGBean
location: class org.apache.geronimo.deployment.cli.CommandEncrypt
at org.apache.maven.lifecycle.DefaultLifecycleExecutor.executeGoals(DefaultLifecycleExecutor.java:715)
at org.apache.maven.lifecycle.DefaultLifecycleExecutor.executeGoalWithLifecycle(DefaultLifecycleExecutor.java:556)
at org.apache.maven.lifecycle.DefaultLifecycleExecutor.executeGoal(DefaultLifecycleExecutor.java:535)
at org.apache.maven.lifecycle.DefaultLifecycleExecutor.executeGoalAndHandleFailures(DefaultLifecycleExecutor.java:387)
at org.apache.maven.lifecycle.DefaultLifecycleExecutor.executeTaskSegments(DefaultLifecycleExecutor.java:348)
at org.apache.maven.lifecycle.DefaultLifecycleExecutor.execute(DefaultLifecycleExecutor.java:180)
at org.apache.maven.DefaultMaven.doExecute(DefaultMaven.java:328)
at org.apache.maven.DefaultMaven.execute(DefaultMaven.java:138)
at org.apache.maven.cli.MavenCli.main(MavenCli.java:362)
at org.apache.maven.cli.compat.CompatibleMain.main(CompatibleMain.java:60)
at sun.reflect.NativeMethodAccessorImpl.invoke0(Native Method)
at sun.reflect.NativeMethodAccessorImpl.invoke(NativeMethodAccessorImpl.java:79)
at sun.reflect.DelegatingMethodAccessorImpl.invoke(DelegatingMethodAccessorImpl.java:43)
at java.lang.reflect.Method.invoke(Method.java:618)
at org.codehaus.classworlds.Launcher.launchEnhanced(Launcher.java:315)
at org.codehaus.classworlds.Launcher.launch(Launcher.java:255)
at org.codehaus.classworlds.Launcher.mainWithExitCode(Launcher.java:430)
at org.codehaus.classworlds.Launcher.main(Launcher.java:375)
Caused by: org.apache.maven.plugin.CompilationFailureException: Compilation failure
/home/geronimo/geronimo/2.2/framework/modules/geronimo-deploy-tool/src/main/java/org/apache/geronimo/deployment/cli/CommandEncrypt.java:[53,38] cannot find symbol
symbol : class EncryptionManagerWrapperGBean
location: class org.apache.geronimo.deployment.cli.CommandEncrypt
at org.apache.maven.plugin.AbstractCompilerMojo.execute(AbstractCompilerMojo.java:516)
at org.apache.maven.plugin.CompilerMojo.execute(CompilerMojo.java:114)
at org.apache.maven.plugin.DefaultPluginManager.executeMojo(DefaultPluginManager.java:490)
at org.apache.maven.lifecycle.DefaultLifecycleExecutor.executeGoals(DefaultLifecycleExecutor.java:694)
... 17 more
[INFO] ------------------------------------------------------------------------
[INFO] Total time: 8 minutes 55 seconds
[INFO] Finished at: Wed Oct 13 20:12:22 EDT 2010
[INFO] Final Memory: 160M/512M
[INFO] ------------------------------------------------------------------------
Re: [BUILD] branches/2.2: Failed for Revision: 1022324
Posted by Rex Wang <rw...@gmail.com>.
Should be fixed
2010/10/14 <ga...@apache.org>
> Geronimo Revision: 1022324 built with tests included
>
> See the full build-2000.log file at
> http://people.apache.org/builds/geronimo/server/binaries/2.2/20101013/build-2000.log
>
>
> See the unit test reports at
> http://people.apache.org/builds/geronimo/server/binaries/2.2/20101013/unit-test-reports
>
> [INFO] Copying 6 resources
> [INFO] skip non existing resourceDirectory
> /home/geronimo/geronimo/2.2/framework/modules/geronimo-service-builder/src/test/filtered-resources
> [INFO] Copying 3 resources
> [INFO] [compiler:testCompile {execution: default-testCompile}]
> [INFO] Compiling 8 source files to
> /home/geronimo/geronimo/2.2/framework/modules/geronimo-service-builder/target/test-classes
> [WARNING]
> /home/geronimo/geronimo/2.2/framework/modules/geronimo-service-builder/src/test/java/org/apache/geronimo/deployment/MockGBean.java:[98,19]
> [deprecation] addOperation(java.lang.String) in
> org.apache.geronimo.gbean.GBeanInfoBuilder has been deprecated
>
> [WARNING]
> /home/geronimo/geronimo/2.2/framework/modules/geronimo-service-builder/src/test/java/org/apache/geronimo/deployment/MockGBean.java:[99,19]
> [deprecation] addOperation(java.lang.String,java.lang.Class[]) in
> org.apache.geronimo.gbean.GBeanInfoBuilder has been deprecated
>
> [INFO] [surefire:test {execution: default-test}]
> [WARNING] Component returned which is not the same manager. Ignored.
> component=org.apache.maven.profiles.activation.SystemPropertyProfileActivator@c7a0c7a
> [INFO] Surefire report directory:
> /home/geronimo/geronimo/2.2/framework/modules/geronimo-service-builder/target/surefire-reports
>
> -------------------------------------------------------
> T E S T S
> -------------------------------------------------------
> Running org.apache.geronimo.deployment.service.EnvironmentBuilderTest
> Tests run: 3, Failures: 0, Errors: 0, Skipped: 0, Time elapsed: 0.459 sec
> Running org.apache.geronimo.deployment.service.ClassLoadingRulesUtilTest
> Tests run: 1, Failures: 0, Errors: 0, Skipped: 0, Time elapsed: 0.044 sec
> Running org.apache.geronimo.deployment.service.ServiceConfigBuilderTest
> Tests run: 2, Failures: 0, Errors: 0, Skipped: 0, Time elapsed: 0.938 sec
> Running
> org.apache.geronimo.deployment.service.JavaBeanXmlAttributeEditorTest
> Tests run: 2, Failures: 0, Errors: 0, Skipped: 0, Time elapsed: 0.461 sec
>
> Results :
>
> Tests run: 8, Failures: 0, Errors: 0, Skipped: 0
>
> [INFO] [jar:jar {execution: default-jar}]
> [INFO] Building jar:
> /home/geronimo/geronimo/2.2/framework/modules/geronimo-service-builder/target/geronimo-service-builder-2.2.1-SNAPSHOT.jar
> [INFO] [ianal:verify-legal-files {execution: default}]
> [INFO] Checking legal files in: geronimo-service-builder-2.2.1-SNAPSHOT.jar
> [INFO] [install:install {execution: default-install}]
> [INFO] Installing
> /home/geronimo/geronimo/2.2/framework/modules/geronimo-service-builder/target/geronimo-service-builder-2.2.1-SNAPSHOT.jar
> to
> /home/geronimo/.m2/repository/org/apache/geronimo/framework/geronimo-service-builder/2.2.1-SNAPSHOT/geronimo-service-builder-2.2.1-SNAPSHOT.jar
> [INFO]
> ------------------------------------------------------------------------
> [INFO] Building Geronimo Framework, Modules :: Deploy Tool
> [INFO] task-segment: [install]
> [INFO]
> ------------------------------------------------------------------------
> [INFO] [genesis:validate-configuration {execution: default}]
> [INFO] [enforcer:enforce {execution: default}]
> [INFO] [remote-resources:process {execution: default}]
> [INFO] [resources:resources {execution: default-resources}]
> [INFO] Using 'UTF-8' encoding to copy filtered resources.
> [INFO] skip non existing resourceDirectory
> /home/geronimo/geronimo/2.2/framework/modules/geronimo-deploy-tool/src/main/resources
> [INFO] skip non existing resourceDirectory
> /home/geronimo/geronimo/2.2/framework/modules/geronimo-deploy-tool/src/main/filtered-resources
> [INFO] Copying 3 resources
> [INFO] [compiler:compile {execution: default-compile}]
> [INFO] Compiling 25 source files to
> /home/geronimo/geronimo/2.2/framework/modules/geronimo-deploy-tool/target/classes
> [INFO]
> ------------------------------------------------------------------------
> [ERROR] BUILD FAILURE
> [INFO]
> ------------------------------------------------------------------------
> [INFO] Compilation failure
> /home/geronimo/geronimo/2.2/framework/modules/geronimo-deploy-tool/src/main/java/org/apache/geronimo/deployment/cli/CommandEncrypt.java:[53,38]
> cannot find symbol
> symbol : class EncryptionManagerWrapperGBean
> location: class org.apache.geronimo.deployment.cli.CommandEncrypt
>
>
> [INFO]
> ------------------------------------------------------------------------
> [INFO] Trace
> org.apache.maven.BuildFailureException: Compilation failure
> /home/geronimo/geronimo/2.2/framework/modules/geronimo-deploy-tool/src/main/java/org/apache/geronimo/deployment/cli/CommandEncrypt.java:[53,38]
> cannot find symbol
> symbol : class EncryptionManagerWrapperGBean
> location: class org.apache.geronimo.deployment.cli.CommandEncrypt
>
>
> at
> org.apache.maven.lifecycle.DefaultLifecycleExecutor.executeGoals(DefaultLifecycleExecutor.java:715)
> at
> org.apache.maven.lifecycle.DefaultLifecycleExecutor.executeGoalWithLifecycle(DefaultLifecycleExecutor.java:556)
> at
> org.apache.maven.lifecycle.DefaultLifecycleExecutor.executeGoal(DefaultLifecycleExecutor.java:535)
> at
> org.apache.maven.lifecycle.DefaultLifecycleExecutor.executeGoalAndHandleFailures(DefaultLifecycleExecutor.java:387)
> at
> org.apache.maven.lifecycle.DefaultLifecycleExecutor.executeTaskSegments(DefaultLifecycleExecutor.java:348)
> at
> org.apache.maven.lifecycle.DefaultLifecycleExecutor.execute(DefaultLifecycleExecutor.java:180)
> at org.apache.maven.DefaultMaven.doExecute(DefaultMaven.java:328)
> at org.apache.maven.DefaultMaven.execute(DefaultMaven.java:138)
> at org.apache.maven.cli.MavenCli.main(MavenCli.java:362)
> at
> org.apache.maven.cli.compat.CompatibleMain.main(CompatibleMain.java:60)
> at sun.reflect.NativeMethodAccessorImpl.invoke0(Native Method)
> at
> sun.reflect.NativeMethodAccessorImpl.invoke(NativeMethodAccessorImpl.java:79)
> at
> sun.reflect.DelegatingMethodAccessorImpl.invoke(DelegatingMethodAccessorImpl.java:43)
> at java.lang.reflect.Method.invoke(Method.java:618)
> at
> org.codehaus.classworlds.Launcher.launchEnhanced(Launcher.java:315)
> at org.codehaus.classworlds.Launcher.launch(Launcher.java:255)
> at
> org.codehaus.classworlds.Launcher.mainWithExitCode(Launcher.java:430)
> at org.codehaus.classworlds.Launcher.main(Launcher.java:375)
> Caused by: org.apache.maven.plugin.CompilationFailureException: Compilation
> failure
> /home/geronimo/geronimo/2.2/framework/modules/geronimo-deploy-tool/src/main/java/org/apache/geronimo/deployment/cli/CommandEncrypt.java:[53,38]
> cannot find symbol
> symbol : class EncryptionManagerWrapperGBean
> location: class org.apache.geronimo.deployment.cli.CommandEncrypt
>
>
> at
> org.apache.maven.plugin.AbstractCompilerMojo.execute(AbstractCompilerMojo.java:516)
> at
> org.apache.maven.plugin.CompilerMojo.execute(CompilerMojo.java:114)
> at
> org.apache.maven.plugin.DefaultPluginManager.executeMojo(DefaultPluginManager.java:490)
> at
> org.apache.maven.lifecycle.DefaultLifecycleExecutor.executeGoals(DefaultLifecycleExecutor.java:694)
> ... 17 more
> [INFO]
> ------------------------------------------------------------------------
> [INFO] Total time: 8 minutes 55 seconds
> [INFO] Finished at: Wed Oct 13 20:12:22 EDT 2010
> [INFO] Final Memory: 160M/512M
> [INFO]
> ------------------------------------------------------------------------
>
--
Lei Wang (Rex)
rwonly AT apache.org