You are viewing a plain text version of this content. The canonical link for it is here.
Posted to builds@beam.apache.org by Apache Jenkins Server <je...@builds.apache.org> on 2020/02/23 12:54:38 UTC
Build failed in Jenkins: beam_PostCommit_Python37 #1704
See <https://builds.apache.org/job/beam_PostCommit_Python37/1704/display/redirect>
Changes:
------------------------------------------
[...truncated 2.81 MB...]
urllib3.connectionpool: DEBUG: https://www.googleapis.com:443 "GET /bigquery/v2/projects/apache-beam-testing/queries/ff42390f-dfda-4ccf-9ddb-0fdbb7e762e5?maxResults=0&location=US HTTP/1.1" 200 None
urllib3.connectionpool: DEBUG: https://www.googleapis.com:443 "GET /bigquery/v2/projects/apache-beam-testing/datasets/_7357fab0f784d2a7327ddbe81cdd1f4ca7e429cd/tables/anona390bfeecdb556313e4fe2ca53d5d407bfa82d69/data HTTP/1.1" 200 None
apache_beam.io.gcp.tests.bigquery_matcher: INFO: Result of query is: []
apache_beam.io.gcp.bigquery_write_it_test: INFO: Deleting dataset python_write_to_table_15824598916206 in project apache-beam-testing
--------------------- >> end captured logging << ---------------------
<https://builds.apache.org/job/beam_PostCommit_Python37/ws/src/sdks/python/apache_beam/io/gcp/big_query_query_to_table_pipeline.py>:87: FutureWarning: _ReadFromBigQuery is experimental.
kms_key=kms_key)
<https://builds.apache.org/job/beam_PostCommit_Python37/ws/src/sdks/python/apache_beam/io/gcp/bigquery.py>:1655: BeamDeprecationWarning: options is deprecated since First stable release. References to <pipeline>.options will not be supported
temp_location = pcoll.pipeline.options.view_as(
<https://builds.apache.org/job/beam_PostCommit_Python37/ws/src/sdks/python/apache_beam/io/gcp/big_query_query_to_table_pipeline.py>:95: BeamDeprecationWarning: BigQuerySink is deprecated since 2.11.0. Use WriteToBigQuery instead.
kms_key=kms_key))
<https://builds.apache.org/job/beam_PostCommit_Python37/ws/src/sdks/python/apache_beam/io/gcp/bigquery_io_read_pipeline.py>:84: FutureWarning: _ReadFromBigQuery is experimental.
(options.view_as(GoogleCloudOptions).project, known_args.input_table))
<https://builds.apache.org/job/beam_PostCommit_Python37/ws/src/sdks/python/apache_beam/io/gcp/bigquery.py>:1655: BeamDeprecationWarning: options is deprecated since First stable release. References to <pipeline>.options will not be supported
temp_location = pcoll.pipeline.options.view_as(
<https://builds.apache.org/job/beam_PostCommit_Python37/ws/src/sdks/python/apache_beam/io/gcp/bigquery_read_it_test.py>:275: FutureWarning: _ReadFromBigQuery is experimental.
query=self.query, use_standard_sql=True, project=self.project))
<https://builds.apache.org/job/beam_PostCommit_Python37/ws/src/sdks/python/apache_beam/io/gcp/bigquery.py>:1655: BeamDeprecationWarning: options is deprecated since First stable release. References to <pipeline>.options will not be supported
temp_location = pcoll.pipeline.options.view_as(
<https://builds.apache.org/job/beam_PostCommit_Python37/ws/src/sdks/python/apache_beam/io/gcp/bigquery_read_it_test.py>:162: FutureWarning: _ReadFromBigQuery is experimental.
query=self.query, use_standard_sql=True, project=self.project))
<https://builds.apache.org/job/beam_PostCommit_Python37/ws/src/sdks/python/apache_beam/io/gcp/bigquery.py>:1655: BeamDeprecationWarning: options is deprecated since First stable release. References to <pipeline>.options will not be supported
temp_location = pcoll.pipeline.options.view_as(
<https://builds.apache.org/job/beam_PostCommit_Python37/ws/src/sdks/python/apache_beam/io/gcp/bigquery.py>:1463: BeamDeprecationWarning: options is deprecated since First stable release. References to <pipeline>.options will not be supported
self.table_reference.projectId = pcoll.pipeline.options.view_as(
<https://builds.apache.org/job/beam_PostCommit_Python37/ws/src/sdks/python/apache_beam/io/gcp/bigquery_file_loads.py>:818: BeamDeprecationWarning: options is deprecated since First stable release. References to <pipeline>.options will not be supported
temp_location = p.options.view_as(GoogleCloudOptions).temp_location
----------------------------------------------------------------------
XML: nosetests-postCommitIT-direct-py37.xml
----------------------------------------------------------------------
XML: <https://builds.apache.org/job/beam_PostCommit_Python37/ws/src/sdks/python/nosetests.xml>
----------------------------------------------------------------------
Ran 19 tests in 55.748s
FAILED (SKIP=1, failures=1)
> Task :sdks:python:test-suites:direct:py37:postCommitIT FAILED
> Task :sdks:python:test-suites:dataflow:py37:postCommitIT
<https://builds.apache.org/job/beam_PostCommit_Python37/ws/src/sdks/python/apache_beam/io/gcp/bigquery.py>:1466: BeamDeprecationWarning: options is deprecated since First stable release. References to <pipeline>.options will not be supported
Worker logs: https://console.cloud.google.com/dataflow/jobsDetail/locations/us-central1/jobs/2020-02-23_04_06_47-8931688225911934177?project=apache-beam-testing
Worker logs: https://console.cloud.google.com/dataflow/jobsDetail/locations/us-central1/jobs/2020-02-23_04_21_48-9744288063639125189?project=apache-beam-testing
experiments = p.options.view_as(DebugOptions).experiments or []
Worker logs: https://console.cloud.google.com/dataflow/jobsDetail/locations/us-central1/jobs/2020-02-23_04_30_27-16976427904577610026?project=apache-beam-testing
Worker logs: https://console.cloud.google.com/dataflow/jobsDetail/locations/us-central1/jobs/2020-02-23_04_38_27-16199857915960892529?project=apache-beam-testing
<https://builds.apache.org/job/beam_PostCommit_Python37/ws/src/sdks/python/apache_beam/io/gcp/bigquery.py>:1466: BeamDeprecationWarning: options is deprecated since First stable release. References to <pipeline>.options will not be supported
Worker logs: https://console.cloud.google.com/dataflow/jobsDetail/locations/us-central1/jobs/2020-02-23_04_45_31-4800613454935906585?project=apache-beam-testing
experiments = p.options.view_as(DebugOptions).experiments or []
<https://builds.apache.org/job/beam_PostCommit_Python37/ws/src/sdks/python/apache_beam/io/gcp/bigquery_file_loads.py>:818: BeamDeprecationWarning: options is deprecated since First stable release. References to <pipeline>.options will not be supported
temp_location = p.options.view_as(GoogleCloudOptions).temp_location
<https://builds.apache.org/job/beam_PostCommit_Python37/ws/src/sdks/python/apache_beam/io/gcp/bigquery.py>:1466: BeamDeprecationWarning: options is deprecated since First stable release. References to <pipeline>.options will not be supported
experiments = p.options.view_as(DebugOptions).experiments or []
<https://builds.apache.org/job/beam_PostCommit_Python37/ws/src/sdks/python/apache_beam/io/gcp/bigquery_file_loads.py>:818: BeamDeprecationWarning: options is deprecated since First stable release. References to <pipeline>.options will not be supported
temp_location = p.options.view_as(GoogleCloudOptions).temp_location
<https://builds.apache.org/job/beam_PostCommit_Python37/ws/src/sdks/python/apache_beam/runners/dataflow/dataflow_runner.py>:788: BeamDeprecationWarning: BigQuerySink is deprecated since 2.11.0. Use WriteToBigQuery instead.
kms_key=transform.kms_key))
Worker logs: https://console.cloud.google.com/dataflow/jobsDetail/locations/us-central1/jobs/2020-02-23_04_06_40-2135540913347198736?project=apache-beam-testing
<https://builds.apache.org/job/beam_PostCommit_Python37/ws/src/sdks/python/apache_beam/io/gcp/bigquery_test.py>:823: BeamDeprecationWarning: options is deprecated since First stable release. References to <pipeline>.options will not be supported
streaming = self.test_pipeline.options.view_as(StandardOptions).streaming
Worker logs: https://console.cloud.google.com/dataflow/jobsDetail/locations/us-central1/jobs/2020-02-23_04_23_41-18014216843275246899?project=apache-beam-testing
<https://builds.apache.org/job/beam_PostCommit_Python37/ws/src/sdks/python/apache_beam/io/gcp/bigquery.py>:1466: BeamDeprecationWarning: options is deprecated since First stable release. References to <pipeline>.options will not be supported
experiments = p.options.view_as(DebugOptions).experiments or []
Worker logs: https://console.cloud.google.com/dataflow/jobsDetail/locations/us-central1/jobs/2020-02-23_04_31_07-2028975080061175245?project=apache-beam-testing
<https://builds.apache.org/job/beam_PostCommit_Python37/ws/src/sdks/python/apache_beam/io/gcp/bigquery.py>:1463: BeamDeprecationWarning: options is deprecated since First stable release. References to <pipeline>.options will not be supported
self.table_reference.projectId = pcoll.pipeline.options.view_as(
Worker logs: https://console.cloud.google.com/dataflow/jobsDetail/locations/us-central1/jobs/2020-02-23_04_06_45-11659191454529870774?project=apache-beam-testing
<https://builds.apache.org/job/beam_PostCommit_Python37/ws/src/sdks/python/apache_beam/io/gcp/bigquery.py>:1466: BeamDeprecationWarning: options is deprecated since First stable release. References to <pipeline>.options will not be supported
Worker logs: https://console.cloud.google.com/dataflow/jobsDetail/locations/us-central1/jobs/2020-02-23_04_19_07-14748853707032069983?project=apache-beam-testing
Worker logs: https://console.cloud.google.com/dataflow/jobsDetail/locations/us-central1/jobs/2020-02-23_04_26_30-222315962498658182?project=apache-beam-testing
Worker logs: https://console.cloud.google.com/dataflow/jobsDetail/locations/us-central1/jobs/2020-02-23_04_33_45-12097053515542692368?project=apache-beam-testing
experiments = p.options.view_as(DebugOptions).experiments or []
Worker logs: https://console.cloud.google.com/dataflow/jobsDetail/locations/us-central1/jobs/2020-02-23_04_40_34-5436744891472488849?project=apache-beam-testing
<https://builds.apache.org/job/beam_PostCommit_Python37/ws/src/sdks/python/apache_beam/io/gcp/big_query_query_to_table_pipeline.py>:87: FutureWarning: _ReadFromBigQuery is experimental.
kms_key=kms_key)
Worker logs: https://console.cloud.google.com/dataflow/jobsDetail/locations/us-central1/jobs/2020-02-23_04_48_12-9254713323330868836?project=apache-beam-testing
<https://builds.apache.org/job/beam_PostCommit_Python37/ws/src/sdks/python/apache_beam/io/gcp/bigquery.py>:1655: BeamDeprecationWarning: options is deprecated since First stable release. References to <pipeline>.options will not be supported
temp_location = pcoll.pipeline.options.view_as(
<https://builds.apache.org/job/beam_PostCommit_Python37/ws/src/sdks/python/apache_beam/runners/dataflow/dataflow_runner.py>:788: BeamDeprecationWarning: BigQuerySink is deprecated since 2.11.0. Use WriteToBigQuery instead.
kms_key=transform.kms_key))
<https://builds.apache.org/job/beam_PostCommit_Python37/ws/src/sdks/python/apache_beam/io/gcp/big_query_query_to_table_pipeline.py>:87: FutureWarning: _ReadFromBigQuery is experimental.
kms_key=kms_key)
<https://builds.apache.org/job/beam_PostCommit_Python37/ws/src/sdks/python/apache_beam/io/gcp/bigquery.py>:1655: BeamDeprecationWarning: options is deprecated since First stable release. References to <pipeline>.options will not be supported
temp_location = pcoll.pipeline.options.view_as(
<https://builds.apache.org/job/beam_PostCommit_Python37/ws/src/sdks/python/apache_beam/runners/dataflow/dataflow_runner.py>:788: BeamDeprecationWarning: BigQuerySink is deprecated since 2.11.0. Use WriteToBigQuery instead.
kms_key=transform.kms_key))
<https://builds.apache.org/job/beam_PostCommit_Python37/ws/src/sdks/python/apache_beam/io/gcp/big_query_query_to_table_pipeline.py>:95: BeamDeprecationWarning: BigQuerySink is deprecated since 2.11.0. Use WriteToBigQuery instead.
kms_key=kms_key))
<https://builds.apache.org/job/beam_PostCommit_Python37/ws/src/sdks/python/apache_beam/io/gcp/big_query_query_to_table_pipeline.py>:87: FutureWarning: _ReadFromBigQuery is experimental.
kms_key=kms_key)
<https://builds.apache.org/job/beam_PostCommit_Python37/ws/src/sdks/python/apache_beam/io/gcp/bigquery.py>:1655: BeamDeprecationWarning: options is deprecated since First stable release. References to <pipeline>.options will not be supported
temp_location = pcoll.pipeline.options.view_as(
<https://builds.apache.org/job/beam_PostCommit_Python37/ws/src/sdks/python/apache_beam/runners/dataflow/dataflow_runner.py>:788: BeamDeprecationWarning: BigQuerySink is deprecated since 2.11.0. Use WriteToBigQuery instead.
kms_key=transform.kms_key))
<https://builds.apache.org/job/beam_PostCommit_Python37/ws/src/sdks/python/apache_beam/io/gcp/big_query_query_to_table_pipeline.py>:95: BeamDeprecationWarning: BigQuerySink is deprecated since 2.11.0. Use WriteToBigQuery instead.
kms_key=kms_key))
Worker logs: https://console.cloud.google.com/dataflow/jobsDetail/locations/us-central1/jobs/2020-02-23_04_06_41-375381774346810901?project=apache-beam-testing
Worker logs: https://console.cloud.google.com/dataflow/jobsDetail/locations/us-central1/jobs/2020-02-23_04_22_52-3766049729794042475?project=apache-beam-testing
<https://builds.apache.org/job/beam_PostCommit_Python37/ws/src/sdks/python/apache_beam/io/gcp/bigquery_read_it_test.py>:162: FutureWarning: _ReadFromBigQuery is experimental.
query=self.query, use_standard_sql=True, project=self.project))
<https://builds.apache.org/job/beam_PostCommit_Python37/ws/src/sdks/python/apache_beam/io/gcp/bigquery.py>:1655: BeamDeprecationWarning: options is deprecated since First stable release. References to <pipeline>.options will not be supported
Worker logs: https://console.cloud.google.com/dataflow/jobsDetail/locations/us-central1/jobs/2020-02-23_04_29_49-7035176831791597405?project=apache-beam-testing
temp_location = pcoll.pipeline.options.view_as(
Worker logs: https://console.cloud.google.com/dataflow/jobsDetail/locations/us-central1/jobs/2020-02-23_04_37_12-2867516654783298154?project=apache-beam-testing
<https://builds.apache.org/job/beam_PostCommit_Python37/ws/src/sdks/python/apache_beam/io/fileio_test.py>:303: FutureWarning: MatchAll is experimental.
| 'GetPath' >> beam.Map(lambda metadata: metadata.path))
<https://builds.apache.org/job/beam_PostCommit_Python37/ws/src/sdks/python/apache_beam/io/fileio_test.py>:316: FutureWarning: MatchAll is experimental.
Worker logs: https://console.cloud.google.com/dataflow/jobsDetail/locations/us-central1/jobs/2020-02-23_04_44_03-14558357371783799319?project=apache-beam-testing
| 'Checksums' >> beam.Map(compute_hash))
<https://builds.apache.org/job/beam_PostCommit_Python37/ws/src/sdks/python/apache_beam/io/fileio_test.py>:316: FutureWarning: ReadMatches is experimental.
| 'Checksums' >> beam.Map(compute_hash))
Worker logs: https://console.cloud.google.com/dataflow/jobsDetail/locations/us-central1/jobs/2020-02-23_04_06_42-14127864786051345556?project=apache-beam-testing
<https://builds.apache.org/job/beam_PostCommit_Python37/ws/src/sdks/python/apache_beam/io/gcp/bigquery_io_read_pipeline.py>:84: FutureWarning: _ReadFromBigQuery is experimental.
(options.view_as(GoogleCloudOptions).project, known_args.input_table))
Worker logs: https://console.cloud.google.com/dataflow/jobsDetail/locations/us-central1/jobs/2020-02-23_04_14_10-8800384348918610990?project=apache-beam-testing
Worker logs: https://console.cloud.google.com/dataflow/jobsDetail/locations/us-central1/jobs/2020-02-23_04_22_26-6950114146602208529?project=apache-beam-testing
Worker logs: https://console.cloud.google.com/dataflow/jobsDetail/locations/us-central1/jobs/2020-02-23_04_30_01-15991514040738320093?project=apache-beam-testing
<https://builds.apache.org/job/beam_PostCommit_Python37/ws/src/sdks/python/apache_beam/io/gcp/bigquery.py>:1655: BeamDeprecationWarning: options is deprecated since First stable release. References to <pipeline>.options will not be supported
temp_location = pcoll.pipeline.options.view_as(
Worker logs: https://console.cloud.google.com/dataflow/jobsDetail/locations/us-central1/jobs/2020-02-23_04_37_25-14083349872379977223?project=apache-beam-testing
Worker logs: https://console.cloud.google.com/dataflow/jobsDetail/locations/us-central1/jobs/2020-02-23_04_45_27-5278672189805609348?project=apache-beam-testing
<https://builds.apache.org/job/beam_PostCommit_Python37/ws/src/sdks/python/apache_beam/io/gcp/bigquery_io_read_pipeline.py>:84: FutureWarning: _ReadFromBigQuery is experimental.
(options.view_as(GoogleCloudOptions).project, known_args.input_table))
<https://builds.apache.org/job/beam_PostCommit_Python37/ws/src/sdks/python/apache_beam/io/gcp/bigquery.py>:1655: BeamDeprecationWarning: options is deprecated since First stable release. References to <pipeline>.options will not be supported
temp_location = pcoll.pipeline.options.view_as(
Worker logs: https://console.cloud.google.com/dataflow/jobsDetail/locations/us-central1/jobs/2020-02-23_04_06_40-5163459509983631935?project=apache-beam-testing
<https://builds.apache.org/job/beam_PostCommit_Python37/ws/src/sdks/python/apache_beam/runners/dataflow/dataflow_runner.py>:788: BeamDeprecationWarning: BigQuerySink is deprecated since 2.11.0. Use WriteToBigQuery instead.
kms_key=transform.kms_key))
Worker logs: https://console.cloud.google.com/dataflow/jobsDetail/locations/us-central1/jobs/2020-02-23_04_14_01-16694358524639760370?project=apache-beam-testing
<https://builds.apache.org/job/beam_PostCommit_Python37/ws/src/sdks/python/apache_beam/io/gcp/bigquery_read_it_test.py>:275: FutureWarning: _ReadFromBigQuery is experimental.
Worker logs: https://console.cloud.google.com/dataflow/jobsDetail/locations/us-central1/jobs/2020-02-23_04_22_49-3121006299878511773?project=apache-beam-testing
Worker logs: https://console.cloud.google.com/dataflow/jobsDetail/locations/us-central1/jobs/2020-02-23_04_30_12-12196558391705012971?project=apache-beam-testing
Worker logs: https://console.cloud.google.com/dataflow/jobsDetail/locations/us-central1/jobs/2020-02-23_04_36_59-6330456804582664472?project=apache-beam-testing
Worker logs: https://console.cloud.google.com/dataflow/jobsDetail/locations/us-central1/jobs/2020-02-23_04_43_40-18262719378445015670?project=apache-beam-testing
query=self.query, use_standard_sql=True, project=self.project))
<https://builds.apache.org/job/beam_PostCommit_Python37/ws/src/sdks/python/apache_beam/io/gcp/bigquery.py>:1655: BeamDeprecationWarning: options is deprecated since First stable release. References to <pipeline>.options will not be supported
temp_location = pcoll.pipeline.options.view_as(
Worker logs: https://console.cloud.google.com/dataflow/jobsDetail/locations/us-central1/jobs/2020-02-23_04_06_42-14742150107792200927?project=apache-beam-testing
Worker logs: https://console.cloud.google.com/dataflow/jobsDetail/locations/us-central1/jobs/2020-02-23_04_15_37-10213864288641438132?project=apache-beam-testing
<https://builds.apache.org/job/beam_PostCommit_Python37/ws/src/sdks/python/apache_beam/io/avroio.py>:205: UserWarning: Due to a known issue in avro-python3 package, it is recommended to use fastavro with Beam Avro IO on Python 3 until BEAM-6522 is addressed.
"Due to a known issue in avro-python3 package, it is "
Worker logs: https://console.cloud.google.com/dataflow/jobsDetail/locations/us-central1/jobs/2020-02-23_04_25_42-1572602057989478315?project=apache-beam-testing
Worker logs: https://console.cloud.google.com/dataflow/jobsDetail/locations/us-central1/jobs/2020-02-23_04_33_17-15060420508837081480?project=apache-beam-testing
<https://builds.apache.org/job/beam_PostCommit_Python37/ws/src/sdks/python/apache_beam/io/gcp/bigquery.py>:1466: BeamDeprecationWarning: options is deprecated since First stable release. References to <pipeline>.options will not be supported
Worker logs: https://console.cloud.google.com/dataflow/jobsDetail/locations/us-central1/jobs/2020-02-23_04_40_31-4782728029112757317?project=apache-beam-testing
Worker logs: https://console.cloud.google.com/dataflow/jobsDetail/locations/us-central1/jobs/2020-02-23_04_47_37-12259410953929704387?project=apache-beam-testing
experiments = p.options.view_as(DebugOptions).experiments or []
<https://builds.apache.org/job/beam_PostCommit_Python37/ws/src/sdks/python/apache_beam/io/gcp/bigquery_file_loads.py>:818: BeamDeprecationWarning: options is deprecated since First stable release. References to <pipeline>.options will not be supported
temp_location = p.options.view_as(GoogleCloudOptions).temp_location
<https://builds.apache.org/job/beam_PostCommit_Python37/ws/src/sdks/python/apache_beam/runners/dataflow/dataflow_runner.py>:788: BeamDeprecationWarning: BigQuerySink is deprecated since 2.11.0. Use WriteToBigQuery instead.
kms_key=transform.kms_key))
<https://builds.apache.org/job/beam_PostCommit_Python37/ws/src/sdks/python/apache_beam/runners/dataflow/dataflow_runner.py>:788: BeamDeprecationWarning: BigQuerySink is deprecated since 2.11.0. Use WriteToBigQuery instead.
kms_key=transform.kms_key))
<https://builds.apache.org/job/beam_PostCommit_Python37/ws/src/sdks/python/apache_beam/runners/dataflow/dataflow_runner.py>:788: BeamDeprecationWarning: BigQuerySink is deprecated since 2.11.0. Use WriteToBigQuery instead.
kms_key=transform.kms_key))
Worker logs: https://console.cloud.google.com/dataflow/jobsDetail/locations/us-central1/jobs/2020-02-23_04_06_47-5219049129958182771?project=apache-beam-testing
Worker logs: https://console.cloud.google.com/dataflow/jobsDetail/locations/us-central1/jobs/2020-02-23_04_15_25-9683774478497874748?project=apache-beam-testing
Worker logs: https://console.cloud.google.com/dataflow/jobsDetail/locations/us-central1/jobs/2020-02-23_04_22_26-15452747045615406126?project=apache-beam-testing
Worker logs: https://console.cloud.google.com/dataflow/jobsDetail/locations/us-central1/jobs/2020-02-23_04_29_51-5945410393333830066?project=apache-beam-testing
Worker logs: https://console.cloud.google.com/dataflow/jobsDetail/locations/us-central1/jobs/2020-02-23_04_36_59-14792588600601633820?project=apache-beam-testing
Worker logs: https://console.cloud.google.com/dataflow/jobsDetail/locations/us-central1/jobs/2020-02-23_04_43_52-3953901590099791846?project=apache-beam-testing
test_datastore_wordcount_it (apache_beam.examples.cookbook.datastore_wordcount_it_test.DatastoreWordCountIT) ... SKIP: This test still needs to be fixed on Python 3TODO: BEAM-4543
test_bigquery_tornadoes_it (apache_beam.examples.cookbook.bigquery_tornadoes_it_test.BigqueryTornadoesIT) ... ok
test_autocomplete_it (apache_beam.examples.complete.autocomplete_test.AutocompleteTest) ... ok
test_streaming_wordcount_it (apache_beam.examples.streaming_wordcount_it_test.StreamingWordCountIT) ... ok
test_leader_board_it (apache_beam.examples.complete.game.leader_board_it_test.LeaderBoardIT) ... ok
test_game_stats_it (apache_beam.examples.complete.game.game_stats_it_test.GameStatsIT) ... ok
test_wordcount_it (apache_beam.examples.wordcount_it_test.WordCountIT) ... ok
test_wordcount_fnapi_it (apache_beam.examples.wordcount_it_test.WordCountIT) ... ok
test_user_score_it (apache_beam.examples.complete.game.user_score_it_test.UserScoreIT) ... ok
test_hourly_team_score_it (apache_beam.examples.complete.game.hourly_team_score_it_test.HourlyTeamScoreIT) ... ok
test_avro_it (apache_beam.examples.fastavro_it_test.FastavroIT) ... ok
test_multiple_destinations_transform (apache_beam.io.gcp.bigquery_test.BigQueryStreamingInsertTransformIntegrationTests) ... ok
test_value_provider_transform (apache_beam.io.gcp.bigquery_test.BigQueryStreamingInsertTransformIntegrationTests) ... ok
test_iobase_source (apache_beam.io.gcp.bigquery_read_it_test.ReadTests) ... ok
test_native_source (apache_beam.io.gcp.bigquery_read_it_test.ReadTests) ... ok
test_datastore_write_limit (apache_beam.io.gcp.datastore_write_it_test.DatastoreWriteIT) ... SKIP: This test still needs to be fixed on Python 3TODO: BEAM-4543
test_iobase_source (apache_beam.io.gcp.bigquery_read_it_test.ReadNewTypesTests) ... ok
test_native_source (apache_beam.io.gcp.bigquery_read_it_test.ReadNewTypesTests) ... ok
test_copy (apache_beam.io.gcp.gcsio_integration_test.GcsIOIntegrationTest) ... ok
test_copy_batch (apache_beam.io.gcp.gcsio_integration_test.GcsIOIntegrationTest) ... ok
test_copy_batch_kms (apache_beam.io.gcp.gcsio_integration_test.GcsIOIntegrationTest) ... ok
test_copy_batch_rewrite_token (apache_beam.io.gcp.gcsio_integration_test.GcsIOIntegrationTest) ... ok
test_copy_kms (apache_beam.io.gcp.gcsio_integration_test.GcsIOIntegrationTest) ... ok
test_copy_rewrite_token (apache_beam.io.gcp.gcsio_integration_test.GcsIOIntegrationTest) ... ok
test_bigquery_read_1M_python (apache_beam.io.gcp.bigquery_io_read_it_test.BigqueryIOReadIT) ... ok
test_bigquery_read_custom_1M_python (apache_beam.io.gcp.bigquery_io_read_it_test.BigqueryIOReadIT) ... ok
test_bqfl_streaming (apache_beam.io.gcp.bigquery_file_loads_test.BigQueryFileLoadsIT) ... SKIP: TestStream is not supported on TestDataflowRunner
test_multiple_destinations_transform (apache_beam.io.gcp.bigquery_file_loads_test.BigQueryFileLoadsIT) ... ok
test_one_job_fails_all_jobs_fail (apache_beam.io.gcp.bigquery_file_loads_test.BigQueryFileLoadsIT) ... ok
test_transform_on_gcs (apache_beam.io.fileio_test.MatchIntegrationTest) ... ok
test_parquetio_it (apache_beam.io.parquetio_it_test.TestParquetIT) ... ok
test_file_loads (apache_beam.io.gcp.bigquery_test.PubSubBigQueryIT) ... SKIP: https://issuetracker.google.com/issues/118375066
test_streaming_inserts (apache_beam.io.gcp.bigquery_test.PubSubBigQueryIT) ... ok
test_basic_execution (apache_beam.testing.test_stream_it_test.TestStreamIntegrationTests) ... SKIP: The "TestDataflowRunner", does not support the TestStream transform. Supported runners: ['DirectRunner', 'SwitchingDirectRunner']
Tests that the TestStream supports emitting to multiple PCollections. ... SKIP: The "TestDataflowRunner", does not support the TestStream transform. Supported runners: ['DirectRunner', 'SwitchingDirectRunner']
Tests that the TestStream can independently control output watermarks. ... SKIP: The "TestDataflowRunner", does not support the TestStream transform. Supported runners: ['DirectRunner', 'SwitchingDirectRunner']
test_streaming_data_only (apache_beam.io.gcp.pubsub_integration_test.PubSubIntegrationTest) ... ok
test_streaming_with_attributes (apache_beam.io.gcp.pubsub_integration_test.PubSubIntegrationTest) ... ok
Runs streaming Dataflow job and verifies that user metrics are reported ... ok
test_datastore_write_limit (apache_beam.io.gcp.datastore.v1new.datastore_write_it_test.DatastoreWriteIT) ... ok
test_job_python_from_python_it (apache_beam.transforms.external_it_test.ExternalTransformIT) ... ok
test_metrics_fnapi_it (apache_beam.runners.dataflow.dataflow_exercise_metrics_pipeline_test.ExerciseMetricsPipelineTest) ... ok
test_metrics_it (apache_beam.runners.dataflow.dataflow_exercise_metrics_pipeline_test.ExerciseMetricsPipelineTest) ... ok
test_big_query_write (apache_beam.io.gcp.bigquery_write_it_test.BigQueryWriteIntegrationTests) ... ok
test_big_query_write_new_types (apache_beam.io.gcp.bigquery_write_it_test.BigQueryWriteIntegrationTests) ... ok
test_big_query_write_schema_autodetect (apache_beam.io.gcp.bigquery_write_it_test.BigQueryWriteIntegrationTests) ... SKIP: DataflowRunner does not support schema autodetection
test_big_query_write_without_schema (apache_beam.io.gcp.bigquery_write_it_test.BigQueryWriteIntegrationTests) ... ok
test_big_query_legacy_sql (apache_beam.io.gcp.big_query_query_to_table_it_test.BigQueryQueryToTableIT) ... ok
test_big_query_new_types (apache_beam.io.gcp.big_query_query_to_table_it_test.BigQueryQueryToTableIT) ... ok
test_big_query_new_types_native (apache_beam.io.gcp.big_query_query_to_table_it_test.BigQueryQueryToTableIT) ... ok
test_big_query_standard_sql (apache_beam.io.gcp.big_query_query_to_table_it_test.BigQueryQueryToTableIT) ... ok
test_big_query_standard_sql_kms_key_native (apache_beam.io.gcp.big_query_query_to_table_it_test.BigQueryQueryToTableIT) ... ok
----------------------------------------------------------------------
XML: nosetests-postCommitIT-df-py37.xml
----------------------------------------------------------------------
XML: <https://builds.apache.org/job/beam_PostCommit_Python37/ws/src/sdks/python/nosetests.xml>
----------------------------------------------------------------------
Ran 52 tests in 2898.546s
OK (SKIP=8)
FAILURE: Build failed with an exception.
* Where:
Build file '<https://builds.apache.org/job/beam_PostCommit_Python37/ws/src/sdks/python/test-suites/direct/py37/build.gradle'> line: 51
* What went wrong:
Execution failed for task ':sdks:python:test-suites:direct:py37:postCommitIT'.
> Process 'command 'sh'' finished with non-zero exit value 1
* Try:
Run with --stacktrace option to get the stack trace. Run with --info or --debug option to get more log output. Run with --scan to get full insights.
* Get more help at https://help.gradle.org
Deprecated Gradle features were used in this build, making it incompatible with Gradle 6.0.
Use '--warning-mode all' to show the individual deprecation warnings.
See https://docs.gradle.org/5.2.1/userguide/command_line_interface.html#sec:command_line_warnings
BUILD FAILED in 49m 52s
85 actionable tasks: 64 executed, 21 from cache
Publishing build scan...
https://gradle.com/s/ynhbfv4kp5x5k
Build step 'Invoke Gradle script' changed build result to FAILURE
Build step 'Invoke Gradle script' marked build as failure
---------------------------------------------------------------------
To unsubscribe, e-mail: builds-unsubscribe@beam.apache.org
For additional commands, e-mail: builds-help@beam.apache.org
Jenkins build is back to normal : beam_PostCommit_Python37 #1706
Posted by Apache Jenkins Server <je...@builds.apache.org>.
See <https://builds.apache.org/job/beam_PostCommit_Python37/1706/display/redirect>
---------------------------------------------------------------------
To unsubscribe, e-mail: builds-unsubscribe@beam.apache.org
For additional commands, e-mail: builds-help@beam.apache.org
Build failed in Jenkins: beam_PostCommit_Python37 #1705
Posted by Apache Jenkins Server <je...@builds.apache.org>.
See <https://builds.apache.org/job/beam_PostCommit_Python37/1705/display/redirect>
Changes:
------------------------------------------
[...truncated 2.59 MB...]
[flink-runner-job-invoker] INFO org.apache.beam.runners.flink.FlinkPipelineRunner - __metricscontainers : MetricQueryResults(Counters(42read/Read/_SDFBoundedSourceWrapper/Impulse.None/SplitAndSize0/beam:env:external:v1:0:beam:metric:element_count:v1 {PCOLLECTION=ref_PCollection_PCollection_1/SplitAndSize0}: 1, 42read/Read/_SDFBoundedSourceWrapper/Impulse.None/SplitAndSize0/beam:env:external:v1:0:beam:metric:pardo_execution_time:start_bundle_msecs:v1 {PTRANSFORM=ref_AppliedPTransform_assert_that/Group/Flatten_27}: 0, 42read/Read/_SDFBoundedSourceWrapper/Impulse.None/beam:env:external:v1:0:beam:metric:element_count:v1 {PCOLLECTION=ref_PCollection_PCollection_1}: 1, 42read/Read/_SDFBoundedSourceWrapper/Impulse.None/SplitAndSize0/beam:env:external:v1:0:beam:metric:pardo_execution_time:process_bundle_msecs:v1 {PTRANSFORM=ref_AppliedPTransform_read/Read/_SDFBoundedSourceWrapper/ParDo(SDFBoundedSourceDoFn)_6/ProcessSizedElementsAndRestrictions0}: 0, 26assert_that/Create/Impulse.None/beam:env:external:v1:0:beam:metric:element_count:v1 {PCOLLECTION=ref_PCollection_PCollection_9}: 1, 42assert_that/Group/GroupByKey/GroupByWindow.None/beam:env:external:v1:0:beam:metric:pardo_execution_time:process_bundle_msecs:v1 {PTRANSFORM=fn/read/ref_PCollection_PCollection_19:0}: 0, 42read/Read/_SDFBoundedSourceWrapper/Impulse.None/beam:env:external:v1:0:beam:metric:pardo_execution_time:finish_bundle_msecs:v1 {PTRANSFORM=ref_AppliedPTransform_read/Read/_SDFBoundedSourceWrapper/ParDo(SDFBoundedSourceDoFn)_6/PairWithRestriction0}: 0, 42read/Read/_SDFBoundedSourceWrapper/Impulse.None/SplitAndSize0/beam:env:external:v1:0:beam:metric:pardo_execution_time:process_bundle_msecs:v1 {PTRANSFORM=fn/read/ref_PCollection_PCollection_1/SplitAndSize0:0}: 0, 26assert_that/Create/Impulse.None/beam:env:external:v1:0:beam:metric:pardo_execution_time:start_bundle_msecs:v1 {PTRANSFORM=ref_AppliedPTransform_assert_that/Create/FlatMap(<lambda at core.py:2627>)_19}: 0, 42read/Read/_SDFBoundedSourceWrapper/Impulse.None/beam:env:external:v1:0:beam:metric:pardo_execution_time:process_bundle_msecs:v1 {PTRANSFORM=ref_AppliedPTransform_read/Read/_SDFBoundedSourceWrapper/ParDo(SDFBoundedSourceDoFn)_6/SplitAndSize0}: 0, 42assert_that/Group/GroupByKey/GroupByWindow.None/beam:env:external:v1:0:beam:metric:element_count:v1 {PCOLLECTION=ref_PCollection_PCollection_21}: 1, 42read/Read/_SDFBoundedSourceWrapper/Impulse.None/SplitAndSize0/beam:env:external:v1:0:beam:metric:ptransform_execution_time:total_msecs:v1 {PTRANSFORM=ref_AppliedPTransform_assert_that/Group/pair_with_1_26}: 0, 26assert_that/Create/Impulse.None/beam:env:external:v1:0:beam:metric:ptransform_execution_time:total_msecs:v1 {PTRANSFORM=ref_AppliedPTransform_assert_that/Group/Flatten_27}: 0, 42assert_that/Group/GroupByKey/GroupByWindow.None/beam:env:external:v1:0:beam:metric:element_count:v1 {PCOLLECTION=ref_PCollection_PCollection_22}: 1, 26assert_that/Create/Impulse.None/beam:env:external:v1:0:beam:metric:pardo_execution_time:process_bundle_msecs:v1 {PTRANSFORM=ref_AppliedPTransform_assert_that/Create/FlatMap(<lambda at core.py:2627>)_19}: 0, 42assert_that/Group/GroupByKey/GroupByWindow.None/beam:env:external:v1:0:beam:metric:element_count:v1 {PCOLLECTION=ref_PCollection_PCollection_20}: 1, 42read/Read/_SDFBoundedSourceWrapper/Impulse.None/SplitAndSize0/beam:env:external:v1:0:beam:metric:pardo_execution_time:finish_bundle_msecs:v1 {PTRANSFORM=ref_AppliedPTransform_read/Read/_SDFBoundedSourceWrapper/ParDo(SDFBoundedSourceDoFn)_6/ProcessSizedElementsAndRestrictions0}: 0, 42read/Read/_SDFBoundedSourceWrapper/Impulse.None/SplitAndSize0/beam:env:external:v1:0:beam:metric:pardo_execution_time:process_bundle_msecs:v1 {PTRANSFORM=ref_AppliedPTransform_assert_that/Group/Flatten_27}: 0, 42read/Read/_SDFBoundedSourceWrapper/Impulse.None/SplitAndSize0/beam:env:external:v1:0:beam:metric:pardo_execution_time:finish_bundle_msecs:v1 {PTRANSFORM=fn/read/ref_PCollection_PCollection_1/SplitAndSize0:0}: 0, 26assert_that/Create/Impulse.None/beam:env:external:v1:0:beam:metric:ptransform_execution_time:total_msecs:v1 {PTRANSFORM=fn/read/ref_PCollection_PCollection_9:0}: 0, 42read/Read/_SDFBoundedSourceWrapper/Impulse.None/SplitAndSize0/beam:env:external:v1:0:beam:metric:ptransform_execution_time:total_msecs:v1 {PTRANSFORM=fn/read/ref_PCollection_PCollection_1/SplitAndSize0:0}: 0, 26assert_that/Create/Impulse.None/beam:env:external:v1:0:beam:metric:pardo_execution_time:process_bundle_msecs:v1 {PTRANSFORM=fn/write/ref_PCollection_PCollection_16:1:0}: 0, 26assert_that/Create/Impulse.None/beam:env:external:v1:0:beam:metric:pardo_execution_time:finish_bundle_msecs:v1 {PTRANSFORM=fn/write/ref_PCollection_PCollection_16:1:0}: 0, 47read/_PassThroughThenCleanup/Create/Map(decode).None/beam:env:external:v1:0:beam:metric:ptransform_execution_time:total_msecs:v1 {PTRANSFORM=fn/read/ref_PCollection_PCollection_7:0}: 0, 42read/Read/_SDFBoundedSourceWrapper/Impulse.None/SplitAndSize0/beam:env:external:v1:0:beam:metric:pardo_execution_time:finish_bundle_msecs:v1 {PTRANSFORM=ref_AppliedPTransform_assert_that/Group/Flatten_27}: 0, 42read/Read/_SDFBoundedSourceWrapper/Impulse.None/SplitAndSize0/beam:env:external:v1:0:beam:metric:ptransform_execution_time:total_msecs:v1 {PTRANSFORM=ref_AppliedPTransform_read/Read/_SDFBoundedSourceWrapper/ParDo(SDFBoundedSourceDoFn)_6/ProcessSizedElementsAndRestrictions0}: 0, 43read/_PassThroughThenCleanup/Create/Impulse.None/beam:env:external:v1:0:beam:metric:ptransform_execution_time:total_msecs:v1 {PTRANSFORM=ref_AppliedPTransform_read/_PassThroughThenCleanup/Create/FlatMap(<lambda at core.py:2627>)_12}: 0, 42assert_that/Group/GroupByKey/GroupByWindow.None/beam:env:external:v1:0:beam:metric:pardo_execution_time:start_bundle_msecs:v1 {PTRANSFORM=fn/read/ref_PCollection_PCollection_19:0}: 0, 42read/Read/_SDFBoundedSourceWrapper/Impulse.None/beam:env:external:v1:0:beam:metric:ptransform_execution_time:total_msecs:v1 {PTRANSFORM=fn/read/ref_PCollection_PCollection_1:0}: 0, 42assert_that/Group/GroupByKey/GroupByWindow.None/beam:env:external:v1:0:beam:metric:pardo_execution_time:finish_bundle_msecs:v1 {PTRANSFORM=fn/read/ref_PCollection_PCollection_19:0}: 0, 42read/Read/_SDFBoundedSourceWrapper/Impulse.None/beam:env:external:v1:0:beam:metric:pardo_execution_time:start_bundle_msecs:v1 {PTRANSFORM=ref_AppliedPTransform_read/Read/_SDFBoundedSourceWrapper/ParDo(SDFBoundedSourceDoFn)_6/PairWithRestriction0}: 0, 26assert_that/Create/Impulse.None/beam:env:external:v1:0:beam:metric:ptransform_execution_time:total_msecs:v1 {PTRANSFORM=ref_AppliedPTransform_assert_that/Group/pair_with_0_25}: 0, 47read/_PassThroughThenCleanup/Create/Map(decode).None/beam:env:external:v1:0:beam:metric:pardo_execution_time:start_bundle_msecs:v1 {PTRANSFORM=ref_AppliedPTransform_read/_PassThroughThenCleanup/ParDo(RemoveJsonFiles)_15}: 0, 42read/Read/_SDFBoundedSourceWrapper/Impulse.None/beam:env:external:v1:0:beam:metric:pardo_execution_time:process_bundle_msecs:v1 {PTRANSFORM=ref_AppliedPTransform_read/Read/_SDFBoundedSourceWrapper/ParDo(SDFBoundedSourceDoFn)_6/PairWithRestriction0}: 0, 42read/Read/_SDFBoundedSourceWrapper/Impulse.None/SplitAndSize0/beam:env:external:v1:0:beam:metric:pardo_execution_time:start_bundle_msecs:v1 {PTRANSFORM=ref_AppliedPTransform_assert_that/ToVoidKey_23}: 0, 43read/_PassThroughThenCleanup/Create/Impulse.None/beam:env:external:v1:0:beam:metric:pardo_execution_time:start_bundle_msecs:v1 {PTRANSFORM=fn/read/ref_PCollection_PCollection_5:0}: 0, 43read/_PassThroughThenCleanup/Create/Impulse.None/beam:env:external:v1:0:beam:metric:pardo_execution_time:process_bundle_msecs:v1 {PTRANSFORM=fn/read/ref_PCollection_PCollection_5:0}: 0, 43read/_PassThroughThenCleanup/Create/Impulse.None/beam:env:external:v1:0:beam:metric:pardo_execution_time:finish_bundle_msecs:v1 {PTRANSFORM=fn/read/ref_PCollection_PCollection_5:0}: 0, 42assert_that/Group/GroupByKey/GroupByWindow.None/beam:env:external:v1:0:beam:metric:pardo_execution_time:start_bundle_msecs:v1 {PTRANSFORM=ref_AppliedPTransform_assert_that/Unkey_33}: 0, 42read/Read/_SDFBoundedSourceWrapper/Impulse.None/SplitAndSize0/beam:env:external:v1:0:beam:metric:element_count:v1 {PCOLLECTION=ref_PCollection_PCollection_16:0}: 4, 43read/_PassThroughThenCleanup/Create/Impulse.None/beam:env:external:v1:0:beam:metric:ptransform_execution_time:total_msecs:v1 {PTRANSFORM=ref_AppliedPTransform_read/_PassThroughThenCleanup/Create/Map(decode)_14}: 0, 43read/_PassThroughThenCleanup/Create/Impulse.None/beam:env:external:v1:0:beam:metric:pardo_execution_time:process_bundle_msecs:v1 {PTRANSFORM=ref_AppliedPTransform_read/_PassThroughThenCleanup/Create/Map(decode)_14}: 0, 26assert_that/Create/Impulse.None/beam:env:external:v1:0:beam:metric:element_count:v1 {PCOLLECTION=ref_PCollection_PCollection_10}: 1, 47read/_PassThroughThenCleanup/Create/Map(decode).None/beam:env:external:v1:0:beam:metric:pardo_execution_time:process_bundle_msecs:v1 {PTRANSFORM=ref_AppliedPTransform_read/_PassThroughThenCleanup/ParDo(RemoveJsonFiles)_15}: 0, 47read/_PassThroughThenCleanup/Create/Map(decode).None/beam:env:external:v1:0:beam:metric:pardo_execution_time:finish_bundle_msecs:v1 {PTRANSFORM=ref_AppliedPTransform_read/_PassThroughThenCleanup/ParDo(RemoveJsonFiles)_15}: 0, 42read/Read/_SDFBoundedSourceWrapper/Impulse.None/SplitAndSize0/beam:env:external:v1:0:beam:metric:pardo_execution_time:finish_bundle_msecs:v1 {PTRANSFORM=ref_AppliedPTransform_assert_that/WindowInto(WindowIntoFn)_22}: 0, 42read/Read/_SDFBoundedSourceWrapper/Impulse.None/beam:env:external:v1:0:beam:metric:pardo_execution_time:process_bundle_msecs:v1 {PTRANSFORM=fn/write/ref_PCollection_PCollection_1/SplitAndSize0:0}: 0, 26assert_that/Create/Impulse.None/beam:env:external:v1:0:beam:metric:element_count:v1 {PCOLLECTION=ref_PCollection_PCollection_11}: 1, 42read/Read/_SDFBoundedSourceWrapper/Impulse.None/SplitAndSize0/beam:env:external:v1:0:beam:metric:pardo_execution_time:start_bundle_msecs:v1 {PTRANSFORM=ref_AppliedPTransform_assert_that/WindowInto(WindowIntoFn)_22}: 0, 42read/Read/_SDFBoundedSourceWrapper/Impulse.None/beam:env:external:v1:0:beam:metric:ptransform_execution_time:total_msecs:v1 {PTRANSFORM=fn/write/ref_PCollection_PCollection_1/SplitAndSize0:0}: 0, 42read/Read/_SDFBoundedSourceWrapper/Impulse.None/SplitAndSize0/beam:env:external:v1:0:beam:metric:pardo_execution_time:process_bundle_msecs:v1 {PTRANSFORM=ref_AppliedPTransform_assert_that/WindowInto(WindowIntoFn)_22}: 0, 42read/Read/_SDFBoundedSourceWrapper/Impulse.None/SplitAndSize0/beam:env:external:v1:0:beam:metric:ptransform_execution_time:total_msecs:v1 {PTRANSFORM=ref_AppliedPTransform_assert_that/ToVoidKey_23}: 0, 42read/Read/_SDFBoundedSourceWrapper/Impulse.None/SplitAndSize0/beam:env:external:v1:0:beam:metric:ptransform_execution_time:total_msecs:v1 {PTRANSFORM=fn/write/ref_PCollection_PCollection_16:0:0}: 0, 42assert_that/Group/GroupByKey/GroupByWindow.None/beam:env:external:v1:0:beam:metric:element_count:v1 {PCOLLECTION=ref_PCollection_PCollection_19}: 1, 42assert_that/Group/GroupByKey/GroupByWindow.None/beam:env:external:v1:0:beam:metric:pardo_execution_time:finish_bundle_msecs:v1 {PTRANSFORM=ref_AppliedPTransform_assert_that/Unkey_33}: 0, 42read/Read/_SDFBoundedSourceWrapper/Impulse.None/beam:env:external:v1:0:beam:metric:pardo_execution_time:start_bundle_msecs:v1 {PTRANSFORM=ref_AppliedPTransform_read/Read/_SDFBoundedSourceWrapper/ParDo(SDFBoundedSourceDoFn)_6/SplitAndSize0}: 0, 42assert_that/Group/GroupByKey/GroupByWindow.None/beam:env:external:v1:0:beam:metric:pardo_execution_time:start_bundle_msecs:v1 {PTRANSFORM=ref_AppliedPTransform_assert_that/Group/Map(_merge_tagged_vals_under_key)_32}: 0, 26assert_that/Create/Impulse.None/beam:env:external:v1:0:beam:metric:pardo_execution_time:start_bundle_msecs:v1 {PTRANSFORM=fn/write/ref_PCollection_PCollection_16:1:0}: 0, 42read/Read/_SDFBoundedSourceWrapper/Impulse.None/SplitAndSize0/beam:env:external:v1:0:beam:metric:pardo_execution_time:start_bundle_msecs:v1 {PTRANSFORM=fn/read/ref_PCollection_PCollection_1/SplitAndSize0:0}: 0, 42read/Read/_SDFBoundedSourceWrapper/Impulse.None/beam:env:external:v1:0:beam:metric:pardo_execution_time:finish_bundle_msecs:v1 {PTRANSFORM=ref_AppliedPTransform_read/Read/_SDFBoundedSourceWrapper/ParDo(SDFBoundedSourceDoFn)_6/SplitAndSize0}: 0, 26assert_that/Create/Impulse.None/beam:env:external:v1:0:beam:metric:ptransform_execution_time:total_msecs:v1 {PTRANSFORM=ref_AppliedPTransform_assert_that/Create/Map(decode)_21}: 0, 26assert_that/Create/Impulse.None/beam:env:external:v1:0:beam:metric:element_count:v1 {PCOLLECTION=ref_PCollection_PCollection_14}: 1, 42read/Read/_SDFBoundedSourceWrapper/Impulse.None/SplitAndSize0/beam:env:external:v1:0:beam:metric:ptransform_execution_time:total_msecs:v1 {PTRANSFORM=ref_AppliedPTransform_read/_PassThroughThenCleanup/ParDo(PassThrough)/ParDo(PassThrough)_9}: 0, 42assert_that/Group/GroupByKey/GroupByWindow.None/beam:env:external:v1:0:beam:metric:ptransform_execution_time:total_msecs:v1 {PTRANSFORM=fn/read/ref_PCollection_PCollection_19:0}: 0, 42read/Read/_SDFBoundedSourceWrapper/Impulse.None/beam:env:external:v1:0:beam:metric:pardo_execution_time:finish_bundle_msecs:v1 {PTRANSFORM=fn/read/ref_PCollection_PCollection_1:0}: 0, 26assert_that/Create/Impulse.None/beam:env:external:v1:0:beam:metric:pardo_execution_time:process_bundle_msecs:v1 {PTRANSFORM=ref_AppliedPTransform_assert_that/Create/Map(decode)_21}: 0, 42assert_that/Group/GroupByKey/GroupByWindow.None/beam:env:external:v1:0:beam:metric:ptransform_execution_time:total_msecs:v1 {PTRANSFORM=ref_AppliedPTransform_assert_that/Unkey_33}: 0, 43read/_PassThroughThenCleanup/Create/Impulse.None/beam:env:external:v1:0:beam:metric:ptransform_execution_time:total_msecs:v1 {PTRANSFORM=fn/read/ref_PCollection_PCollection_5:0}: 0, 47read/_PassThroughThenCleanup/Create/Map(decode).None/beam:env:external:v1:0:beam:metric:pardo_execution_time:start_bundle_msecs:v1 {PTRANSFORM=fn/read/ref_PCollection_PCollection_7:0}: 0, 26assert_that/Create/Impulse.None/beam:env:external:v1:0:beam:metric:pardo_execution_time:finish_bundle_msecs:v1 {PTRANSFORM=ref_AppliedPTransform_assert_that/Create/Map(decode)_21}: 0, 26assert_that/Create/Impulse.None/beam:env:external:v1:0:beam:metric:pardo_execution_time:finish_bundle_msecs:v1 {PTRANSFORM=ref_AppliedPTransform_assert_that/Group/pair_with_0_25}: 0, 26assert_that/Create/Impulse.None/beam:env:external:v1:0:beam:metric:pardo_execution_time:start_bundle_msecs:v1 {PTRANSFORM=ref_AppliedPTransform_assert_that/Create/Map(decode)_21}: 0, 26assert_that/Create/Impulse.None/beam:env:external:v1:0:beam:metric:pardo_execution_time:start_bundle_msecs:v1 {PTRANSFORM=ref_AppliedPTransform_assert_that/Group/pair_with_0_25}: 0, 47read/_PassThroughThenCleanup/Create/Map(decode).None/beam:env:external:v1:0:beam:metric:pardo_execution_time:process_bundle_msecs:v1 {PTRANSFORM=fn/read/ref_PCollection_PCollection_7:0}: 0, 47read/_PassThroughThenCleanup/Create/Map(decode).None/beam:env:external:v1:0:beam:metric:pardo_execution_time:finish_bundle_msecs:v1 {PTRANSFORM=fn/read/ref_PCollection_PCollection_7:0}: 0, 42assert_that/Group/GroupByKey/GroupByWindow.None/beam:env:external:v1:0:beam:metric:pardo_execution_time:process_bundle_msecs:v1 {PTRANSFORM=ref_AppliedPTransform_assert_that/Group/Map(_merge_tagged_vals_under_key)_32}: 0, 42assert_that/Group/GroupByKey/GroupByWindow.None/beam:env:external:v1:0:beam:metric:pardo_execution_time:finish_bundle_msecs:v1 {PTRANSFORM=ref_AppliedPTransform_assert_that/Group/Map(_merge_tagged_vals_under_key)_32}: 0, 43read/_PassThroughThenCleanup/Create/Impulse.None/beam:env:external:v1:0:beam:metric:pardo_execution_time:finish_bundle_msecs:v1 {PTRANSFORM=fn/write/ref_PCollection_PCollection_7:0}: 0, 42read/Read/_SDFBoundedSourceWrapper/Impulse.None/beam:env:external:v1:0:beam:metric:pardo_execution_time:start_bundle_msecs:v1 {PTRANSFORM=fn/read/ref_PCollection_PCollection_1:0}: 0, 42assert_that/Group/GroupByKey/GroupByWindow.None/beam:env:external:v1:0:beam:metric:pardo_execution_time:process_bundle_msecs:v1 {PTRANSFORM=ref_AppliedPTransform_assert_that/Unkey_33}: 0, 42read/Read/_SDFBoundedSourceWrapper/Impulse.None/beam:env:external:v1:0:beam:metric:pardo_execution_time:process_bundle_msecs:v1 {PTRANSFORM=fn/read/ref_PCollection_PCollection_1:0}: 0, 42read/Read/_SDFBoundedSourceWrapper/Impulse.None/beam:env:external:v1:0:beam:metric:element_count:v1 {PCOLLECTION=ref_PCollection_PCollection_1/PairWithRestriction0}: 1, 43read/_PassThroughThenCleanup/Create/Impulse.None/beam:env:external:v1:0:beam:metric:pardo_execution_time:process_bundle_msecs:v1 {PTRANSFORM=fn/write/ref_PCollection_PCollection_7:0}: 0, 42read/Read/_SDFBoundedSourceWrapper/Impulse.None/SplitAndSize0/beam:env:external:v1:0:beam:metric:pardo_execution_time:process_bundle_msecs:v1 {PTRANSFORM=fn/write/ref_PCollection_PCollection_4:0}: 0, 42read/Read/_SDFBoundedSourceWrapper/Impulse.None/SplitAndSize0/beam:env:external:v1:0:beam:metric:pardo_execution_time:finish_bundle_msecs:v1 {PTRANSFORM=fn/write/ref_PCollection_PCollection_4:0}: 0, 43read/_PassThroughThenCleanup/Create/Impulse.None/beam:env:external:v1:0:beam:metric:element_count:v1 {PCOLLECTION=ref_PCollection_PCollection_6}: 1, 42read/Read/_SDFBoundedSourceWrapper/Impulse.None/SplitAndSize0/beam:env:external:v1:0:beam:metric:element_count:v1 {PCOLLECTION=ref_PCollection_PCollection_12}: 4, 26assert_that/Create/Impulse.None/beam:env:external:v1:0:beam:metric:pardo_execution_time:process_bundle_msecs:v1 {PTRANSFORM=ref_AppliedPTransform_assert_that/Group/pair_with_0_25}: 0, 47read/_PassThroughThenCleanup/Create/Map(decode).None/beam:env:external:v1:0:beam:metric:element_count:v1 {PCOLLECTION=ref_PCollection_PCollection_7}: 1, 26assert_that/Create/Impulse.None/beam:env:external:v1:0:beam:metric:pardo_execution_time:start_bundle_msecs:v1 {PTRANSFORM=fn/read/ref_PCollection_PCollection_9:0}: 0, 43read/_PassThroughThenCleanup/Create/Impulse.None/beam:env:external:v1:0:beam:metric:pardo_execution_time:start_bundle_msecs:v1 {PTRANSFORM=fn/write/ref_PCollection_PCollection_7:0}: 0, 47read/_PassThroughThenCleanup/Create/Map(decode).None/beam:env:external:v1:0:beam:metric:element_count:v1 {PCOLLECTION=ref_PCollection_PCollection_8}: 0, 43read/_PassThroughThenCleanup/Create/Impulse.None/beam:env:external:v1:0:beam:metric:pardo_execution_time:finish_bundle_msecs:v1 {PTRANSFORM=ref_AppliedPTransform_read/_PassThroughThenCleanup/Create/Map(decode)_14}: 0, 42read/Read/_SDFBoundedSourceWrapper/Impulse.None/SplitAndSize0/beam:env:external:v1:0:beam:metric:pardo_execution_time:start_bundle_msecs:v1 {PTRANSFORM=fn/write/ref_PCollection_PCollection_4:0}: 0, 43read/_PassThroughThenCleanup/Create/Impulse.None/beam:env:external:v1:0:beam:metric:element_count:v1 {PCOLLECTION=ref_PCollection_PCollection_7}: 1, 26assert_that/Create/Impulse.None/beam:env:external:v1:0:beam:metric:pardo_execution_time:finish_bundle_msecs:v1 {PTRANSFORM=fn/read/ref_PCollection_PCollection_9:0}: 0, 43read/_PassThroughThenCleanup/Create/Impulse.None/beam:env:external:v1:0:beam:metric:element_count:v1 {PCOLLECTION=ref_PCollection_PCollection_5}: 1, 42read/Read/_SDFBoundedSourceWrapper/Impulse.None/beam:env:external:v1:0:beam:metric:pardo_execution_time:start_bundle_msecs:v1 {PTRANSFORM=fn/write/ref_PCollection_PCollection_1/SplitAndSize0:0}: 0, 26assert_that/Create/Impulse.None/beam:env:external:v1:0:beam:metric:ptransform_execution_time:total_msecs:v1 {PTRANSFORM=ref_AppliedPTransform_assert_that/Create/FlatMap(<lambda at core.py:2627>)_19}: 0, 42read/Read/_SDFBoundedSourceWrapper/Impulse.None/beam:env:external:v1:0:beam:metric:element_count:v1 {PTRANSFORM=ref_AppliedPTransform_read/Read/_SDFBoundedSourceWrapper/ParDo(SDFBoundedSourceDoFn)_6/PairWithRestriction0, TAG=None}: 1, 42read/Read/_SDFBoundedSourceWrapper/Impulse.None/beam:env:external:v1:0:beam:metric:element_count:v1 {PTRANSFORM=ref_AppliedPTransform_read/Read/_SDFBoundedSourceWrapper/ParDo(SDFBoundedSourceDoFn)_6/SplitAndSize0, TAG=None}: 1, 26assert_that/Create/Impulse.None/beam:env:external:v1:0:beam:metric:pardo_execution_time:process_bundle_msecs:v1 {PTRANSFORM=fn/read/ref_PCollection_PCollection_9:0}: 0, 42read/Read/_SDFBoundedSourceWrapper/Impulse.None/beam:env:external:v1:0:beam:metric:pardo_execution_time:finish_bundle_msecs:v1 {PTRANSFORM=fn/write/ref_PCollection_PCollection_1/SplitAndSize0:0}: 0, 26assert_that/Create/Impulse.None/beam:env:external:v1:0:beam:metric:element_count:v1 {PCOLLECTION=ref_PCollection_PCollection_16:1}: 1, 42read/Read/_SDFBoundedSourceWrapper/Impulse.None/SplitAndSize0/beam:env:external:v1:0:beam:metric:element_count:v1 {PCOLLECTION=ref_PCollection_PCollection_13}: 4, 42read/Read/_SDFBoundedSourceWrapper/Impulse.None/SplitAndSize0/beam:env:external:v1:0:beam:metric:element_count:v1 {PCOLLECTION=ref_PCollection_PCollection_15}: 4, 42read/Read/_SDFBoundedSourceWrapper/Impulse.None/SplitAndSize0/beam:env:external:v1:0:beam:metric:pardo_execution_time:process_bundle_msecs:v1 {PTRANSFORM=fn/write/ref_PCollection_PCollection_16:0:0}: 0, 42read/Read/_SDFBoundedSourceWrapper/Impulse.None/SplitAndSize0/beam:env:external:v1:0:beam:metric:pardo_execution_time:finish_bundle_msecs:v1 {PTRANSFORM=fn/write/ref_PCollection_PCollection_16:0:0}: 0, 42read/Read/_SDFBoundedSourceWrapper/Impulse.None/SplitAndSize0/beam:env:external:v1:0:beam:metric:pardo_execution_time:start_bundle_msecs:v1 {PTRANSFORM=ref_AppliedPTransform_assert_that/Group/pair_with_1_26}: 0, 47read/_PassThroughThenCleanup/Create/Map(decode).None/beam:env:external:v1:0:beam:metric:ptransform_execution_time:total_msecs:v1 {PTRANSFORM=ref_AppliedPTransform_read/_PassThroughThenCleanup/ParDo(RemoveJsonFiles)_15}: 0, 42read/Read/_SDFBoundedSourceWrapper/Impulse.None/SplitAndSize0/beam:env:external:v1:0:beam:metric:ptransform_execution_time:total_msecs:v1 {PTRANSFORM=ref_AppliedPTransform_assert_that/Group/Flatten_27}: 0, 42read/Read/_SDFBoundedSourceWrapper/Impulse.None/SplitAndSize0/beam:env:external:v1:0:beam:metric:pardo_execution_time:finish_bundle_msecs:v1 {PTRANSFORM=ref_AppliedPTransform_read/_PassThroughThenCleanup/ParDo(PassThrough)/ParDo(PassThrough)_9}: 0, 43read/_PassThroughThenCleanup/Create/Impulse.None/beam:env:external:v1:0:beam:metric:pardo_execution_time:start_bundle_msecs:v1 {PTRANSFORM=ref_AppliedPTransform_read/_PassThroughThenCleanup/Create/Map(decode)_14}: 0, 26assert_that/Create/Impulse.None/beam:env:external:v1:0:beam:metric:ptransform_execution_time:total_msecs:v1 {PTRANSFORM=fn/write/ref_PCollection_PCollection_16:1:0}: 0, 26assert_that/Create/Impulse.None/beam:env:external:v1:0:beam:metric:pardo_execution_time:process_bundle_msecs:v1 {PTRANSFORM=ref_AppliedPTransform_assert_that/Group/Flatten_27}: 0, 42read/Read/_SDFBoundedSourceWrapper/Impulse.None/SplitAndSize0/beam:env:external:v1:0:beam:metric:pardo_execution_time:start_bundle_msecs:v1 {PTRANSFORM=ref_AppliedPTransform_read/_PassThroughThenCleanup/ParDo(PassThrough)/ParDo(PassThrough)_9}: 0, 43read/_PassThroughThenCleanup/Create/Impulse.None/beam:env:external:v1:0:beam:metric:pardo_execution_time:finish_bundle_msecs:v1 {PTRANSFORM=ref_AppliedPTransform_read/_PassThroughThenCleanup/Create/FlatMap(<lambda at core.py:2627>)_12}: 0, 26assert_that/Create/Impulse.None/beam:env:external:v1:0:beam:metric:pardo_execution_time:start_bundle_msecs:v1 {PTRANSFORM=ref_AppliedPTransform_assert_that/Group/Flatten_27}: 0, 42read/Read/_SDFBoundedSourceWrapper/Impulse.None/SplitAndSize0/beam:env:external:v1:0:beam:metric:pardo_execution_time:process_bundle_msecs:v1 {PTRANSFORM=ref_AppliedPTransform_read/_PassThroughThenCleanup/ParDo(PassThrough)/ParDo(PassThrough)_9}: 0, 42assert_that/Group/GroupByKey/GroupByWindow.None/beam:env:external:v1:0:beam:metric:pardo_execution_time:finish_bundle_msecs:v1 {PTRANSFORM=ref_AppliedPTransform_assert_that/Match_34}: 0, 43read/_PassThroughThenCleanup/Create/Impulse.None/beam:env:external:v1:0:beam:metric:pardo_execution_time:process_bundle_msecs:v1 {PTRANSFORM=ref_AppliedPTransform_read/_PassThroughThenCleanup/Create/FlatMap(<lambda at core.py:2627>)_12}: 0, 42assert_that/Group/GroupByKey/GroupByWindow.None/beam:env:external:v1:0:beam:metric:pardo_execution_time:start_bundle_msecs:v1 {PTRANSFORM=ref_AppliedPTransform_assert_that/Match_34}: 0, 42read/Read/_SDFBoundedSourceWrapper/Impulse.None/SplitAndSize0/beam:env:external:v1:0:beam:metric:ptransform_execution_time:total_msecs:v1 {PTRANSFORM=fn/write/ref_PCollection_PCollection_4:0}: 0, 43read/_PassThroughThenCleanup/Create/Impulse.None/beam:env:external:v1:0:beam:metric:pardo_execution_time:start_bundle_msecs:v1 {PTRANSFORM=ref_AppliedPTransform_read/_PassThroughThenCleanup/Create/FlatMap(<lambda at core.py:2627>)_12}: 0, 42read/Read/_SDFBoundedSourceWrapper/Impulse.None/SplitAndSize0/beam:env:external:v1:0:beam:metric:pardo_execution_time:start_bundle_msecs:v1 {PTRANSFORM=ref_AppliedPTransform_read/Read/_SDFBoundedSourceWrapper/ParDo(SDFBoundedSourceDoFn)_6/ProcessSizedElementsAndRestrictions0}: 0, 42assert_that/Group/GroupByKey/GroupByWindow.None/beam:env:external:v1:0:beam:metric:ptransform_execution_time:total_msecs:v1 {PTRANSFORM=ref_AppliedPTransform_assert_that/Group/Map(_merge_tagged_vals_under_key)_32}: 0, 42assert_that/Group/GroupByKey/GroupByWindow.None/beam:env:external:v1:0:beam:metric:pardo_execution_time:process_bundle_msecs:v1 {PTRANSFORM=ref_AppliedPTransform_assert_that/Match_34}: 0, 42read/Read/_SDFBoundedSourceWrapper/Impulse.None/SplitAndSize0/beam:env:external:v1:0:beam:metric:element_count:v1 {PCOLLECTION=ref_PCollection_PCollection_2}: 4, 42read/Read/_SDFBoundedSourceWrapper/Impulse.None/SplitAndSize0/beam:env:external:v1:0:beam:metric:pardo_execution_time:process_bundle_msecs:v1 {PTRANSFORM=ref_AppliedPTransform_assert_that/Group/pair_with_1_26}: 0, 42read/Read/_SDFBoundedSourceWrapper/Impulse.None/beam:env:external:v1:0:beam:metric:ptransform_execution_time:total_msecs:v1 {PTRANSFORM=ref_AppliedPTransform_read/Read/_SDFBoundedSourceWrapper/ParDo(SDFBoundedSourceDoFn)_6/SplitAndSize0}: 0, 42read/Read/_SDFBoundedSourceWrapper/Impulse.None/SplitAndSize0/beam:env:external:v1:0:beam:metric:element_count:v1 {PCOLLECTION=ref_PCollection_PCollection_4}: 0, 43read/_PassThroughThenCleanup/Create/Impulse.None/beam:env:external:v1:0:beam:metric:ptransform_execution_time:total_msecs:v1 {PTRANSFORM=fn/write/ref_PCollection_PCollection_7:0}: 0, 42read/Read/_SDFBoundedSourceWrapper/Impulse.None/beam:env:external:v1:0:beam:metric:element_count:v1 {PCOLLECTION=ref_PCollection_PCollection_1/SplitAndSize0}: 1, 42read/Read/_SDFBoundedSourceWrapper/Impulse.None/SplitAndSize0/beam:env:external:v1:0:beam:metric:element_count:v1 {PCOLLECTION=ref_PCollection_PCollection_3}: 4, 42read/Read/_SDFBoundedSourceWrapper/Impulse.None/beam:env:external:v1:0:beam:metric:ptransform_execution_time:total_msecs:v1 {PTRANSFORM=ref_AppliedPTransform_read/Read/_SDFBoundedSourceWrapper/ParDo(SDFBoundedSourceDoFn)_6/PairWithRestriction0}: 0, 42read/Read/_SDFBoundedSourceWrapper/Impulse.None/SplitAndSize0/beam:env:external:v1:0:beam:metric:pardo_execution_time:start_bundle_msecs:v1 {PTRANSFORM=fn/write/ref_PCollection_PCollection_16:0:0}: 0, 42assert_that/Group/GroupByKey/GroupByWindow.None/beam:env:external:v1:0:beam:metric:ptransform_execution_time:total_msecs:v1 {PTRANSFORM=ref_AppliedPTransform_assert_that/Match_34}: 0, 42read/Read/_SDFBoundedSourceWrapper/Impulse.None/SplitAndSize0/beam:env:external:v1:0:beam:metric:ptransform_execution_time:total_msecs:v1 {PTRANSFORM=ref_AppliedPTransform_assert_that/WindowInto(WindowIntoFn)_22}: 0, 42read/Read/_SDFBoundedSourceWrapper/Impulse.None/SplitAndSize0/beam:env:external:v1:0:beam:metric:pardo_execution_time:finish_bundle_msecs:v1 {PTRANSFORM=ref_AppliedPTransform_assert_that/ToVoidKey_23}: 0, 26assert_that/Create/Impulse.None/beam:env:external:v1:0:beam:metric:pardo_execution_time:finish_bundle_msecs:v1 {PTRANSFORM=ref_AppliedPTransform_assert_that/Create/FlatMap(<lambda at core.py:2627>)_19}: 0, 42read/Read/_SDFBoundedSourceWrapper/Impulse.None/SplitAndSize0/beam:env:external:v1:0:beam:metric:pardo_execution_time:process_bundle_msecs:v1 {PTRANSFORM=ref_AppliedPTransform_assert_that/ToVoidKey_23}: 0, 26assert_that/Create/Impulse.None/beam:env:external:v1:0:beam:metric:pardo_execution_time:finish_bundle_msecs:v1 {PTRANSFORM=ref_AppliedPTransform_assert_that/Group/Flatten_27}: 0, 42read/Read/_SDFBoundedSourceWrapper/Impulse.None/SplitAndSize0/beam:env:external:v1:0:beam:metric:pardo_execution_time:finish_bundle_msecs:v1 {PTRANSFORM=ref_AppliedPTransform_assert_that/Group/pair_with_1_26}: 0)Distributions(42read/Read/_SDFBoundedSourceWrapper/Impulse.None/beam:env:external:v1:0:beam:metric:sampled_byte_size:v1 {PCOLLECTION=ref_PCollection_PCollection_1}: DistributionResult{sum=13, count=1, min=13, max=13}, 42read/Read/_SDFBoundedSourceWrapper/Impulse.None/beam:env:external:v1:0:beam:metric:sampled_byte_size:v1 {PCOLLECTION=ref_PCollection_PCollection_1/PairWithRestriction0}: DistributionResult{sum=575, count=1, min=575, max=575}, 26assert_that/Create/Impulse.None/beam:env:external:v1:0:beam:metric:sampled_byte_size:v1 {PCOLLECTION=ref_PCollection_PCollection_16:1}: DistributionResult{sum=19, count=1, min=19, max=19}, 47read/_PassThroughThenCleanup/Create/Map(decode).None/beam:env:external:v1:0:beam:metric:sampled_byte_size:v1 {PCOLLECTION=ref_PCollection_PCollection_7}: DistributionResult{sum=15, count=1, min=15, max=15}, 47read/_PassThroughThenCleanup/Create/Map(decode).None/beam:env:external:v1:0:beam:metric:sampled_byte_size:v1 {PCOLLECTION=ref_PCollection_PCollection_8}: DistributionResult{sum=0, count=0, min=9223372036854775807, max=-9223372036854775808}, 42read/Read/_SDFBoundedSourceWrapper/Impulse.None/SplitAndSize0/beam:env:external:v1:0:beam:metric:sampled_byte_size:v1 {PCOLLECTION=ref_PCollection_PCollection_1/SplitAndSize0}: DistributionResult{sum=954, count=1, min=954, max=954}, 42assert_that/Group/GroupByKey/GroupByWindow.None/beam:env:external:v1:0:beam:metric:sampled_byte_size:v1 {PCOLLECTION=ref_PCollection_PCollection_19}: DistributionResult{sum=145, count=1, min=145, max=145}, 42read/Read/_SDFBoundedSourceWrapper/Impulse.None/beam:env:external:v1:0:beam:metric:sampled_byte_size:v1 {PTRANSFORM=ref_AppliedPTransform_read/Read/_SDFBoundedSourceWrapper/ParDo(SDFBoundedSourceDoFn)_6/SplitAndSize0, TAG=None}: DistributionResult{sum=953, count=1, min=953, max=953}, 42read/Read/_SDFBoundedSourceWrapper/Impulse.None/SplitAndSize0/beam:env:external:v1:0:beam:metric:sampled_byte_size:v1 {PCOLLECTION=ref_PCollection_PCollection_16:0}: DistributionResult{sum=172, count=4, min=40, max=49}, 42read/Read/_SDFBoundedSourceWrapper/Impulse.None/SplitAndSize0/beam:env:external:v1:0:beam:metric:sampled_byte_size:v1 {PCOLLECTION=ref_PCollection_PCollection_12}: DistributionResult{sum=152, count=4, min=35, max=44}, 43read/_PassThroughThenCleanup/Create/Impulse.None/beam:env:external:v1:0:beam:metric:sampled_byte_size:v1 {PCOLLECTION=ref_PCollection_PCollection_5}: DistributionResult{sum=13, count=1, min=13, max=13}, 42read/Read/_SDFBoundedSourceWrapper/Impulse.None/SplitAndSize0/beam:env:external:v1:0:beam:metric:sampled_byte_size:v1 {PCOLLECTION=ref_PCollection_PCollection_3}: DistributionResult{sum=152, count=4, min=35, max=44}, 42assert_that/Group/GroupByKey/GroupByWindow.None/beam:env:external:v1:0:beam:metric:sampled_byte_size:v1 {PCOLLECTION=ref_PCollection_PCollection_20}: DistributionResult{sum=123, count=1, min=123, max=123}, 42read/Read/_SDFBoundedSourceWrapper/Impulse.None/SplitAndSize0/beam:env:external:v1:0:beam:metric:sampled_byte_size:v1 {PCOLLECTION=ref_PCollection_PCollection_2}: DistributionResult{sum=152, count=4, min=35, max=44}, 42assert_that/Group/GroupByKey/GroupByWindow.None/beam:env:external:v1:0:beam:metric:sampled_byte_size:v1 {PCOLLECTION=ref_PCollection_PCollection_21}: DistributionResult{sum=115, count=1, min=115, max=115}, 42assert_that/Group/GroupByKey/GroupByWindow.None/beam:env:external:v1:0:beam:metric:sampled_byte_size:v1 {PCOLLECTION=ref_PCollection_PCollection_22}: DistributionResult{sum=14, count=1, min=14, max=14}, 43read/_PassThroughThenCleanup/Create/Impulse.None/beam:env:external:v1:0:beam:metric:sampled_byte_size:v1 {PCOLLECTION=ref_PCollection_PCollection_7}: DistributionResult{sum=14, count=1, min=14, max=14}, 42read/Read/_SDFBoundedSourceWrapper/Impulse.None/beam:env:external:v1:0:beam:metric:sampled_byte_size:v1 {PTRANSFORM=ref_AppliedPTransform_read/Read/_SDFBoundedSourceWrapper/ParDo(SDFBoundedSourceDoFn)_6/PairWithRestriction0, TAG=None}: DistributionResult{sum=575, count=1, min=575, max=575}, 42read/Read/_SDFBoundedSourceWrapper/Impulse.None/SplitAndSize0/beam:env:external:v1:0:beam:metric:sampled_byte_size:v1 {PCOLLECTION=ref_PCollection_PCollection_4}: DistributionResult{sum=0, count=0, min=9223372036854775807, max=-9223372036854775808}, 43read/_PassThroughThenCleanup/Create/Impulse.None/beam:env:external:v1:0:beam:metric:sampled_byte_size:v1 {PCOLLECTION=ref_PCollection_PCollection_6}: DistributionResult{sum=14, count=1, min=14, max=14}, 26assert_that/Create/Impulse.None/beam:env:external:v1:0:beam:metric:sampled_byte_size:v1 {PCOLLECTION=ref_PCollection_PCollection_14}: DistributionResult{sum=21, count=1, min=21, max=21}, 26assert_that/Create/Impulse.None/beam:env:external:v1:0:beam:metric:sampled_byte_size:v1 {PCOLLECTION=ref_PCollection_PCollection_11}: DistributionResult{sum=15, count=1, min=15, max=15}, 26assert_that/Create/Impulse.None/beam:env:external:v1:0:beam:metric:sampled_byte_size:v1 {PCOLLECTION=ref_PCollection_PCollection_10}: DistributionResult{sum=15, count=1, min=15, max=15}, 26assert_that/Create/Impulse.None/beam:env:external:v1:0:beam:metric:sampled_byte_size:v1 {PCOLLECTION=ref_PCollection_PCollection_9}: DistributionResult{sum=13, count=1, min=13, max=13}, 42read/Read/_SDFBoundedSourceWrapper/Impulse.None/SplitAndSize0/beam:env:external:v1:0:beam:metric:sampled_byte_size:v1 {PCOLLECTION=ref_PCollection_PCollection_15}: DistributionResult{sum=180, count=4, min=42, max=51}, 42read/Read/_SDFBoundedSourceWrapper/Impulse.None/SplitAndSize0/beam:env:external:v1:0:beam:metric:sampled_byte_size:v1 {PCOLLECTION=ref_PCollection_PCollection_13}: DistributionResult{sum=156, count=4, min=36, max=45}, 42read/Read/_SDFBoundedSourceWrapper/Impulse.None/beam:env:external:v1:0:beam:metric:sampled_byte_size:v1 {PCOLLECTION=ref_PCollection_PCollection_1/SplitAndSize0}: DistributionResult{sum=953, count=1, min=953, max=953}))
[flink-runner-job-invoker] WARN org.apache.beam.runners.fnexecution.jobsubmission.InMemoryJobService - Failed to remove job staging directory for token {"sessionId":"job_5b010286-e277-43db-aed4-ac3246a04114","basePath":"/tmp/beam-tempfl2zil7b/artifactsihpa_979"}: {}
java.io.FileNotFoundException: /tmp/beam-tempfl2zil7b/artifactsihpa_979/job_5b010286-e277-43db-aed4-ac3246a04114/MANIFEST (No such file or directory)
at java.io.FileInputStream.open0(Native Method)
at java.io.FileInputStream.open(FileInputStream.java:195)
at java.io.FileInputStream.<init>(FileInputStream.java:138)
at org.apache.beam.sdk.io.LocalFileSystem.open(LocalFileSystem.java:118)
at org.apache.beam.sdk.io.LocalFileSystem.open(LocalFileSystem.java:82)
at org.apache.beam.sdk.io.FileSystems.open(FileSystems.java:252)
at org.apache.beam.runners.fnexecution.artifact.BeamFileSystemArtifactRetrievalService.loadManifest(BeamFileSystemArtifactRetrievalService.java:88)
at org.apache.beam.runners.fnexecution.artifact.BeamFileSystemArtifactStagingService.removeArtifacts(BeamFileSystemArtifactStagingService.java:92)
at org.apache.beam.runners.fnexecution.jobsubmission.JobServerDriver.lambda$createJobService$0(JobServerDriver.java:63)
at org.apache.beam.runners.fnexecution.jobsubmission.InMemoryJobService.lambda$run$0(InMemoryJobService.java:245)
at org.apache.beam.runners.fnexecution.jobsubmission.JobInvocation.setState(JobInvocation.java:246)
at org.apache.beam.runners.fnexecution.jobsubmission.JobInvocation.access$200(JobInvocation.java:48)
at org.apache.beam.runners.fnexecution.jobsubmission.JobInvocation$1.onSuccess(JobInvocation.java:112)
at org.apache.beam.runners.fnexecution.jobsubmission.JobInvocation$1.onSuccess(JobInvocation.java:98)
at org.apache.beam.vendor.guava.v26_0_jre.com.google.common.util.concurrent.Futures$CallbackListener.run(Futures.java:1058)
at java.util.concurrent.ThreadPoolExecutor.runWorker(ThreadPoolExecutor.java:1149)
at java.util.concurrent.ThreadPoolExecutor$Worker.run(ThreadPoolExecutor.java:624)
at java.lang.Thread.run(Thread.java:748)
<https://builds.apache.org/job/beam_PostCommit_Python37/ws/src/sdks/python/apache_beam/io/gcp/bigquery_read_it_test.py>:162: FutureWarning: _ReadFromBigQuery is experimental.
query=self.query, use_standard_sql=True, project=self.project))
<https://builds.apache.org/job/beam_PostCommit_Python37/ws/src/sdks/python/apache_beam/io/gcp/bigquery.py>:1655: BeamDeprecationWarning: options is deprecated since First stable release. References to <pipeline>.options will not be supported
temp_location = pcoll.pipeline.options.view_as(
ok
test_native_source (apache_beam.io.gcp.bigquery_read_it_test.ReadTests) ... SKIP: This test doesn't work on these runners: ['PortableRunner', 'FlinkRunner']
----------------------------------------------------------------------
XML: nosetests-postCommitIT-flink-py37.xml
----------------------------------------------------------------------
XML: <https://builds.apache.org/job/beam_PostCommit_Python37/ws/src/sdks/python/nosetests.xml>
----------------------------------------------------------------------
Ran 4 tests in 51.233s
OK (SKIP=2)
> Task :sdks:python:test-suites:portable:py37:postCommitPy37
> Task :sdks:python:test-suites:dataflow:py37:postCommitIT
Worker logs: https://console.cloud.google.com/dataflow/jobsDetail/locations/us-central1/jobs/2020-02-23_10_08_15-6846579266922066598?project=apache-beam-testing
<https://builds.apache.org/job/beam_PostCommit_Python37/ws/src/sdks/python/apache_beam/io/gcp/bigquery.py>:1466: BeamDeprecationWarning: options is deprecated since First stable release. References to <pipeline>.options will not be supported
experiments = p.options.view_as(DebugOptions).experiments or []
Worker logs: https://console.cloud.google.com/dataflow/jobsDetail/locations/us-central1/jobs/2020-02-23_10_22_46-15183524311541849375?project=apache-beam-testing
<https://builds.apache.org/job/beam_PostCommit_Python37/ws/src/sdks/python/apache_beam/io/gcp/bigquery.py>:1466: BeamDeprecationWarning: options is deprecated since First stable release. References to <pipeline>.options will not be supported
Worker logs: https://console.cloud.google.com/dataflow/jobsDetail/locations/us-central1/jobs/2020-02-23_10_31_43-7577082015527209642?project=apache-beam-testing
experiments = p.options.view_as(DebugOptions).experiments or []
Worker logs: https://console.cloud.google.com/dataflow/jobsDetail/locations/us-central1/jobs/2020-02-23_10_39_33-5166331111802937558?project=apache-beam-testing
<https://builds.apache.org/job/beam_PostCommit_Python37/ws/src/sdks/python/apache_beam/io/gcp/bigquery_file_loads.py>:818: BeamDeprecationWarning: options is deprecated since First stable release. References to <pipeline>.options will not be supported
Worker logs: https://console.cloud.google.com/dataflow/jobsDetail/locations/us-central1/jobs/2020-02-23_10_47_49-5538300390413439029?project=apache-beam-testing
temp_location = p.options.view_as(GoogleCloudOptions).temp_location
<https://builds.apache.org/job/beam_PostCommit_Python37/ws/src/sdks/python/apache_beam/io/gcp/bigquery.py>:1466: BeamDeprecationWarning: options is deprecated since First stable release. References to <pipeline>.options will not be supported
experiments = p.options.view_as(DebugOptions).experiments or []
<https://builds.apache.org/job/beam_PostCommit_Python37/ws/src/sdks/python/apache_beam/io/gcp/bigquery_file_loads.py>:818: BeamDeprecationWarning: options is deprecated since First stable release. References to <pipeline>.options will not be supported
temp_location = p.options.view_as(GoogleCloudOptions).temp_location
Worker logs: https://console.cloud.google.com/dataflow/jobsDetail/locations/us-central1/jobs/2020-02-23_10_08_12-14560438342478717962?project=apache-beam-testing
<https://builds.apache.org/job/beam_PostCommit_Python37/ws/src/sdks/python/apache_beam/runners/dataflow/dataflow_runner.py>:788: BeamDeprecationWarning: BigQuerySink is deprecated since 2.11.0. Use WriteToBigQuery instead.
kms_key=transform.kms_key))
Worker logs: https://console.cloud.google.com/dataflow/jobsDetail/locations/us-central1/jobs/2020-02-23_10_26_32-7981081686833337869?project=apache-beam-testing
<https://builds.apache.org/job/beam_PostCommit_Python37/ws/src/sdks/python/apache_beam/io/gcp/bigquery.py>:1466: BeamDeprecationWarning: options is deprecated since First stable release. References to <pipeline>.options will not be supported
Worker logs: https://console.cloud.google.com/dataflow/jobsDetail/locations/us-central1/jobs/2020-02-23_10_34_19-8296590975570526581?project=apache-beam-testing
Worker logs: https://console.cloud.google.com/dataflow/jobsDetail/locations/us-central1/jobs/2020-02-23_10_41_32-3753328400273408038?project=apache-beam-testing
experiments = p.options.view_as(DebugOptions).experiments or []
Worker logs: https://console.cloud.google.com/dataflow/jobsDetail/locations/us-central1/jobs/2020-02-23_10_48_27-4066083737364150190?project=apache-beam-testing
<https://builds.apache.org/job/beam_PostCommit_Python37/ws/src/sdks/python/apache_beam/io/gcp/bigquery_file_loads.py>:818: BeamDeprecationWarning: options is deprecated since First stable release. References to <pipeline>.options will not be supported
temp_location = p.options.view_as(GoogleCloudOptions).temp_location
<https://builds.apache.org/job/beam_PostCommit_Python37/ws/src/sdks/python/apache_beam/runners/dataflow/dataflow_runner.py>:788: BeamDeprecationWarning: BigQuerySink is deprecated since 2.11.0. Use WriteToBigQuery instead.
kms_key=transform.kms_key))
<https://builds.apache.org/job/beam_PostCommit_Python37/ws/src/sdks/python/apache_beam/runners/dataflow/dataflow_runner.py>:788: BeamDeprecationWarning: BigQuerySink is deprecated since 2.11.0. Use WriteToBigQuery instead.
kms_key=transform.kms_key))
<https://builds.apache.org/job/beam_PostCommit_Python37/ws/src/sdks/python/apache_beam/runners/dataflow/dataflow_runner.py>:788: BeamDeprecationWarning: BigQuerySink is deprecated since 2.11.0. Use WriteToBigQuery instead.
kms_key=transform.kms_key))
Worker logs: https://console.cloud.google.com/dataflow/jobsDetail/locations/us-central1/jobs/2020-02-23_10_08_14-51597619682471906?project=apache-beam-testing
Worker logs: https://console.cloud.google.com/dataflow/jobsDetail/locations/us-central1/jobs/2020-02-23_10_20_36-6210643048070612577?project=apache-beam-testing
Worker logs: https://console.cloud.google.com/dataflow/jobsDetail/locations/us-central1/jobs/2020-02-23_10_27_36-9159908264865344700?project=apache-beam-testing
<https://builds.apache.org/job/beam_PostCommit_Python37/ws/src/sdks/python/apache_beam/io/gcp/bigquery.py>:1466: BeamDeprecationWarning: options is deprecated since First stable release. References to <pipeline>.options will not be supported
experiments = p.options.view_as(DebugOptions).experiments or []
Worker logs: https://console.cloud.google.com/dataflow/jobsDetail/locations/us-central1/jobs/2020-02-23_10_34_36-15267694782750135208?project=apache-beam-testing
Worker logs: https://console.cloud.google.com/dataflow/jobsDetail/locations/us-central1/jobs/2020-02-23_10_41_28-17713585074990013751?project=apache-beam-testing
<https://builds.apache.org/job/beam_PostCommit_Python37/ws/src/sdks/python/apache_beam/io/gcp/big_query_query_to_table_pipeline.py>:87: FutureWarning: _ReadFromBigQuery is experimental.
kms_key=kms_key)
Worker logs: https://console.cloud.google.com/dataflow/jobsDetail/locations/us-central1/jobs/2020-02-23_10_48_48-15133937761880555148?project=apache-beam-testing
<https://builds.apache.org/job/beam_PostCommit_Python37/ws/src/sdks/python/apache_beam/io/gcp/bigquery.py>:1655: BeamDeprecationWarning: options is deprecated since First stable release. References to <pipeline>.options will not be supported
temp_location = pcoll.pipeline.options.view_as(
<https://builds.apache.org/job/beam_PostCommit_Python37/ws/src/sdks/python/apache_beam/runners/dataflow/dataflow_runner.py>:788: BeamDeprecationWarning: BigQuerySink is deprecated since 2.11.0. Use WriteToBigQuery instead.
kms_key=transform.kms_key))
<https://builds.apache.org/job/beam_PostCommit_Python37/ws/src/sdks/python/apache_beam/io/gcp/big_query_query_to_table_pipeline.py>:87: FutureWarning: _ReadFromBigQuery is experimental.
kms_key=kms_key)
<https://builds.apache.org/job/beam_PostCommit_Python37/ws/src/sdks/python/apache_beam/io/gcp/bigquery.py>:1655: BeamDeprecationWarning: options is deprecated since First stable release. References to <pipeline>.options will not be supported
temp_location = pcoll.pipeline.options.view_as(
<https://builds.apache.org/job/beam_PostCommit_Python37/ws/src/sdks/python/apache_beam/runners/dataflow/dataflow_runner.py>:788: BeamDeprecationWarning: BigQuerySink is deprecated since 2.11.0. Use WriteToBigQuery instead.
kms_key=transform.kms_key))
<https://builds.apache.org/job/beam_PostCommit_Python37/ws/src/sdks/python/apache_beam/io/gcp/big_query_query_to_table_pipeline.py>:95: BeamDeprecationWarning: BigQuerySink is deprecated since 2.11.0. Use WriteToBigQuery instead.
kms_key=kms_key))
<https://builds.apache.org/job/beam_PostCommit_Python37/ws/src/sdks/python/apache_beam/io/gcp/big_query_query_to_table_pipeline.py>:87: FutureWarning: _ReadFromBigQuery is experimental.
kms_key=kms_key)
<https://builds.apache.org/job/beam_PostCommit_Python37/ws/src/sdks/python/apache_beam/io/gcp/bigquery.py>:1655: BeamDeprecationWarning: options is deprecated since First stable release. References to <pipeline>.options will not be supported
temp_location = pcoll.pipeline.options.view_as(
<https://builds.apache.org/job/beam_PostCommit_Python37/ws/src/sdks/python/apache_beam/runners/dataflow/dataflow_runner.py>:788: BeamDeprecationWarning: BigQuerySink is deprecated since 2.11.0. Use WriteToBigQuery instead.
kms_key=transform.kms_key))
<https://builds.apache.org/job/beam_PostCommit_Python37/ws/src/sdks/python/apache_beam/io/gcp/big_query_query_to_table_pipeline.py>:95: BeamDeprecationWarning: BigQuerySink is deprecated since 2.11.0. Use WriteToBigQuery instead.
kms_key=kms_key))
Worker logs: https://console.cloud.google.com/dataflow/jobsDetail/locations/us-central1/jobs/2020-02-23_10_08_11-2910564293497838854?project=apache-beam-testing
<https://builds.apache.org/job/beam_PostCommit_Python37/ws/src/sdks/python/apache_beam/io/gcp/bigquery_test.py>:823: BeamDeprecationWarning: options is deprecated since First stable release. References to <pipeline>.options will not be supported
streaming = self.test_pipeline.options.view_as(StandardOptions).streaming
<https://builds.apache.org/job/beam_PostCommit_Python37/ws/src/sdks/python/apache_beam/io/gcp/bigquery.py>:1466: BeamDeprecationWarning: options is deprecated since First stable release. References to <pipeline>.options will not be supported
experiments = p.options.view_as(DebugOptions).experiments or []
<https://builds.apache.org/job/beam_PostCommit_Python37/ws/src/sdks/python/apache_beam/io/gcp/bigquery.py>:1463: BeamDeprecationWarning: options is deprecated since First stable release. References to <pipeline>.options will not be supported
self.table_reference.projectId = pcoll.pipeline.options.view_as(
Worker logs: https://console.cloud.google.com/dataflow/jobsDetail/locations/us-central1/jobs/2020-02-23_10_26_15-17762921581260148?project=apache-beam-testing
Worker logs: https://console.cloud.google.com/dataflow/jobsDetail/locations/us-central1/jobs/2020-02-23_10_33_23-8206873355452881957?project=apache-beam-testing
Worker logs: https://console.cloud.google.com/dataflow/jobsDetail/locations/us-central1/jobs/2020-02-23_10_08_12-7908121124738662257?project=apache-beam-testing
Worker logs: https://console.cloud.google.com/dataflow/jobsDetail/locations/us-central1/jobs/2020-02-23_10_16_30-12819123399875638408?project=apache-beam-testing
<https://builds.apache.org/job/beam_PostCommit_Python37/ws/src/sdks/python/apache_beam/io/gcp/bigquery_read_it_test.py>:275: FutureWarning: _ReadFromBigQuery is experimental.
query=self.query, use_standard_sql=True, project=self.project))
Worker logs: https://console.cloud.google.com/dataflow/jobsDetail/locations/us-central1/jobs/2020-02-23_10_24_09-16406595947084001637?project=apache-beam-testing
<https://builds.apache.org/job/beam_PostCommit_Python37/ws/src/sdks/python/apache_beam/io/gcp/bigquery.py>:1655: BeamDeprecationWarning: options is deprecated since First stable release. References to <pipeline>.options will not be supported
temp_location = pcoll.pipeline.options.view_as(
Worker logs: https://console.cloud.google.com/dataflow/jobsDetail/locations/us-central1/jobs/2020-02-23_10_30_57-9886466694125899619?project=apache-beam-testing
Worker logs: https://console.cloud.google.com/dataflow/jobsDetail/locations/us-central1/jobs/2020-02-23_10_37_46-8443777420339899306?project=apache-beam-testing
Worker logs: https://console.cloud.google.com/dataflow/jobsDetail/locations/us-central1/jobs/2020-02-23_10_44_58-13057966396254924398?project=apache-beam-testing
Worker logs: https://console.cloud.google.com/dataflow/jobsDetail/locations/us-central1/jobs/2020-02-23_10_08_12-5733633440796348362?project=apache-beam-testing
Worker logs: https://console.cloud.google.com/dataflow/jobsDetail/locations/us-central1/jobs/2020-02-23_10_15_04-3741086946681647390?project=apache-beam-testing
Worker logs: https://console.cloud.google.com/dataflow/jobsDetail/locations/us-central1/jobs/2020-02-23_10_22_49-11197924966159416273?project=apache-beam-testing
<https://builds.apache.org/job/beam_PostCommit_Python37/ws/src/sdks/python/apache_beam/runners/dataflow/dataflow_runner.py>:788: BeamDeprecationWarning: BigQuerySink is deprecated since 2.11.0. Use WriteToBigQuery instead.
kms_key=transform.kms_key))
Worker logs: https://console.cloud.google.com/dataflow/jobsDetail/locations/us-central1/jobs/2020-02-23_10_30_16-12060062457789645136?project=apache-beam-testing
<https://builds.apache.org/job/beam_PostCommit_Python37/ws/src/sdks/python/apache_beam/io/gcp/bigquery_io_read_pipeline.py>:84: FutureWarning: _ReadFromBigQuery is experimental.
Worker logs: https://console.cloud.google.com/dataflow/jobsDetail/locations/us-central1/jobs/2020-02-23_10_37_58-16757186648401252399?project=apache-beam-testing
(options.view_as(GoogleCloudOptions).project, known_args.input_table))
Worker logs: https://console.cloud.google.com/dataflow/jobsDetail/locations/us-central1/jobs/2020-02-23_10_45_18-3513422675291846931?project=apache-beam-testing
<https://builds.apache.org/job/beam_PostCommit_Python37/ws/src/sdks/python/apache_beam/io/gcp/bigquery.py>:1655: BeamDeprecationWarning: options is deprecated since First stable release. References to <pipeline>.options will not be supported
temp_location = pcoll.pipeline.options.view_as(
<https://builds.apache.org/job/beam_PostCommit_Python37/ws/src/sdks/python/apache_beam/io/gcp/bigquery_io_read_pipeline.py>:84: FutureWarning: _ReadFromBigQuery is experimental.
(options.view_as(GoogleCloudOptions).project, known_args.input_table))
<https://builds.apache.org/job/beam_PostCommit_Python37/ws/src/sdks/python/apache_beam/io/gcp/bigquery.py>:1655: BeamDeprecationWarning: options is deprecated since First stable release. References to <pipeline>.options will not be supported
temp_location = pcoll.pipeline.options.view_as(
<https://builds.apache.org/job/beam_PostCommit_Python37/ws/src/sdks/python/apache_beam/io/fileio_test.py>:303: FutureWarning: MatchAll is experimental.
| 'GetPath' >> beam.Map(lambda metadata: metadata.path))
<https://builds.apache.org/job/beam_PostCommit_Python37/ws/src/sdks/python/apache_beam/io/fileio_test.py>:316: FutureWarning: MatchAll is experimental.
| 'Checksums' >> beam.Map(compute_hash))
<https://builds.apache.org/job/beam_PostCommit_Python37/ws/src/sdks/python/apache_beam/io/fileio_test.py>:316: FutureWarning: ReadMatches is experimental.
| 'Checksums' >> beam.Map(compute_hash))
Worker logs: https://console.cloud.google.com/dataflow/jobsDetail/locations/us-central1/jobs/2020-02-23_10_08_11-13852637313037940634?project=apache-beam-testing
<https://builds.apache.org/job/beam_PostCommit_Python37/ws/src/sdks/python/apache_beam/io/avroio.py>:205: UserWarning: Due to a known issue in avro-python3 package, it is recommended to use fastavro with Beam Avro IO on Python 3 until BEAM-6522 is addressed.
"Due to a known issue in avro-python3 package, it is "
<https://builds.apache.org/job/beam_PostCommit_Python37/ws/src/sdks/python/apache_beam/io/gcp/bigquery_read_it_test.py>:162: FutureWarning: _ReadFromBigQuery is experimental.
query=self.query, use_standard_sql=True, project=self.project))
Worker logs: https://console.cloud.google.com/dataflow/jobsDetail/locations/us-central1/jobs/2020-02-23_10_16_29-3253214612656684532?project=apache-beam-testing
Worker logs: https://console.cloud.google.com/dataflow/jobsDetail/locations/us-central1/jobs/2020-02-23_10_26_02-7885612524429765536?project=apache-beam-testing
<https://builds.apache.org/job/beam_PostCommit_Python37/ws/src/sdks/python/apache_beam/io/gcp/bigquery.py>:1655: BeamDeprecationWarning: options is deprecated since First stable release. References to <pipeline>.options will not be supported
temp_location = pcoll.pipeline.options.view_as(
Worker logs: https://console.cloud.google.com/dataflow/jobsDetail/locations/us-central1/jobs/2020-02-23_10_33_18-482932364380609914?project=apache-beam-testing
Worker logs: https://console.cloud.google.com/dataflow/jobsDetail/locations/us-central1/jobs/2020-02-23_10_40_10-3240255114310605909?project=apache-beam-testing
Worker logs: https://console.cloud.google.com/dataflow/jobsDetail/locations/us-central1/jobs/2020-02-23_10_47_32-17819432312151484694?project=apache-beam-testing
Worker logs: https://console.cloud.google.com/dataflow/jobsDetail/locations/us-central1/jobs/2020-02-23_10_08_13-15712180674617030611?project=apache-beam-testing
Worker logs: https://console.cloud.google.com/dataflow/jobsDetail/locations/us-central1/jobs/2020-02-23_10_16_59-1669507053677063451?project=apache-beam-testing
Worker logs: https://console.cloud.google.com/dataflow/jobsDetail/locations/us-central1/jobs/2020-02-23_10_23_31-16701135014668971067?project=apache-beam-testing
Worker logs: https://console.cloud.google.com/dataflow/jobsDetail/locations/us-central1/jobs/2020-02-23_10_30_40-4491302605283842471?project=apache-beam-testing
Worker logs: https://console.cloud.google.com/dataflow/jobsDetail/locations/us-central1/jobs/2020-02-23_10_38_02-11160287606605202929?project=apache-beam-testing
Worker logs: https://console.cloud.google.com/dataflow/jobsDetail/locations/us-central1/jobs/2020-02-23_10_44_55-7069357557684205356?project=apache-beam-testing
test_datastore_wordcount_it (apache_beam.examples.cookbook.datastore_wordcount_it_test.DatastoreWordCountIT) ... SKIP: This test still needs to be fixed on Python 3TODO: BEAM-4543
test_bigquery_tornadoes_it (apache_beam.examples.cookbook.bigquery_tornadoes_it_test.BigqueryTornadoesIT) ... ok
test_autocomplete_it (apache_beam.examples.complete.autocomplete_test.AutocompleteTest) ... ok
test_streaming_wordcount_it (apache_beam.examples.streaming_wordcount_it_test.StreamingWordCountIT) ... ok
test_leader_board_it (apache_beam.examples.complete.game.leader_board_it_test.LeaderBoardIT) ... ok
test_game_stats_it (apache_beam.examples.complete.game.game_stats_it_test.GameStatsIT) ... ok
test_wordcount_fnapi_it (apache_beam.examples.wordcount_it_test.WordCountIT) ... ok
test_wordcount_it (apache_beam.examples.wordcount_it_test.WordCountIT) ... ok
test_avro_it (apache_beam.examples.fastavro_it_test.FastavroIT) ... ok
test_user_score_it (apache_beam.examples.complete.game.user_score_it_test.UserScoreIT) ... ok
test_hourly_team_score_it (apache_beam.examples.complete.game.hourly_team_score_it_test.HourlyTeamScoreIT) ... ok
test_multiple_destinations_transform (apache_beam.io.gcp.bigquery_test.BigQueryStreamingInsertTransformIntegrationTests) ... ok
test_value_provider_transform (apache_beam.io.gcp.bigquery_test.BigQueryStreamingInsertTransformIntegrationTests) ... ok
test_bigquery_read_1M_python (apache_beam.io.gcp.bigquery_io_read_it_test.BigqueryIOReadIT) ... ok
test_bigquery_read_custom_1M_python (apache_beam.io.gcp.bigquery_io_read_it_test.BigqueryIOReadIT) ... ok
test_datastore_write_limit (apache_beam.io.gcp.datastore_write_it_test.DatastoreWriteIT) ... SKIP: This test still needs to be fixed on Python 3TODO: BEAM-4543
test_iobase_source (apache_beam.io.gcp.bigquery_read_it_test.ReadNewTypesTests) ... ok
test_native_source (apache_beam.io.gcp.bigquery_read_it_test.ReadNewTypesTests) ... ok
test_copy (apache_beam.io.gcp.gcsio_integration_test.GcsIOIntegrationTest) ... ok
test_copy_batch (apache_beam.io.gcp.gcsio_integration_test.GcsIOIntegrationTest) ... ok
test_copy_batch_kms (apache_beam.io.gcp.gcsio_integration_test.GcsIOIntegrationTest) ... ok
test_copy_batch_rewrite_token (apache_beam.io.gcp.gcsio_integration_test.GcsIOIntegrationTest) ... ok
test_copy_kms (apache_beam.io.gcp.gcsio_integration_test.GcsIOIntegrationTest) ... ok
test_copy_rewrite_token (apache_beam.io.gcp.gcsio_integration_test.GcsIOIntegrationTest) ... ok
test_bqfl_streaming (apache_beam.io.gcp.bigquery_file_loads_test.BigQueryFileLoadsIT) ... SKIP: TestStream is not supported on TestDataflowRunner
test_multiple_destinations_transform (apache_beam.io.gcp.bigquery_file_loads_test.BigQueryFileLoadsIT) ... ok
test_one_job_fails_all_jobs_fail (apache_beam.io.gcp.bigquery_file_loads_test.BigQueryFileLoadsIT) ... ok
test_iobase_source (apache_beam.io.gcp.bigquery_read_it_test.ReadTests) ... ok
test_native_source (apache_beam.io.gcp.bigquery_read_it_test.ReadTests) ... ok
test_transform_on_gcs (apache_beam.io.fileio_test.MatchIntegrationTest) ... ok
test_parquetio_it (apache_beam.io.parquetio_it_test.TestParquetIT) ... ok
test_file_loads (apache_beam.io.gcp.bigquery_test.PubSubBigQueryIT) ... SKIP: https://issuetracker.google.com/issues/118375066
test_streaming_inserts (apache_beam.io.gcp.bigquery_test.PubSubBigQueryIT) ... ok
test_basic_execution (apache_beam.testing.test_stream_it_test.TestStreamIntegrationTests) ... SKIP: The "TestDataflowRunner", does not support the TestStream transform. Supported runners: ['DirectRunner', 'SwitchingDirectRunner']
Tests that the TestStream supports emitting to multiple PCollections. ... SKIP: The "TestDataflowRunner", does not support the TestStream transform. Supported runners: ['DirectRunner', 'SwitchingDirectRunner']
Tests that the TestStream can independently control output watermarks. ... SKIP: The "TestDataflowRunner", does not support the TestStream transform. Supported runners: ['DirectRunner', 'SwitchingDirectRunner']
test_streaming_data_only (apache_beam.io.gcp.pubsub_integration_test.PubSubIntegrationTest) ... ok
test_streaming_with_attributes (apache_beam.io.gcp.pubsub_integration_test.PubSubIntegrationTest) ... ok
test_datastore_write_limit (apache_beam.io.gcp.datastore.v1new.datastore_write_it_test.DatastoreWriteIT) ... ok
Runs streaming Dataflow job and verifies that user metrics are reported ... ok
test_metrics_fnapi_it (apache_beam.runners.dataflow.dataflow_exercise_metrics_pipeline_test.ExerciseMetricsPipelineTest) ... ok
test_metrics_it (apache_beam.runners.dataflow.dataflow_exercise_metrics_pipeline_test.ExerciseMetricsPipelineTest) ... ok
test_job_python_from_python_it (apache_beam.transforms.external_it_test.ExternalTransformIT) ... ok
test_big_query_write (apache_beam.io.gcp.bigquery_write_it_test.BigQueryWriteIntegrationTests) ... ok
test_big_query_write_new_types (apache_beam.io.gcp.bigquery_write_it_test.BigQueryWriteIntegrationTests) ... ok
test_big_query_write_schema_autodetect (apache_beam.io.gcp.bigquery_write_it_test.BigQueryWriteIntegrationTests) ... SKIP: DataflowRunner does not support schema autodetection
test_big_query_write_without_schema (apache_beam.io.gcp.bigquery_write_it_test.BigQueryWriteIntegrationTests) ... ok
test_big_query_legacy_sql (apache_beam.io.gcp.big_query_query_to_table_it_test.BigQueryQueryToTableIT) ... ok
test_big_query_new_types (apache_beam.io.gcp.big_query_query_to_table_it_test.BigQueryQueryToTableIT) ... ok
test_big_query_new_types_native (apache_beam.io.gcp.big_query_query_to_table_it_test.BigQueryQueryToTableIT) ... ok
test_big_query_standard_sql (apache_beam.io.gcp.big_query_query_to_table_it_test.BigQueryQueryToTableIT) ... ok
test_big_query_standard_sql_kms_key_native (apache_beam.io.gcp.big_query_query_to_table_it_test.BigQueryQueryToTableIT) ... ok
----------------------------------------------------------------------
XML: nosetests-postCommitIT-df-py37.xml
----------------------------------------------------------------------
XML: <https://builds.apache.org/job/beam_PostCommit_Python37/ws/src/sdks/python/nosetests.xml>
----------------------------------------------------------------------
Ran 52 tests in 2893.976s
OK (SKIP=8)
FAILURE: Build failed with an exception.
* Where:
Build file '<https://builds.apache.org/job/beam_PostCommit_Python37/ws/src/sdks/python/test-suites/direct/py37/build.gradle'> line: 60
* What went wrong:
Execution failed for task ':sdks:python:test-suites:direct:py37:hdfsIntegrationTest'.
> Process 'command 'sh'' finished with non-zero exit value 1
* Try:
Run with --stacktrace option to get the stack trace. Run with --info or --debug option to get more log output. Run with --scan to get full insights.
* Get more help at https://help.gradle.org
Deprecated Gradle features were used in this build, making it incompatible with Gradle 6.0.
Use '--warning-mode all' to show the individual deprecation warnings.
See https://docs.gradle.org/5.2.1/userguide/command_line_interface.html#sec:command_line_warnings
BUILD FAILED in 50m 3s
85 actionable tasks: 64 executed, 21 from cache
Publishing build scan...
https://gradle.com/s/ofaygnj5rlnyc
Build step 'Invoke Gradle script' changed build result to FAILURE
Build step 'Invoke Gradle script' marked build as failure
---------------------------------------------------------------------
To unsubscribe, e-mail: builds-unsubscribe@beam.apache.org
For additional commands, e-mail: builds-help@beam.apache.org