You are viewing a plain text version of this content. The canonical link for it is here.
Posted to common-dev@hadoop.apache.org by Apache Jenkins Server <je...@builds.apache.org> on 2011/09/25 18:41:24 UTC

Hadoop-Common-22-branch - Build # 79 - Still Failing

See https://builds.apache.org/job/Hadoop-Common-22-branch/79/

###################################################################################
########################## LAST 60 LINES OF THE CONSOLE ###########################
[...truncated 2984 lines...]
   [delete] Deleting directory /home/jenkins/jenkins-slave/workspace/Hadoop-Common-22-branch/trunk/build
   [delete] Deleting: /home/jenkins/jenkins-slave/workspace/Hadoop-Common-22-branch/trunk/ivy/hadoop-common.xml
   [delete] Deleting: /home/jenkins/jenkins-slave/workspace/Hadoop-Common-22-branch/trunk/ivy/hadoop-common-test.xml
   [delete] Deleting: /home/jenkins/jenkins-slave/workspace/Hadoop-Common-22-branch/trunk/ivy/hadoop-common-instrumented.xml
   [delete] Deleting directory /home/jenkins/jenkins-slave/workspace/Hadoop-Common-22-branch/trunk/src/docs/build

BUILD SUCCESSFUL
Total time: 1 second


======================================================================
======================================================================
ANALYSIS: ant -Drun.clover=true clover checkstyle test generate-clover-reports -Dtest.junit.output.format=xml -Dcompile.c++=true -Dcompile.native=true -Dfindbugs.home=$FINDBUGS_HOME -Dforrest.home=$FORREST_HOME -Dclover.home=$CLOVER_HOME -Declipse.home=$ECLIPSE_HOME
======================================================================
======================================================================


Buildfile: build.xml

clover.setup:
    [mkdir] Created dir: /home/jenkins/jenkins-slave/workspace/Hadoop-Common-22-branch/trunk/build/test/clover/db
Fontconfig error: Cannot load default config file
[clover-setup] Clover Version 3.1.0, built on May 31 2011 (build-821)
[clover-setup] Loaded from: /home/jenkins/tools/clover/latest/lib/clover.jar

BUILD FAILED
java.lang.RuntimeException: Clover upgrades for your license ended December 14 2010, and this version of Clover was built May 31 2011. Please visit http://www.atlassian.com/clover/renew for information on upgrading your license.
	at com.cenqua.clover.CloverStartup.loadLicense(CloverStartup.java:103)
	at com.cenqua.clover.CloverStartup.loadLicense(CloverStartup.java:25)
	at com.cenqua.clover.tasks.AbstractCloverTask.execute(AbstractCloverTask.java:52)
	at org.apache.tools.ant.UnknownElement.execute(UnknownElement.java:288)
	at sun.reflect.GeneratedMethodAccessor1.invoke(Unknown Source)
	at sun.reflect.DelegatingMethodAccessorImpl.invoke(DelegatingMethodAccessorImpl.java:25)
	at java.lang.reflect.Method.invoke(Method.java:597)
	at org.apache.tools.ant.dispatch.DispatchUtils.execute(DispatchUtils.java:106)
	at org.apache.tools.ant.Task.perform(Task.java:348)
	at org.apache.tools.ant.Target.execute(Target.java:357)
	at org.apache.tools.ant.Target.performTasks(Target.java:385)
	at org.apache.tools.ant.Project.executeSortedTargets(Project.java:1337)
	at org.apache.tools.ant.Project.executeTarget(Project.java:1306)
	at org.apache.tools.ant.helper.DefaultExecutor.executeTargets(DefaultExecutor.java:41)
	at org.apache.tools.ant.Project.executeTargets(Project.java:1189)
	at org.apache.tools.ant.Main.runBuild(Main.java:758)
	at org.apache.tools.ant.Main.startAnt(Main.java:217)
	at org.apache.tools.ant.launch.Launcher.run(Launcher.java:257)
	at org.apache.tools.ant.launch.Launcher.main(Launcher.java:104)

Total time: 0 seconds
Build step 'Execute shell' marked build as failure
[FINDBUGS] Skipping publisher since build result is FAILURE
[WARNINGS] Skipping publisher since build result is FAILURE
Archiving artifacts
Publishing Clover coverage report...
No Clover report will be published due to a Build Failure
Recording test results
Publishing Javadoc
Recording fingerprints
Email was triggered for: Failure
Sending email for trigger: Failure



###################################################################################
############################## FAILED TESTS (if any) ##############################
No tests ran.

Hadoop-Common-22-branch - Build # 82 - Still Failing

Posted by Apache Jenkins Server <je...@builds.apache.org>.
See https://builds.apache.org/job/Hadoop-Common-22-branch/82/

###################################################################################
########################## LAST 60 LINES OF THE CONSOLE ###########################
[...truncated 3693 lines...]

compile-core-classes:

ivy-resolve-test:

ivy-retrieve-test:

generate-test-records:

generate-avro-records:
Trying to override old definition of task schema

generate-avro-protocols:
Trying to override old definition of task schema

compile-core-test:
    [javac] Compiling 9 source files to /home/jenkins/jenkins-slave/workspace/Hadoop-Common-22-branch/trunk/build-fi/test/core/classes
    [javac] Note: Some input files use or override a deprecated API.
    [javac] Note: Recompile with -Xlint:deprecation for details.
    [javac] Note: Some input files use unchecked or unsafe operations.
    [javac] Note: Recompile with -Xlint:unchecked for details.
Trying to override old definition of task paranamer
[paranamer] Generating parameter names from /home/jenkins/jenkins-slave/workspace/Hadoop-Common-22-branch/trunk/src/test/core to /home/jenkins/jenkins-slave/workspace/Hadoop-Common-22-branch/trunk/build-fi/test/core/classes
   [delete] Deleting directory /home/jenkins/jenkins-slave/workspace/Hadoop-Common-22-branch/trunk/build-fi/test/cache
    [mkdir] Created dir: /home/jenkins/jenkins-slave/workspace/Hadoop-Common-22-branch/trunk/build-fi/test/cache
     [copy] Copying 1 file to /home/jenkins/jenkins-slave/workspace/Hadoop-Common-22-branch/trunk/build-fi/test/cache

run-test-core:
    [mkdir] Created dir: /home/jenkins/jenkins-slave/workspace/Hadoop-Common-22-branch/trunk/build-fi/test/data
     [copy] Copying 3 files to /home/jenkins/jenkins-slave/workspace/Hadoop-Common-22-branch/trunk/build-fi/test/webapps
    [mkdir] Created dir: /home/jenkins/jenkins-slave/workspace/Hadoop-Common-22-branch/trunk/build-fi/test/logs
     [copy] Copying 1 file to /home/jenkins/jenkins-slave/workspace/Hadoop-Common-22-branch/trunk/build-fi/test/extraconf
     [copy] Copying 1 file to /home/jenkins/jenkins-slave/workspace/Hadoop-Common-22-branch/trunk/build-fi/test/extraconf

checkfailure:

test:

clover.check:

BUILD FAILED
/home/jenkins/jenkins-slave/workspace/Hadoop-Common-22-branch/trunk/build.xml:1421: ##################################################################
   Clover not found.
   Please specify -Dclover.home=<base of clover installation>
   on the command line.
  ##################################################################

Total time: 5 minutes 38 seconds
Build step 'Execute shell' marked build as failure
[FINDBUGS] Skipping publisher since build result is FAILURE
[WARNINGS] Skipping publisher since build result is FAILURE
Archiving artifacts
Publishing Clover coverage report...
No Clover report will be published due to a Build Failure
Recording test results
Publishing Javadoc
Recording fingerprints
Email was triggered for: Failure
Sending email for trigger: Failure



###################################################################################
############################## FAILED TESTS (if any) ##############################
All tests passed

Hadoop-Common-22-branch - Build # 81 - Still Failing

Posted by Apache Jenkins Server <je...@builds.apache.org>.
See https://builds.apache.org/job/Hadoop-Common-22-branch/81/

###################################################################################
########################## LAST 60 LINES OF THE CONSOLE ###########################
[...truncated 3693 lines...]

compile-core-classes:

ivy-resolve-test:

ivy-retrieve-test:

generate-test-records:

generate-avro-records:
Trying to override old definition of task schema

generate-avro-protocols:
Trying to override old definition of task schema

compile-core-test:
    [javac] Compiling 9 source files to /home/jenkins/jenkins-slave/workspace/Hadoop-Common-22-branch/trunk/build-fi/test/core/classes
    [javac] Note: Some input files use or override a deprecated API.
    [javac] Note: Recompile with -Xlint:deprecation for details.
    [javac] Note: Some input files use unchecked or unsafe operations.
    [javac] Note: Recompile with -Xlint:unchecked for details.
Trying to override old definition of task paranamer
[paranamer] Generating parameter names from /home/jenkins/jenkins-slave/workspace/Hadoop-Common-22-branch/trunk/src/test/core to /home/jenkins/jenkins-slave/workspace/Hadoop-Common-22-branch/trunk/build-fi/test/core/classes
   [delete] Deleting directory /home/jenkins/jenkins-slave/workspace/Hadoop-Common-22-branch/trunk/build-fi/test/cache
    [mkdir] Created dir: /home/jenkins/jenkins-slave/workspace/Hadoop-Common-22-branch/trunk/build-fi/test/cache
     [copy] Copying 1 file to /home/jenkins/jenkins-slave/workspace/Hadoop-Common-22-branch/trunk/build-fi/test/cache

run-test-core:
    [mkdir] Created dir: /home/jenkins/jenkins-slave/workspace/Hadoop-Common-22-branch/trunk/build-fi/test/data
     [copy] Copying 3 files to /home/jenkins/jenkins-slave/workspace/Hadoop-Common-22-branch/trunk/build-fi/test/webapps
    [mkdir] Created dir: /home/jenkins/jenkins-slave/workspace/Hadoop-Common-22-branch/trunk/build-fi/test/logs
     [copy] Copying 1 file to /home/jenkins/jenkins-slave/workspace/Hadoop-Common-22-branch/trunk/build-fi/test/extraconf
     [copy] Copying 1 file to /home/jenkins/jenkins-slave/workspace/Hadoop-Common-22-branch/trunk/build-fi/test/extraconf

checkfailure:

test:

clover.check:

BUILD FAILED
/home/jenkins/jenkins-slave/workspace/Hadoop-Common-22-branch/trunk/build.xml:1421: ##################################################################
   Clover not found.
   Please specify -Dclover.home=<base of clover installation>
   on the command line.
  ##################################################################

Total time: 5 minutes 37 seconds
Build step 'Execute shell' marked build as failure
[FINDBUGS] Skipping publisher since build result is FAILURE
[WARNINGS] Skipping publisher since build result is FAILURE
Archiving artifacts
Publishing Clover coverage report...
No Clover report will be published due to a Build Failure
Recording test results
Publishing Javadoc
Recording fingerprints
Email was triggered for: Failure
Sending email for trigger: Failure



###################################################################################
############################## FAILED TESTS (if any) ##############################
All tests passed

Hadoop-Common-22-branch - Build # 80 - Still Failing

Posted by Apache Jenkins Server <je...@builds.apache.org>.
See https://builds.apache.org/job/Hadoop-Common-22-branch/80/

###################################################################################
########################## LAST 60 LINES OF THE CONSOLE ###########################
[...truncated 2984 lines...]
   [delete] Deleting directory /home/jenkins/jenkins-slave/workspace/Hadoop-Common-22-branch/trunk/build
   [delete] Deleting: /home/jenkins/jenkins-slave/workspace/Hadoop-Common-22-branch/trunk/ivy/hadoop-common.xml
   [delete] Deleting: /home/jenkins/jenkins-slave/workspace/Hadoop-Common-22-branch/trunk/ivy/hadoop-common-test.xml
   [delete] Deleting: /home/jenkins/jenkins-slave/workspace/Hadoop-Common-22-branch/trunk/ivy/hadoop-common-instrumented.xml
   [delete] Deleting directory /home/jenkins/jenkins-slave/workspace/Hadoop-Common-22-branch/trunk/src/docs/build

BUILD SUCCESSFUL
Total time: 1 second


======================================================================
======================================================================
ANALYSIS: ant -Drun.clover=false clover checkstyle test generate-clover-reports -Dtest.junit.output.format=xml -Dcompile.c++=true -Dcompile.native=true -Dfindbugs.home=$FINDBUGS_HOME -Dforrest.home=$FORREST_HOME -Dclover.home=$CLOVER_HOME -Declipse.home=$ECLIPSE_HOME
======================================================================
======================================================================


Buildfile: build.xml

clover.setup:
    [mkdir] Created dir: /home/jenkins/jenkins-slave/workspace/Hadoop-Common-22-branch/trunk/build/test/clover/db
Fontconfig error: Cannot load default config file
[clover-setup] Clover Version 3.1.0, built on May 31 2011 (build-821)
[clover-setup] Loaded from: /home/jenkins/tools/clover/latest/lib/clover.jar

BUILD FAILED
java.lang.RuntimeException: Clover upgrades for your license ended December 14 2010, and this version of Clover was built May 31 2011. Please visit http://www.atlassian.com/clover/renew for information on upgrading your license.
	at com.cenqua.clover.CloverStartup.loadLicense(CloverStartup.java:103)
	at com.cenqua.clover.CloverStartup.loadLicense(CloverStartup.java:25)
	at com.cenqua.clover.tasks.AbstractCloverTask.execute(AbstractCloverTask.java:52)
	at org.apache.tools.ant.UnknownElement.execute(UnknownElement.java:288)
	at sun.reflect.GeneratedMethodAccessor1.invoke(Unknown Source)
	at sun.reflect.DelegatingMethodAccessorImpl.invoke(DelegatingMethodAccessorImpl.java:25)
	at java.lang.reflect.Method.invoke(Method.java:597)
	at org.apache.tools.ant.dispatch.DispatchUtils.execute(DispatchUtils.java:106)
	at org.apache.tools.ant.Task.perform(Task.java:348)
	at org.apache.tools.ant.Target.execute(Target.java:357)
	at org.apache.tools.ant.Target.performTasks(Target.java:385)
	at org.apache.tools.ant.Project.executeSortedTargets(Project.java:1337)
	at org.apache.tools.ant.Project.executeTarget(Project.java:1306)
	at org.apache.tools.ant.helper.DefaultExecutor.executeTargets(DefaultExecutor.java:41)
	at org.apache.tools.ant.Project.executeTargets(Project.java:1189)
	at org.apache.tools.ant.Main.runBuild(Main.java:758)
	at org.apache.tools.ant.Main.startAnt(Main.java:217)
	at org.apache.tools.ant.launch.Launcher.run(Launcher.java:257)
	at org.apache.tools.ant.launch.Launcher.main(Launcher.java:104)

Total time: 0 seconds
Build step 'Execute shell' marked build as failure
[FINDBUGS] Skipping publisher since build result is FAILURE
[WARNINGS] Skipping publisher since build result is FAILURE
Archiving artifacts
Publishing Clover coverage report...
No Clover report will be published due to a Build Failure
Recording test results
Publishing Javadoc
Recording fingerprints
Email was triggered for: Failure
Sending email for trigger: Failure



###################################################################################
############################## FAILED TESTS (if any) ##############################
No tests ran.