You are viewing a plain text version of this content. The canonical link for it is here.
Posted to commits@myfaces.apache.org by "Continuum@myfaces.zones.apache.org" <mr...@myfaces.zones.apache.org> on 2006/12/10 11:38:39 UTC
[continuum] BUILD FAILURE: Sandbox Core
Online report : http://myfaces.zones.apache.org:8080/continuum/servlet/continuum/target/ProjectBuild.vm/view/ProjectBuild/id/23/buildId/7188
Build statistics:
State: Failed
Previous State: Ok
Started at: Sun, 10 Dec 2006 10:38:06 +0000
Finished at: Sun, 10 Dec 2006 10:38:39 +0000
Total time: 32s
Build Trigger: Schedule
Exit code: 1
Building machine hostname: myfaces.zones.apache.org
Operating system : SunOS(unknown)
Java version : 1.5.0_09(Sun Microsystems Inc.)
Changes
gmuellan added new attribute autoComplete to InputSuggestAjax; fixed IE arrow bug (comboBox drop down arrow was not displayed)
/myfaces/tomahawk/trunk/sandbox/core/src/main/java/org/apache/myfaces/custom/suggestajax/inputsuggestajax/InputSuggestAjax.java
/myfaces/tomahawk/trunk/sandbox/core/src/main/java/org/apache/myfaces/custom/suggestajax/inputsuggestajax/InputSuggestAjaxRenderer.java
/myfaces/tomahawk/trunk/sandbox/core/src/main/java/org/apache/myfaces/custom/suggestajax/inputsuggestajax/InputSuggestAjaxTag.java
/myfaces/tomahawk/trunk/sandbox/core/src/main/tld/myfaces_sandbox.tld
/myfaces/tomahawk/trunk/sandbox/examples/src/main/webapp/inputSuggestAjax.jsp
****************************************************************************
Output:
****************************************************************************
[INFO] Scanning for projects...
[INFO] ----------------------------------------------------------------------------
[INFO] Building Sandbox Core
[INFO] task-segment: [clean, install, deploy, site-deploy]
[INFO] ----------------------------------------------------------------------------
[INFO] [clean:clean]
[INFO] Deleting directory /local/continuum-1.0.3-SNAPSHOT/apps/continuum/working-directory/23/target
[INFO] Deleting directory /local/continuum-1.0.3-SNAPSHOT/apps/continuum/working-directory/23/target/classes
[INFO] Deleting directory /local/continuum-1.0.3-SNAPSHOT/apps/continuum/working-directory/23/target/test-classes
[INFO] [xslt:transform {execution: default}]
[INFO] # of XML files: 1
[INFO] transform, srcFile: /local/continuum-1.0.3-SNAPSHOT/apps/continuum/working-directory/23/src/main/tld/myfaces_sandbox.tld, destFile: /local/continuum-1.0.3-SNAPSHOT/apps/continuum/working-directory/23/target/classes/META-INF/myfaces_sandbox.tld
[INFO] [xslt:transform {execution: generate-tld-for-jar}]
[INFO] # of XML files: 1
[INFO] file up-to-date: /local/continuum-1.0.3-SNAPSHOT/apps/continuum/working-directory/23/target/classes/META-INF/myfaces_sandbox.tld
[INFO] [xslt:transform {execution: generate-tld-for-tlddoc}]
[INFO] # of XML files: 1
[INFO] transform, srcFile: /local/continuum-1.0.3-SNAPSHOT/apps/continuum/working-directory/23/src/main/tld/myfaces_sandbox.tld, destFile: /local/continuum-1.0.3-SNAPSHOT/apps/continuum/working-directory/23/target/tlddoc-site/myfaces_sandbox.tld
[INFO] [resources:resources]
[INFO] Using default encoding to copy filtered resources.
[INFO] [compiler:compile]
Compiling 230 source files to /local/continuum-1.0.3-SNAPSHOT/apps/continuum/working-directory/23/target/classes
[INFO] ------------------------------------------------------------------------
[ERROR] BUILD FAILURE
[INFO] ------------------------------------------------------------------------
[INFO] Compilation failure
/local/continuum-1.0.3-SNAPSHOT/apps/continuum/working-directory/23/src/main/java/org/apache/myfaces/custom/suggestajax/inputsuggestajax/InputSuggestAjaxRenderer.java:[141,18] put(java.lang.Object,java.lang.Object) in java.util.Map cannot be applied to (java.lang.String,boolean)
[INFO] ------------------------------------------------------------------------
[INFO] For more information, run Maven with the -e switch
[INFO] ------------------------------------------------------------------------
[INFO] Total time: 31 seconds
[INFO] Finished at: Sun Dec 10 10:38:38 GMT+00:00 2006
[INFO] Final Memory: 11M/334M
[INFO] ------------------------------------------------------------------------
****************************************************************************