You are viewing a plain text version of this content. The canonical link for it is here.
Posted to dev@poi.apache.org by Apache Jenkins Server <je...@builds.apache.org> on 2017/12/14 00:59:33 UTC
Build failed in Jenkins: POI-DSL-1.8 #324
See <https://builds.apache.org/job/POI-DSL-1.8/324/display/redirect?page=changes>
Changes:
[onealj] bug 61898,59264: update Spreadsheet Quick Guide for BorderStyle enum
CellStyle.BORDER_* -> BorderStyle.*
------------------------------------------
Started by an SCM change
[EnvInject] - Loading node environment variables.
[EnvInject] - Preparing an environment for the build.
[EnvInject] - Keeping Jenkins system variables.
[EnvInject] - Keeping Jenkins build variables.
[EnvInject] - Injecting as environment variables the properties content
LANG=en_US.UTF-8
[EnvInject] - Variables injected successfully.
[EnvInject] - Injecting contributions.
Building remotely on ubuntu-eu2 (ubuntu trusty) in workspace <https://builds.apache.org/job/POI-DSL-1.8/ws/>
Updating https://svn.apache.org/repos/asf/poi/trunk at revision '2017-12-14T00:58:18.022 +0000'
Fetching 'https://svn.apache.org/repos/asf/poi/site/forrest.properties' at -1 into '<https://builds.apache.org/job/POI-DSL-1.8/ws/forrest.properties'>
At revision 1818085
Fetching 'https://svn.apache.org/repos/asf/poi/site/src/documentation' at -1 into '<https://builds.apache.org/job/POI-DSL-1.8/ws/src/documentation'>
U src/documentation/content/xdocs/spreadsheet/quick-guide.xml
At revision 1818085
At revision 1818085
No changes for https://svn.apache.org/repos/asf/poi/trunk since the previous build
No changes for https://svn.apache.org/repos/asf/poi/site/forrest.properties since the previous build
[POI-DSL-1.8] $ /bin/bash -xe /tmp/jenkins5835643490022000327.sh
+ svn status
? build.javacheck.xml
X forrest.properties
X src/documentation
Performing status on external item at 'src/documentation':
+ echo Java-Home: /home/jenkins/tools/java/latest1.8
Java-Home: /home/jenkins/tools/java/latest1.8
+ ls -al /home/jenkins/tools/java/latest1.8/
total 25968
drwxr-xr-x 8 jenkins jenkins 4096 Oct 28 21:00 .
drwxr-xr-x 39 jenkins jenkins 4096 Oct 28 21:00 ..
drwxr-xr-x 2 jenkins jenkins 4096 Oct 28 21:00 bin
-r--r--r-- 1 jenkins jenkins 3244 Sep 14 09:24 COPYRIGHT
drwxr-xr-x 4 jenkins jenkins 4096 Oct 28 21:00 db
drwxr-xr-x 3 jenkins jenkins 4096 Oct 28 21:00 include
-rw-r--r-- 1 jenkins jenkins 5202883 Sep 14 06:34 javafx-src.zip
drwxr-xr-x 5 jenkins jenkins 4096 Oct 28 21:00 jre
drwxr-xr-x 5 jenkins jenkins 4096 Oct 28 21:00 lib
-r--r--r-- 1 jenkins jenkins 40 Sep 14 09:24 LICENSE
drwxr-xr-x 4 jenkins jenkins 4096 Oct 28 21:00 man
-r--r--r-- 1 jenkins jenkins 159 Sep 14 09:24 README.html
-rw-r--r-- 1 jenkins jenkins 424 Sep 14 09:24 release
-rw-r--r-- 1 jenkins jenkins 21117451 Sep 14 09:24 src.zip
-rw-r--r-- 1 jenkins jenkins 63933 Sep 14 06:34 THIRDPARTYLICENSEREADME-JAVAFX.txt
-r--r--r-- 1 jenkins jenkins 145180 Sep 14 09:24 THIRDPARTYLICENSEREADME.txt
+ ls -al /home/jenkins/tools/java/latest1.8/bin
total 784
drwxr-xr-x 2 jenkins jenkins 4096 Oct 28 21:00 .
drwxr-xr-x 8 jenkins jenkins 4096 Oct 28 21:00 ..
-rwxr-xr-x 1 jenkins jenkins 7965 Sep 14 09:24 appletviewer
lrwxrwxrwx 1 jenkins jenkins 8 Sep 14 09:24 ControlPanel -> jcontrol
-rwxr-xr-x 1 jenkins jenkins 7941 Sep 14 09:24 extcheck
-rwxr-xr-x 1 jenkins jenkins 7973 Sep 14 09:24 idlj
-rwxr-xr-x 1 jenkins jenkins 7925 Sep 14 09:24 jar
-rwxr-xr-x 1 jenkins jenkins 7957 Sep 14 09:24 jarsigner
-rwxr-xr-x 1 jenkins jenkins 7734 Sep 14 09:24 java
-rwxr-xr-x 1 jenkins jenkins 7941 Sep 14 09:24 javac
-rwxr-xr-x 1 jenkins jenkins 7941 Sep 14 09:24 javadoc
-rwxr-xr-x 1 jenkins jenkins 2293 Sep 14 06:34 javafxpackager
-rwxr-xr-x 1 jenkins jenkins 7941 Sep 14 09:24 javah
-rwxr-xr-x 1 jenkins jenkins 7941 Sep 14 09:24 javap
-rwxr-xr-x 1 jenkins jenkins 2293 Sep 14 06:34 javapackager
-rwxr-xr-x 1 jenkins jenkins 1809 Sep 14 09:24 java-rmi.cgi
-rwxr-xr-x 1 jenkins jenkins 129139 Sep 14 09:24 javaws
-rwxr-xr-x 1 jenkins jenkins 7925 Sep 14 09:24 jcmd
-rwxr-xr-x 1 jenkins jenkins 8013 Sep 14 09:24 jconsole
-rwxr-xr-x 1 jenkins jenkins 6264 Sep 14 09:24 jcontrol
-rwxr-xr-x 1 jenkins jenkins 7981 Sep 14 09:24 jdb
-rwxr-xr-x 1 jenkins jenkins 7941 Sep 14 09:24 jdeps
-rwxr-xr-x 1 jenkins jenkins 7941 Sep 14 09:24 jhat
-rwxr-xr-x 1 jenkins jenkins 8109 Sep 14 09:24 jinfo
-rwxr-xr-x 1 jenkins jenkins 7941 Sep 14 09:24 jjs
-rwxr-xr-x 1 jenkins jenkins 8109 Sep 14 09:24 jmap
-rwxr-xr-x 1 jenkins jenkins 74675 Nov 25 2016 jmc
-rwxr-xr-x 1 jenkins jenkins 402 Nov 25 2016 jmc.ini
-rwxr-xr-x 1 jenkins jenkins 7925 Sep 14 09:24 jps
-rwxr-xr-x 1 jenkins jenkins 7949 Sep 14 09:24 jrunscript
-rwxr-xr-x 1 jenkins jenkins 7981 Sep 14 09:24 jsadebugd
-rwxr-xr-x 1 jenkins jenkins 8109 Sep 14 09:24 jstack
-rwxr-xr-x 1 jenkins jenkins 7941 Sep 14 09:24 jstat
-rwxr-xr-x 1 jenkins jenkins 7941 Sep 14 09:24 jstatd
-rwxr-xr-x 1 jenkins jenkins 5110 Jan 14 2017 jvisualvm
-rwxr-xr-x 1 jenkins jenkins 7941 Sep 14 09:24 keytool
-rwxr-xr-x 1 jenkins jenkins 7949 Sep 14 09:24 native2ascii
-rwxr-xr-x 1 jenkins jenkins 8149 Sep 14 09:24 orbd
-rwxr-xr-x 1 jenkins jenkins 7957 Sep 14 09:24 pack200
-rwxr-xr-x 1 jenkins jenkins 7997 Sep 14 09:24 policytool
-rwxr-xr-x 1 jenkins jenkins 7925 Sep 14 09:24 rmic
-rwxr-xr-x 1 jenkins jenkins 7941 Sep 14 09:24 rmid
-rwxr-xr-x 1 jenkins jenkins 7949 Sep 14 09:24 rmiregistry
-rwxr-xr-x 1 jenkins jenkins 7957 Sep 14 09:24 schemagen
-rwxr-xr-x 1 jenkins jenkins 7941 Sep 14 09:24 serialver
-rwxr-xr-x 1 jenkins jenkins 7965 Sep 14 09:24 servertool
-rwxr-xr-x 1 jenkins jenkins 8181 Sep 14 09:24 tnameserv
-rwxr-xr-x 1 jenkins jenkins 231482 Sep 14 09:24 unpack200
-rwxr-xr-x 1 jenkins jenkins 7941 Sep 14 09:24 wsgen
-rwxr-xr-x 1 jenkins jenkins 7957 Sep 14 09:24 wsimport
-rwxr-xr-x 1 jenkins jenkins 7957 Sep 14 09:24 xjc
+ /home/jenkins/tools/java/latest1.8/bin/java -version
java version "1.8.0_152"
Java(TM) SE Runtime Environment (build 1.8.0_152-b16)
Java HotSpot(TM) 64-Bit Server VM (build 25.152-b16, mixed mode)
+ echo which java
which java
+ which java
/home/jenkins/tools/java/latest1.8/bin/java
+ java -version
java version "1.8.0_152"
Java(TM) SE Runtime Environment (build 1.8.0_152-b16)
Java HotSpot(TM) 64-Bit Server VM (build 25.152-b16, mixed mode)
+ echo which javac
which javac
+ which javac
/home/jenkins/tools/java/latest1.8/bin/javac
+ javac -version
javac 1.8.0_152
+ echo '<project default="test"><target name="test"><echo>Java ${ant.java.version}/${java.version}</echo><exec executable="javac"><arg value="-version"/></exec></target></project>'
+ ant -f build.javacheck.xml -v
Apache Ant(TM) version 1.9.3 compiled on April 8 2014
Buildfile: <https://builds.apache.org/job/POI-DSL-1.8/ws/build.javacheck.xml>
Detected Java version: 1.8 in: /usr/local/asfpackages/java/jdk1.8.0_152/jre
Detected OS: Linux
parsing buildfile <https://builds.apache.org/job/POI-DSL-1.8/ws/build.javacheck.xml> with URI = <https://builds.apache.org/job/POI-DSL-1.8/ws/build.javacheck.xml>
Project base dir set to: <https://builds.apache.org/job/POI-DSL-1.8/ws/>
Build sequence for target(s) `test' is [test]
Complete build sequence is [test, ]
test:
parsing buildfile jar:file:/usr/share/ant/lib/ant.jar!/org/apache/tools/ant/antlib.xml with URI = jar:file:/usr/share/ant/lib/ant.jar!/org/apache/tools/ant/antlib.xml from a zip file
[echo] Java 1.8/1.8.0_152
[exec] Current OS is Linux
[exec] Executing 'javac' with arguments:
[exec] '-version'
[exec]
[exec] The ' characters around the executable and arguments are
[exec] not part of the command.
[exec] javac 1.8.0_152
BUILD SUCCESSFUL
Total time: 0 seconds
+ exit 0
[POI-DSL-1.8] $ /home/jenkins/tools/ant/apache-ant-1.9.9/bin/ant -Dcoverage.enabled=true clean jenkins
Buildfile: <https://builds.apache.org/job/POI-DSL-1.8/ws/build.xml>
clean:
[delete] Deleting directory <https://builds.apache.org/job/POI-DSL-1.8/ws/build>
check-jars:
fetch-jars:
check-ooxml-jars:
fetch-ooxml-jars:
init:
[mkdir] Created dir: <https://builds.apache.org/job/POI-DSL-1.8/ws/build>
[mkdir] Created dir: <https://builds.apache.org/job/POI-DSL-1.8/ws/build/classes>
[mkdir] Created dir: <https://builds.apache.org/job/POI-DSL-1.8/ws/build/test-classes>
[mkdir] Created dir: <https://builds.apache.org/job/POI-DSL-1.8/ws/build/test-results>
[mkdir] Created dir: <https://builds.apache.org/job/POI-DSL-1.8/ws/build/scratchpad-classes>
[mkdir] Created dir: <https://builds.apache.org/job/POI-DSL-1.8/ws/build/scratchpad-test-classes>
[mkdir] Created dir: <https://builds.apache.org/job/POI-DSL-1.8/ws/build/scratchpad-test-results>
[mkdir] Created dir: <https://builds.apache.org/job/POI-DSL-1.8/ws/build/geometry-java>
[mkdir] Created dir: <https://builds.apache.org/job/POI-DSL-1.8/ws/build/ooxml-classes>
[mkdir] Created dir: <https://builds.apache.org/job/POI-DSL-1.8/ws/build/ooxml-test-classes>
[mkdir] Created dir: <https://builds.apache.org/job/POI-DSL-1.8/ws/build/ooxml-test-results>
[mkdir] Created dir: <https://builds.apache.org/job/POI-DSL-1.8/ws/build/excelant-classes>
[mkdir] Created dir: <https://builds.apache.org/job/POI-DSL-1.8/ws/build/excelant-test-classes>
[mkdir] Created dir: <https://builds.apache.org/job/POI-DSL-1.8/ws/build/excelant-test-results>
[mkdir] Created dir: <https://builds.apache.org/job/POI-DSL-1.8/ws/build/examples-classes>
[mkdir] Created dir: <https://builds.apache.org/job/POI-DSL-1.8/ws/build/integration-test-classes>
[mkdir] Created dir: <https://builds.apache.org/job/POI-DSL-1.8/324/artifact/build/integration-test-results>
[mkdir] Created dir: <https://builds.apache.org/job/POI-DSL-1.8/ws/build/dist>
[mkdir] Created dir: <https://builds.apache.org/job/POI-DSL-1.8/ws/build/tmp/site/build/site>
[echo] Using Ant: Apache Ant(TM) version 1.9.9 compiled on February 2 2017 from /home/jenkins/tools/ant/apache-ant-1.9.9, Ant detected Java 1.8 (may be different than actual Java sometimes...)
[echo] Using Java: 1.8.0_152/1.8.0_152-b16/25.152-b16/Java HotSpot(TM) 64-Bit Server VM from Oracle Corporation on Linux: 3.19.0-25-generic
compile-main:
[javac] Compiling 1205 source files to <https://builds.apache.org/job/POI-DSL-1.8/ws/build/classes>
[javac] Note: Some input files use or override a deprecated API.
[javac] Note: Recompile with -Xlint:deprecation for details.
[javac] Note: Some input files use unchecked or unsafe operations.
[javac] Note: Recompile with -Xlint:unchecked for details.
[javac] Compiling 539 source files to <https://builds.apache.org/job/POI-DSL-1.8/ws/build/test-classes>
[javac] Note: Some input files use or override a deprecated API.
[javac] Note: Recompile with -Xlint:deprecation for details.
[javac] Note: <https://builds.apache.org/job/POI-DSL-1.8/ws/src/testcases/org/apache/poi/ss/util/TestCellRangeUtil.java> uses unchecked or unsafe operations.
[javac] Note: Recompile with -Xlint:unchecked for details.
[copy] Copying 4 files to <https://builds.apache.org/job/POI-DSL-1.8/ws/build/classes>
check-ooxml-xsds:
fetch-ooxml-xsds:
generate-geometry:
compile-scratchpad:
[javac] Compiling 488 source files to <https://builds.apache.org/job/POI-DSL-1.8/ws/build/scratchpad-classes>
[javac] #
[javac] # A fatal error has been detected by the Java Runtime Environment:
[javac] #
[javac] # SIGILL (0x4) at pc=0x00007f129c5dfc90, pid=19445, tid=0x00007f12b2048700
[javac] #
[javac] # JRE version: Java(TM) SE Runtime Environment (8.0_152-b16) (build 1.8.0_152-b16)
[javac] # Java VM: Java HotSpot(TM) 64-Bit Server VM (25.152-b16 mixed mode linux-amd64 compressed oops)
[javac] # Problematic frame:
[javac] # v ~BufferBlob::adapters
[javac] #
[javac] # Failed to write core dump. Core dumps have been disabled. To enable core dumping, try "ulimit -c unlimited" before starting Java again
[javac] #
[javac] # An error report file with more information is saved as:
[javac] # <https://builds.apache.org/job/POI-DSL-1.8/ws/hs_err_pid19445.log>
BUILD FAILED
<https://builds.apache.org/job/POI-DSL-1.8/ws/build.xml>:995: Compile failed; see the compiler error output for details.
Total time: 25 seconds
Build step 'Invoke Ant' marked build as failure
Skipping publisher since build result is FAILURE
Archiving artifacts
[Fast Archiver] Compressed 66.32 MB of artifacts by 99.9% relative to #323
Skipping publisher since build result is FAILURE
Recording test results
ERROR: Step ‘Publish JUnit test result report’ failed: No test report files were found. Configuration error?
---------------------------------------------------------------------
To unsubscribe, e-mail: dev-unsubscribe@poi.apache.org
For additional commands, e-mail: dev-help@poi.apache.org
Jenkins build is back to normal : POI-DSL-1.8 #325
Posted by Apache Jenkins Server <je...@builds.apache.org>.
See <https://builds.apache.org/job/POI-DSL-1.8/325/display/redirect>
---------------------------------------------------------------------
To unsubscribe, e-mail: dev-unsubscribe@poi.apache.org
For additional commands, e-mail: dev-help@poi.apache.org