You are viewing a plain text version of this content. The canonical link for it is here.
Posted to dev@lucene.apache.org by Apache Jenkins Server <je...@builds.apache.org> on 2011/07/27 21:36:49 UTC
[JENKINS] Lucene-Solr-tests-only-trunk - Build # 9795 - Still
Failing
Build: https://builds.apache.org/job/Lucene-Solr-tests-only-trunk/9795/
1 tests failed.
FAILED: org.apache.lucene.index.codecs.pulsing.Test10KPulsings.test10kNotPulsed
Error Message:
CheckIndex failed
Stack Trace:
java.lang.RuntimeException: CheckIndex failed
at org.apache.lucene.util._TestUtil.checkIndex(_TestUtil.java:162)
at org.apache.lucene.util._TestUtil.checkIndex(_TestUtil.java:148)
at org.apache.lucene.index.codecs.pulsing.Test10KPulsings.test10kNotPulsed(Test10KPulsings.java:154)
at org.apache.lucene.util.LuceneTestCase$LuceneTestCaseRunner.runChild(LuceneTestCase.java:1522)
at org.apache.lucene.util.LuceneTestCase$LuceneTestCaseRunner.runChild(LuceneTestCase.java:1427)
Build Log (for compile errors):
[...truncated 1788 lines...]
---------------------------------------------------------------------
To unsubscribe, e-mail: dev-unsubscribe@lucene.apache.org
For additional commands, e-mail: dev-help@lucene.apache.org
[JENKINS] Lucene-Solr-tests-only-trunk - Build # 9801 - Still
Failing
Posted by Apache Jenkins Server <je...@builds.apache.org>.
Build: https://builds.apache.org/job/Lucene-Solr-tests-only-trunk/9801/
1 tests failed.
FAILED: org.apache.solr.search.TestRealTimeGet.testStressLuceneNRT
Error Message:
Some threads threw uncaught exceptions!
Stack Trace:
junit.framework.AssertionFailedError: Some threads threw uncaught exceptions!
at org.apache.lucene.util.LuceneTestCase$LuceneTestCaseRunner.runChild(LuceneTestCase.java:1522)
at org.apache.lucene.util.LuceneTestCase$LuceneTestCaseRunner.runChild(LuceneTestCase.java:1427)
at org.apache.lucene.util.LuceneTestCase.tearDown(LuceneTestCase.java:639)
at org.apache.solr.SolrTestCaseJ4.tearDown(SolrTestCaseJ4.java:99)
Build Log (for compile errors):
[...truncated 8131 lines...]
---------------------------------------------------------------------
To unsubscribe, e-mail: dev-unsubscribe@lucene.apache.org
For additional commands, e-mail: dev-help@lucene.apache.org
[JENKINS] Lucene-Solr-tests-only-trunk - Build # 9800 - Still
Failing
Posted by Apache Jenkins Server <je...@builds.apache.org>.
Build: https://builds.apache.org/job/Lucene-Solr-tests-only-trunk/9800/
1 tests failed.
FAILED: org.apache.solr.search.TestRealTimeGet.testStressLuceneNRT
Error Message:
Some threads threw uncaught exceptions!
Stack Trace:
junit.framework.AssertionFailedError: Some threads threw uncaught exceptions!
at org.apache.lucene.util.LuceneTestCase$LuceneTestCaseRunner.runChild(LuceneTestCase.java:1522)
at org.apache.lucene.util.LuceneTestCase$LuceneTestCaseRunner.runChild(LuceneTestCase.java:1427)
at org.apache.lucene.util.LuceneTestCase.tearDown(LuceneTestCase.java:639)
at org.apache.solr.SolrTestCaseJ4.tearDown(SolrTestCaseJ4.java:99)
Build Log (for compile errors):
[...truncated 8156 lines...]
---------------------------------------------------------------------
To unsubscribe, e-mail: dev-unsubscribe@lucene.apache.org
For additional commands, e-mail: dev-help@lucene.apache.org
[JENKINS] Lucene-Solr-tests-only-trunk - Build # 9799 - Still
Failing
Posted by Apache Jenkins Server <je...@builds.apache.org>.
Build: https://builds.apache.org/job/Lucene-Solr-tests-only-trunk/9799/
1 tests failed.
FAILED: org.apache.solr.search.TestRealTimeGet.testStressLuceneNRT
Error Message:
Some threads threw uncaught exceptions!
Stack Trace:
junit.framework.AssertionFailedError: Some threads threw uncaught exceptions!
at org.apache.lucene.util.LuceneTestCase$LuceneTestCaseRunner.runChild(LuceneTestCase.java:1522)
at org.apache.lucene.util.LuceneTestCase$LuceneTestCaseRunner.runChild(LuceneTestCase.java:1427)
at org.apache.lucene.util.LuceneTestCase.tearDown(LuceneTestCase.java:639)
at org.apache.solr.SolrTestCaseJ4.tearDown(SolrTestCaseJ4.java:99)
Build Log (for compile errors):
[...truncated 8101 lines...]
---------------------------------------------------------------------
To unsubscribe, e-mail: dev-unsubscribe@lucene.apache.org
For additional commands, e-mail: dev-help@lucene.apache.org
[JENKINS] Lucene-Solr-tests-only-trunk - Build # 9798 - Still
Failing
Posted by Apache Jenkins Server <je...@builds.apache.org>.
Build: https://builds.apache.org/job/Lucene-Solr-tests-only-trunk/9798/
1 tests failed.
FAILED: org.apache.solr.search.TestRealTimeGet.testStressLuceneNRT
Error Message:
Some threads threw uncaught exceptions!
Stack Trace:
junit.framework.AssertionFailedError: Some threads threw uncaught exceptions!
at org.apache.lucene.util.LuceneTestCase$LuceneTestCaseRunner.runChild(LuceneTestCase.java:1522)
at org.apache.lucene.util.LuceneTestCase$LuceneTestCaseRunner.runChild(LuceneTestCase.java:1427)
at org.apache.lucene.util.LuceneTestCase.tearDown(LuceneTestCase.java:639)
at org.apache.solr.SolrTestCaseJ4.tearDown(SolrTestCaseJ4.java:99)
Build Log (for compile errors):
[...truncated 8143 lines...]
---------------------------------------------------------------------
To unsubscribe, e-mail: dev-unsubscribe@lucene.apache.org
For additional commands, e-mail: dev-help@lucene.apache.org
[JENKINS] Lucene-Solr-tests-only-trunk - Build # 9797 - Still
Failing
Posted by Apache Jenkins Server <je...@builds.apache.org>.
Build: https://builds.apache.org/job/Lucene-Solr-tests-only-trunk/9797/
1 tests failed.
FAILED: org.apache.solr.search.TestRealTimeGet.testStressLuceneNRT
Error Message:
Some threads threw uncaught exceptions!
Stack Trace:
junit.framework.AssertionFailedError: Some threads threw uncaught exceptions!
at org.apache.lucene.util.LuceneTestCase$LuceneTestCaseRunner.runChild(LuceneTestCase.java:1522)
at org.apache.lucene.util.LuceneTestCase$LuceneTestCaseRunner.runChild(LuceneTestCase.java:1427)
at org.apache.lucene.util.LuceneTestCase.tearDown(LuceneTestCase.java:639)
at org.apache.solr.SolrTestCaseJ4.tearDown(SolrTestCaseJ4.java:99)
Build Log (for compile errors):
[...truncated 8138 lines...]
---------------------------------------------------------------------
To unsubscribe, e-mail: dev-unsubscribe@lucene.apache.org
For additional commands, e-mail: dev-help@lucene.apache.org
[JENKINS] Lucene-Solr-tests-only-trunk - Build # 9796 - Still
Failing
Posted by Apache Jenkins Server <je...@builds.apache.org>.
Build: https://builds.apache.org/job/Lucene-Solr-tests-only-trunk/9796/
1 tests failed.
FAILED: org.apache.solr.search.TestRealTimeGet.testStressLuceneNRT
Error Message:
Some threads threw uncaught exceptions!
Stack Trace:
junit.framework.AssertionFailedError: Some threads threw uncaught exceptions!
at org.apache.lucene.util.LuceneTestCase$LuceneTestCaseRunner.runChild(LuceneTestCase.java:1522)
at org.apache.lucene.util.LuceneTestCase$LuceneTestCaseRunner.runChild(LuceneTestCase.java:1427)
at org.apache.lucene.util.LuceneTestCase.tearDown(LuceneTestCase.java:639)
at org.apache.solr.SolrTestCaseJ4.tearDown(SolrTestCaseJ4.java:99)
Build Log (for compile errors):
[...truncated 8131 lines...]
---------------------------------------------------------------------
To unsubscribe, e-mail: dev-unsubscribe@lucene.apache.org
For additional commands, e-mail: dev-help@lucene.apache.org