You are viewing a plain text version of this content. The canonical link for it is here.
Posted to dev@geronimo.apache.org by ga...@apache.org on 2009/02/13 04:09:12 UTC
[BUILD] trunk: Failed for Revision: 743944
Geronimo Revision: 743944 built with tests included
See the full build-2100.log file at http://people.apache.org/builds/geronimo/server/binaries/trunk/20090212/build-2100.log
Download the binaries from http://people.apache.org/builds/geronimo/server/binaries/trunk/20090212
[INFO] BUILD SUCCESSFUL
[INFO] ------------------------------------------------------------------------
[INFO] Total time: 35 minutes 13 seconds
[INFO] Finished at: Thu Feb 12 21:39:40 EST 2009
[INFO] Final Memory: 638M/973M
[INFO] ------------------------------------------------------------------------
TESTSUITE RESULTS (Failures only)
=================================
See detailed results at http://people.apache.org/builds/geronimo/server/testsuite/ResultsSummary.html
Assembly: tomcat
=================================
See the full test.log file at http://people.apache.org/builds/geronimo/server/binaries/trunk/20090212/logs-2100-tomcat/test.log
[INFO] snapshot org.apache.geronimo.assemblies:geronimo-tomcat6-javaee5:2.2-SNAPSHOT: checking for updates from codehaus-snapshots
[INFO] Using assembly artifact: org.apache.geronimo.assemblies:geronimo-tomcat6-javaee5:zip:bin:2.2-SNAPSHOT:provided
[INFO] Using geronimoHome: /home/geronimo/geronimo/trunk/testsuite/target/geronimo-tomcat6-javaee5-2.2-SNAPSHOT
[INFO] Installing assembly...
[INFO] Expanding: /home/geronimo/.m2/repository/org/apache/geronimo/assemblies/geronimo-tomcat6-javaee5/2.2-SNAPSHOT/geronimo-tomcat6-javaee5-2.2-SNAPSHOT-bin.zip into /home/geronimo/geronimo/trunk/testsuite/target
[INFO] Starting Geronimo server...
[INFO] Selected option set: default
[INFO] Redirecting output to: /home/geronimo/geronimo/trunk/testsuite/target/geronimo-logs/org.apache.geronimo.mavenplugins.geronimo.server.StartServerMojo.log
[INFO] Waiting for Geronimo server...
[INFO] Geronimo server started in 0:00:41.201
[INFO] [shitty:install {execution: default}]
[INFO] Installing /home/geronimo/geronimo/trunk/testsuite/pom.xml to /home/geronimo/.m2/repository/org/apache/geronimo/testsuite/testsuite/2.2-SNAPSHOT/testsuite-2.2-SNAPSHOT.pom
[INFO] [shitty:test {execution: default}]
[INFO] Starting 36 test builds
[INFO]
[INFO] -------------------------------------------------------------------------------
[INFO]
[INFO] commands-testsuite/deploy RUNNING
[INFO] commands-testsuite/deploy SUCCESS (0:00:59.959)
[INFO] commands-testsuite/gshell RUNNING
[INFO] commands-testsuite/gshell SUCCESS (0:00:28.561)
[INFO] commands-testsuite/jaxws RUNNING
[INFO] commands-testsuite/jaxws SUCCESS (0:00:33.513)
[INFO] commands-testsuite/shutdown RUNNING
[INFO] commands-testsuite/shutdown SUCCESS (0:00:16.335)
[INFO] concurrent-testsuite/concurrent-basic RUNNING
[INFO] concurrent-testsuite/concurrent-basic SUCCESS (0:06:23.241)
[INFO] console-testsuite/advanced RUNNING
[INFO] console-testsuite/advanced SUCCESS (0:01:20.270)
[INFO] console-testsuite/basic RUNNING
[INFO] console-testsuite/basic SUCCESS (0:01:42.839)
[INFO] corba-testsuite/corba-helloworld RUNNING
[INFO] corba-testsuite/corba-helloworld SUCCESS (0:00:52.190)
[INFO] corba-testsuite/corba-marshal RUNNING
[INFO] corba-testsuite/corba-marshal SUCCESS (0:00:52.444)
[INFO] corba-testsuite/corba-mytime RUNNING
[INFO] corba-testsuite/corba-mytime SUCCESS (0:00:40.241)
[INFO] deployment-testsuite/deployment-tests RUNNING
[INFO] deployment-testsuite/deployment-tests SUCCESS (0:00:29.773)
[INFO] deployment-testsuite/jca-cms-tests RUNNING
[INFO] deployment-testsuite/jca-cms-tests SUCCESS (0:00:29.795)
[INFO] deployment-testsuite/manifestcp-tests RUNNING
[INFO] deployment-testsuite/manifestcp-tests SUCCESS (0:00:31.532)
[INFO] enterprise-testsuite/ejb-tests RUNNING
[INFO] enterprise-testsuite/ejb-tests SUCCESS (0:00:54.887)
[INFO] enterprise-testsuite/jms-tests RUNNING
[INFO] enterprise-testsuite/jms-tests SUCCESS (0:00:53.866)
[INFO] enterprise-testsuite/jpa-tests RUNNING
[INFO] enterprise-testsuite/jpa-tests SUCCESS (0:01:04.490)
[INFO] enterprise-testsuite/sec-client RUNNING
[INFO] enterprise-testsuite/sec-client SUCCESS (0:00:27.588)
[INFO] enterprise-testsuite/sec-tests RUNNING
[INFO] enterprise-testsuite/sec-tests SUCCESS (0:00:48.017)
[INFO] security-testsuite/test-security RUNNING
[INFO] security-testsuite/test-security FAILURE (0:00:37.126) Java returned: 1
[INFO] web-testsuite/test-2.1-jsps RUNNING
[INFO] web-testsuite/test-2.1-jsps SUCCESS (0:00:29.750)
[INFO] web-testsuite/test-2.5-servlets RUNNING
[INFO] web-testsuite/test-2.5-servlets SUCCESS (0:00:28.434)
[INFO] web-testsuite/test-myfaces RUNNING
[INFO] web-testsuite/test-myfaces SUCCESS (0:00:31.001)
[INFO] web-testsuite/test-tomcat RUNNING
[INFO] web-testsuite/test-tomcat SUCCESS (0:00:21.144)
[INFO] web-testsuite/test-web-forward RUNNING
[INFO] web-testsuite/test-web-forward SUCCESS (0:00:34.273)
[INFO] web-testsuite/test-web-references RUNNING
[INFO] web-testsuite/test-web-references SUCCESS (0:00:38.805)
[INFO] webservices-testsuite/jaxb-tests RUNNING
[INFO] webservices-testsuite/jaxb-tests SUCCESS (0:00:52.134)
[INFO] webservices-testsuite/jaxr-tests RUNNING
[INFO] webservices-testsuite/jaxr-tests SUCCESS (0:00:52.697)
[INFO] webservices-testsuite/jaxrpc-jaxws-tests RUNNING
[INFO] webservices-testsuite/jaxrpc-jaxws-tests SUCCESS (0:00:32.445)
[INFO] webservices-testsuite/jaxrpc-tests RUNNING
[INFO] webservices-testsuite/jaxrpc-tests SUCCESS (0:00:40.923)
[INFO] webservices-testsuite/jaxws-catalog-tests RUNNING
[INFO] webservices-testsuite/jaxws-catalog-tests SUCCESS (0:00:39.369)
[INFO] webservices-testsuite/jaxws-mtom-tests RUNNING
[INFO] webservices-testsuite/jaxws-mtom-tests SUCCESS (0:00:46.011)
[INFO] webservices-testsuite/jaxws-provider-tests RUNNING
[INFO] webservices-testsuite/jaxws-provider-tests SUCCESS (0:00:42.480)
[INFO] webservices-testsuite/jaxws-tests RUNNING
[INFO] webservices-testsuite/jaxws-tests SUCCESS (0:01:43.504)
[INFO] webservices-testsuite/jaxws-wsa-tests RUNNING
[INFO] webservices-testsuite/jaxws-wsa-tests SUCCESS (0:00:44.829)
[INFO] webservices-testsuite/saaj-tests RUNNING
[INFO] webservices-testsuite/saaj-tests SUCCESS (0:00:35.965)
[INFO] webservices-testsuite/stax-tests RUNNING
[INFO] webservices-testsuite/stax-tests SUCCESS (0:00:53.275)
[INFO]
[INFO] -------------------------------------------------------------------------------
[INFO] Test Summary (0:32:33.920)
[INFO] Passed: 35
[INFO] Failed: 1
[INFO] -------------------------------------------------------------------------------
[INFO]
[INFO] The following tests failed:
[INFO] * security-testsuite/test-security - /home/geronimo/geronimo/trunk/testsuite/security-testsuite/test-security/build.log
[INFO]
[INFO] ------------------------------------------------------------------------
[ERROR] BUILD ERROR
Assembly: jetty
=================================
See the full test.log file at http://people.apache.org/builds/geronimo/server/binaries/trunk/20090212/logs-2100-jetty/test.log
[INFO] snapshot org.apache.geronimo.assemblies:geronimo-jetty6-javaee5:2.2-SNAPSHOT: checking for updates from codehaus-snapshots
[INFO] Using assembly artifact: org.apache.geronimo.assemblies:geronimo-jetty6-javaee5:zip:bin:2.2-SNAPSHOT:provided
[INFO] Using geronimoHome: /home/geronimo/geronimo/trunk/testsuite/target/geronimo-jetty6-javaee5-2.2-SNAPSHOT
[INFO] Installing assembly...
[INFO] Expanding: /home/geronimo/.m2/repository/org/apache/geronimo/assemblies/geronimo-jetty6-javaee5/2.2-SNAPSHOT/geronimo-jetty6-javaee5-2.2-SNAPSHOT-bin.zip into /home/geronimo/geronimo/trunk/testsuite/target
[INFO] Starting Geronimo server...
[INFO] Selected option set: default
[INFO] Redirecting output to: /home/geronimo/geronimo/trunk/testsuite/target/geronimo-logs/org.apache.geronimo.mavenplugins.geronimo.server.StartServerMojo.log
[INFO] Waiting for Geronimo server...
[INFO] Geronimo server started in 0:00:42.507
[INFO] [shitty:install {execution: default}]
[INFO] Installing /home/geronimo/geronimo/trunk/testsuite/pom.xml to /home/geronimo/.m2/repository/org/apache/geronimo/testsuite/testsuite/2.2-SNAPSHOT/testsuite-2.2-SNAPSHOT.pom
[INFO] [shitty:test {execution: default}]
[INFO] Starting 36 test builds
[INFO]
[INFO] -------------------------------------------------------------------------------
[INFO]
[INFO] commands-testsuite/deploy RUNNING
[INFO] commands-testsuite/deploy SUCCESS (0:00:56.963)
[INFO] commands-testsuite/gshell RUNNING
[INFO] commands-testsuite/gshell SUCCESS (0:00:29.117)
[INFO] commands-testsuite/jaxws RUNNING
[INFO] commands-testsuite/jaxws SUCCESS (0:00:32.050)
[INFO] commands-testsuite/shutdown RUNNING
[INFO] commands-testsuite/shutdown SUCCESS (0:00:16.439)
[INFO] concurrent-testsuite/concurrent-basic RUNNING
[INFO] concurrent-testsuite/concurrent-basic SUCCESS (0:06:17.215)
[INFO] console-testsuite/advanced RUNNING
[INFO] console-testsuite/advanced SUCCESS (0:01:19.491)
[INFO] console-testsuite/basic RUNNING
[INFO] console-testsuite/basic SUCCESS (0:01:47.658)
[INFO] corba-testsuite/corba-helloworld RUNNING
[INFO] corba-testsuite/corba-helloworld SUCCESS (0:00:43.967)
[INFO] corba-testsuite/corba-marshal RUNNING
[INFO] corba-testsuite/corba-marshal SUCCESS (0:00:52.892)
[INFO] corba-testsuite/corba-mytime RUNNING
[INFO] corba-testsuite/corba-mytime SUCCESS (0:00:40.313)
[INFO] deployment-testsuite/deployment-tests RUNNING
[INFO] deployment-testsuite/deployment-tests SUCCESS (0:00:30.279)
[INFO] deployment-testsuite/jca-cms-tests RUNNING
[INFO] deployment-testsuite/jca-cms-tests SUCCESS (0:00:29.529)
[INFO] deployment-testsuite/manifestcp-tests RUNNING
[INFO] deployment-testsuite/manifestcp-tests SUCCESS (0:00:31.174)
[INFO] enterprise-testsuite/ejb-tests RUNNING
[INFO] enterprise-testsuite/ejb-tests SUCCESS (0:00:36.248)
[INFO] enterprise-testsuite/jms-tests RUNNING
[INFO] enterprise-testsuite/jms-tests SUCCESS (0:00:53.125)
[INFO] enterprise-testsuite/jpa-tests RUNNING
[INFO] enterprise-testsuite/jpa-tests SUCCESS (0:00:43.495)
[INFO] enterprise-testsuite/sec-client RUNNING
[INFO] enterprise-testsuite/sec-client SUCCESS (0:00:28.159)
[INFO] enterprise-testsuite/sec-tests RUNNING
[INFO] enterprise-testsuite/sec-tests SUCCESS (0:00:47.345)
[INFO] security-testsuite/test-security RUNNING
[INFO] security-testsuite/test-security FAILURE (0:00:36.248) Java returned: 1
[INFO] web-testsuite/test-2.1-jsps RUNNING
[INFO] web-testsuite/test-2.1-jsps SUCCESS (0:00:30.948)
[INFO] web-testsuite/test-2.5-servlets RUNNING
[INFO] web-testsuite/test-2.5-servlets SUCCESS (0:00:28.125)
[INFO] web-testsuite/test-jetty RUNNING
[INFO] web-testsuite/test-jetty SUCCESS (0:00:21.554)
[INFO] web-testsuite/test-myfaces RUNNING
[INFO] web-testsuite/test-myfaces SUCCESS (0:00:30.663)
[INFO] web-testsuite/test-web-forward RUNNING
[INFO] web-testsuite/test-web-forward SUCCESS (0:00:34.504)
[INFO] web-testsuite/test-web-references RUNNING
[INFO] web-testsuite/test-web-references SUCCESS (0:00:38.628)
[INFO] webservices-testsuite/jaxb-tests RUNNING
[INFO] webservices-testsuite/jaxb-tests SUCCESS (0:00:53.382)
[INFO] webservices-testsuite/jaxr-tests RUNNING
[INFO] webservices-testsuite/jaxr-tests SUCCESS (0:00:52.940)
[INFO] webservices-testsuite/jaxrpc-jaxws-tests RUNNING
[INFO] webservices-testsuite/jaxrpc-jaxws-tests SUCCESS (0:00:28.403)
[INFO] webservices-testsuite/jaxrpc-tests RUNNING
[INFO] webservices-testsuite/jaxrpc-tests SUCCESS (0:00:42.175)
[INFO] webservices-testsuite/jaxws-catalog-tests RUNNING
[INFO] webservices-testsuite/jaxws-catalog-tests SUCCESS (0:00:40.695)
[INFO] webservices-testsuite/jaxws-mtom-tests RUNNING
[INFO] webservices-testsuite/jaxws-mtom-tests SUCCESS (0:00:39.755)
[INFO] webservices-testsuite/jaxws-provider-tests RUNNING
[INFO] webservices-testsuite/jaxws-provider-tests SUCCESS (0:00:44.772)
[INFO] webservices-testsuite/jaxws-tests RUNNING
[INFO] webservices-testsuite/jaxws-tests SUCCESS (0:01:31.648)
[INFO] webservices-testsuite/jaxws-wsa-tests RUNNING
[INFO] webservices-testsuite/jaxws-wsa-tests SUCCESS (0:00:42.627)
[INFO] webservices-testsuite/saaj-tests RUNNING
[INFO] webservices-testsuite/saaj-tests SUCCESS (0:00:36.864)
[INFO] webservices-testsuite/stax-tests RUNNING
[INFO] webservices-testsuite/stax-tests SUCCESS (0:00:53.308)
[INFO]
[INFO] -------------------------------------------------------------------------------
[INFO] Test Summary (0:31:22.883)
[INFO] Passed: 35
[INFO] Failed: 1
[INFO] -------------------------------------------------------------------------------
[INFO]
[INFO] The following tests failed:
[INFO] * security-testsuite/test-security - /home/geronimo/geronimo/trunk/testsuite/security-testsuite/test-security/build.log
[INFO]
[INFO] ------------------------------------------------------------------------
[ERROR] BUILD ERROR
Samples: trunk
=================================
Log: http://people.apache.org/builds/geronimo/server/binaries/trunk/20090212/samples-2100.log
Build status: OK