You are viewing a plain text version of this content. The canonical link for it is here.
Posted to issues@tez.apache.org by Apache Jenkins Server <je...@builds.apache.org> on 2015/04/10 05:09:43 UTC
Failed: TEZ-2305 PreCommit Build #432
Jira: https://issues.apache.org/jira/browse/TEZ-2305
Build: https://builds.apache.org/job/PreCommit-TEZ-Build/432/
###################################################################################
########################## LAST 60 LINES OF THE CONSOLE ###########################
[...truncated 2765 lines...]
{color:red}-1 overall{color}. Here are the results of testing the latest attachment
http://issues.apache.org/jira/secure/attachment/12724424/TEZ-2305.2.patch
against master revision e7f3539.
{color:green}+1 @author{color}. The patch does not contain any @author tags.
{color:red}-1 tests included{color}. The patch doesn't appear to include any new or modified tests.
Please justify why no new tests are needed for this patch.
Also please list what manual steps were performed to verify this patch.
{color:green}+1 javac{color}. The applied patch does not increase the total number of javac compiler warnings.
{color:green}+1 javadoc{color}. There were no new javadoc warning messages.
{color:green}+1 findbugs{color}. The patch does not introduce any new Findbugs (version 2.0.3) warnings.
{color:green}+1 release audit{color}. The applied patch does not increase the total number of release audit warnings.
{color:green}+1 core tests{color}. The patch passed unit tests in .
Test results: https://builds.apache.org/job/PreCommit-TEZ-Build/432//testReport/
Console output: https://builds.apache.org/job/PreCommit-TEZ-Build/432//console
This message is automatically generated.
======================================================================
======================================================================
Adding comment to Jira.
======================================================================
======================================================================
Comment added.
cdce4d30339e2c61b148daad99bbcea3ca5b28d0 logged out
======================================================================
======================================================================
Finished build.
======================================================================
======================================================================
Build step 'Execute shell' marked build as failure
Archiving artifacts
Sending artifact delta relative to PreCommit-TEZ-Build #430
Archived 44 artifacts
Archive block size is 32768
Received 0 blocks and 2738284 bytes
Compression is 0.0%
Took 0.75 sec
[description-setter] Could not determine description.
Recording test results
Email was triggered for: Failure
Sending email for trigger: Failure
###################################################################################
############################## FAILED TESTS (if any) ##############################
All tests passed
Success: TEZ-1752 PreCommit Build #434
Posted by Apache Jenkins Server <je...@builds.apache.org>.
Jira: https://issues.apache.org/jira/browse/TEZ-1752
Build: https://builds.apache.org/job/PreCommit-TEZ-Build/434/
###################################################################################
########################## LAST 60 LINES OF THE CONSOLE ###########################
[...truncated 2776 lines...]
[INFO] Final Memory: 71M/979M
[INFO] ------------------------------------------------------------------------
{color:green}+1 overall{color}. Here are the results of testing the latest attachment
http://issues.apache.org/jira/secure/attachment/12724470/TEZ-1752.1.patch
against master revision e7f3539.
{color:green}+1 @author{color}. The patch does not contain any @author tags.
{color:green}+1 tests included{color}. The patch appears to include 1 new or modified test files.
{color:green}+1 javac{color}. The applied patch does not increase the total number of javac compiler warnings.
{color:green}+1 javadoc{color}. There were no new javadoc warning messages.
{color:green}+1 findbugs{color}. The patch does not introduce any new Findbugs (version 2.0.3) warnings.
{color:green}+1 release audit{color}. The applied patch does not increase the total number of release audit warnings.
{color:green}+1 core tests{color}. The patch passed unit tests in .
Test results: https://builds.apache.org/job/PreCommit-TEZ-Build/434//testReport/
Console output: https://builds.apache.org/job/PreCommit-TEZ-Build/434//console
This message is automatically generated.
======================================================================
======================================================================
Adding comment to Jira.
======================================================================
======================================================================
Comment added.
311e3bb836ce91ca83c3f501aa8ae1dba27c8ee8 logged out
======================================================================
======================================================================
Finished build.
======================================================================
======================================================================
Archiving artifacts
Sending artifact delta relative to PreCommit-TEZ-Build #430
Archived 44 artifacts
Archive block size is 32768
Received 0 blocks and 2730824 bytes
Compression is 0.0%
Took 1 sec
Description set: TEZ-1752
Recording test results
Email was triggered for: Success
Sending email for trigger: Success
###################################################################################
############################## FAILED TESTS (if any) ##############################
All tests passed
Failed: TEZ-2305 PreCommit Build #433
Posted by Apache Jenkins Server <je...@builds.apache.org>.
Jira: https://issues.apache.org/jira/browse/TEZ-2305
Build: https://builds.apache.org/job/PreCommit-TEZ-Build/433/
###################################################################################
########################## LAST 60 LINES OF THE CONSOLE ###########################
[...truncated 2387 lines...]
{color:red}-1 overall{color}. Here are the results of testing the latest attachment
http://issues.apache.org/jira/secure/attachment/12724449/TEZ-2305-3.patch
against master revision e7f3539.
{color:green}+1 @author{color}. The patch does not contain any @author tags.
{color:green}+1 tests included{color}. The patch appears to include 1 new or modified test files.
{color:red}-1 javac{color}. The applied patch generated 176 javac compiler warnings (more than the master's current 175 warnings).
{color:green}+1 javadoc{color}. There were no new javadoc warning messages.
{color:green}+1 findbugs{color}. The patch does not introduce any new Findbugs (version 2.0.3) warnings.
{color:green}+1 release audit{color}. The applied patch does not increase the total number of release audit warnings.
{color:red}-1 core tests{color}. The patch failed these unit tests in :
org.apache.tez.mapreduce.output.TestMROutputConfigBuilder
Test results: https://builds.apache.org/job/PreCommit-TEZ-Build/433//testReport/
Javac warnings: https://builds.apache.org/job/PreCommit-TEZ-Build/433//artifact/patchprocess/diffJavacWarnings.txt
Console output: https://builds.apache.org/job/PreCommit-TEZ-Build/433//console
This message is automatically generated.
======================================================================
======================================================================
Adding comment to Jira.
======================================================================
======================================================================
Comment added.
5e3bf016ad3d6edaf6fbab8db874d5f16e278073 logged out
======================================================================
======================================================================
Finished build.
======================================================================
======================================================================
Build step 'Execute shell' marked build as failure
Archiving artifacts
Sending artifact delta relative to PreCommit-TEZ-Build #430
Archived 45 artifacts
Archive block size is 32768
Received 0 blocks and 2713986 bytes
Compression is 0.0%
Took 0.78 sec
[description-setter] Could not determine description.
Recording test results
Email was triggered for: Failure
Sending email for trigger: Failure
###################################################################################
############################## FAILED TESTS (if any) ##############################
1 tests failed.
REGRESSION: org.apache.tez.mapreduce.output.TestMROutputConfigBuilder.testNewAPI_ThroughConf
Error Message:
expected:<...guration, useNewAPI:[tru]e> but was:<...guration, useNewAPI:[fals]e>
Stack Trace:
org.junit.ComparisonFailure: expected:<...guration, useNewAPI:[tru]e> but was:<...guration, useNewAPI:[fals]e>
at org.junit.Assert.assertEquals(Assert.java:115)
at org.junit.Assert.assertEquals(Assert.java:144)
at org.apache.tez.mapreduce.output.TestMROutputConfigBuilder.testNewAPI_ThroughConf(TestMROutputConfigBuilder.java:56)