You are viewing a plain text version of this content. The canonical link for it is here.
Posted to dev@lucene.apache.org by Policeman Jenkins Server <je...@sd-datasolutions.de> on 2012/09/30 00:10:57 UTC

[JENKINS] Lucene-Solr-trunk-Linux (64bit/ibm-j9-jdk7) - Build # 1456 - Still Failing!

Build: http://jenkins.sd-datasolutions.de/job/Lucene-Solr-trunk-Linux/1456/
Java: 64bit/ibm-j9-jdk7 -Xjit:exclude={org/apache/lucene/util/fst/FST.pack(IIF)Lorg/apache/lucene/util/fst/FST;}

1 tests failed.
REGRESSION:  org.apache.lucene.codecs.perfield.TestPerFieldPostingsFormat.testDocsAndFreqsAndPositionsAndOffsetsAndPayloads

Error Message:
Java heap space

Stack Trace:
java.lang.OutOfMemoryError: Java heap space
	at org.apache.lucene.codecs.memory.DirectPostingsFormat$DirectField.<init>(DirectPostingsFormat.java:394)
	at org.apache.lucene.codecs.memory.DirectPostingsFormat$DirectFields.<init>(DirectPostingsFormat.java:128)
	at org.apache.lucene.codecs.memory.DirectPostingsFormat.fieldsProducer(DirectPostingsFormat.java:112)
	at org.apache.lucene.codecs.perfield.PerFieldPostingsFormat$FieldsReader.<init>(PerFieldPostingsFormat.java:194)
	at org.apache.lucene.codecs.perfield.PerFieldPostingsFormat.fieldsProducer(PerFieldPostingsFormat.java:233)
	at org.apache.lucene.index.BasePostingsFormatTestCase.buildIndex(BasePostingsFormatTestCase.java:486)
	at org.apache.lucene.index.BasePostingsFormatTestCase.testFull(BasePostingsFormatTestCase.java:947)
	at org.apache.lucene.index.BasePostingsFormatTestCase.testDocsAndFreqsAndPositionsAndOffsetsAndPayloads(BasePostingsFormatTestCase.java:988)
	at sun.reflect.NativeMethodAccessorImpl.invoke0(Native Method)
	at sun.reflect.NativeMethodAccessorImpl.invoke(NativeMethodAccessorImpl.java:88)
	at sun.reflect.DelegatingMethodAccessorImpl.invoke(DelegatingMethodAccessorImpl.java:55)
	at java.lang.reflect.Method.invoke(Method.java:613)
	at com.carrotsearch.randomizedtesting.RandomizedRunner.invoke(RandomizedRunner.java:1559)
	at com.carrotsearch.randomizedtesting.RandomizedRunner.access$600(RandomizedRunner.java:79)
	at com.carrotsearch.randomizedtesting.RandomizedRunner$6.evaluate(RandomizedRunner.java:737)
	at com.carrotsearch.randomizedtesting.RandomizedRunner$7.evaluate(RandomizedRunner.java:773)
	at com.carrotsearch.randomizedtesting.RandomizedRunner$8.evaluate(RandomizedRunner.java:787)
	at org.apache.lucene.util.TestRuleSetupTeardownChained$1.evaluate(TestRuleSetupTeardownChained.java:50)
	at org.apache.lucene.util.TestRuleFieldCacheSanity$1.evaluate(TestRuleFieldCacheSanity.java:51)
	at org.apache.lucene.util.AbstractBeforeAfterRule$1.evaluate(AbstractBeforeAfterRule.java:45)
	at com.carrotsearch.randomizedtesting.rules.SystemPropertiesInvariantRule$1.evaluate(SystemPropertiesInvariantRule.java:55)
	at org.apache.lucene.util.TestRuleThreadAndTestName$1.evaluate(TestRuleThreadAndTestName.java:48)
	at org.apache.lucene.util.TestRuleIgnoreAfterMaxFailures$1.evaluate(TestRuleIgnoreAfterMaxFailures.java:70)
	at org.apache.lucene.util.TestRuleMarkFailure$1.evaluate(TestRuleMarkFailure.java:48)
	at com.carrotsearch.randomizedtesting.rules.StatementAdapter.evaluate(StatementAdapter.java:36)
	at com.carrotsearch.randomizedtesting.ThreadLeakControl$StatementRunner.run(ThreadLeakControl.java:358)
	at com.carrotsearch.randomizedtesting.ThreadLeakControl.forkTimeoutingTask(ThreadLeakControl.java:782)
	at com.carrotsearch.randomizedtesting.ThreadLeakControl$3.evaluate(ThreadLeakControl.java:442)
	at com.carrotsearch.randomizedtesting.RandomizedRunner.runSingleTest(RandomizedRunner.java:746)
	at com.carrotsearch.randomizedtesting.RandomizedRunner$3.evaluate(RandomizedRunner.java:648)
	at com.carrotsearch.randomizedtesting.RandomizedRunner$4.evaluate(RandomizedRunner.java:682)
	at com.carrotsearch.randomizedtesting.RandomizedRunner$5.evaluate(RandomizedRunner.java:693)
	at org.apache.lucene.util.AbstractBeforeAfterRule$1.evaluate(AbstractBeforeAfterRule.java:45)
	at org.apache.lucene.util.TestRuleStoreClassName$1.evaluate(TestRuleStoreClassName.java:42)
	at com.carrotsearch.randomizedtesting.rules.SystemPropertiesInvariantRule$1.evaluate(SystemPropertiesInvariantRule.java:55)
	at com.carrotsearch.randomizedtesting.rules.NoShadowingOrOverridesOnMethodsRule$1.evaluate(NoShadowingOrOverridesOnMethodsRule.java:39)
	at com.carrotsearch.randomizedtesting.rules.NoShadowingOrOverridesOnMethodsRule$1.evaluate(NoShadowingOrOverridesOnMethodsRule.java:39)
	at com.carrotsearch.randomizedtesting.rules.StatementAdapter.evaluate(StatementAdapter.java:36)
	at org.apache.lucene.util.TestRuleAssertionsRequired$1.evaluate(TestRuleAssertionsRequired.java:43)
	at org.apache.lucene.util.TestRuleMarkFailure$1.evaluate(TestRuleMarkFailure.java:48)
	at org.apache.lucene.util.TestRuleIgnoreAfterMaxFailures$1.evaluate(TestRuleIgnoreAfterMaxFailures.java:70)
	at org.apache.lucene.util.TestRuleIgnoreTestSuites$1.evaluate(TestRuleIgnoreTestSuites.java:55)
	at com.carrotsearch.randomizedtesting.rules.StatementAdapter.evaluate(StatementAdapter.java:36)
	at com.carrotsearch.randomizedtesting.ThreadLeakControl$StatementRunner.run(ThreadLeakControl.java:358)
	at java.lang.Thread.run(Thread.java:777)




Build Log:
[...truncated 549 lines...]
[junit4:junit4] Suite: org.apache.lucene.codecs.perfield.TestPerFieldPostingsFormat
[junit4:junit4]   2> sep 29, 2012 10:07:32 PM com.carrotsearch.randomizedtesting.RandomizedRunner$QueueUncaughtExceptionsHandler uncaughtException
[junit4:junit4]   2> AVISO: Uncaught exception in thread: Thread[Attach API wait loop,10,main]
[junit4:junit4]   2> java.lang.OutOfMemoryError: Java heap space
[junit4:junit4]   2> 	at com.ibm.tools.attach.javaSE.CommonDirectory.waitSemaphore(CommonDirectory.java:195)
[junit4:junit4]   2> 	at com.ibm.tools.attach.javaSE.AttachHandler$WaitLoop.waitForNotification(AttachHandler.java:328)
[junit4:junit4]   2> 	at com.ibm.tools.attach.javaSE.AttachHandler$WaitLoop.run(AttachHandler.java:406)
[junit4:junit4]   2> 
[junit4:junit4]   2> NOTE: reproduce with: ant test  -Dtestcase=TestPerFieldPostingsFormat -Dtests.method=testDocsAndFreqsAndPositionsAndOffsetsAndPayloads -Dtests.seed=EB7F15E2ECE8A537 -Dtests.multiplier=3 -Dtests.slow=true -Dtests.locale=es_PR -Dtests.timezone=Africa/Casablanca -Dtests.file.encoding=UTF-8
[junit4:junit4] ERROR   44.8s J1 | TestPerFieldPostingsFormat.testDocsAndFreqsAndPositionsAndOffsetsAndPayloads <<<
[junit4:junit4]    > Throwable #1: java.lang.OutOfMemoryError: Java heap space
[junit4:junit4]    > 	at org.apache.lucene.codecs.memory.DirectPostingsFormat$DirectField.<init>(DirectPostingsFormat.java:394)
[junit4:junit4]    > 	at org.apache.lucene.codecs.memory.DirectPostingsFormat$DirectFields.<init>(DirectPostingsFormat.java:128)
[junit4:junit4]    > 	at org.apache.lucene.codecs.memory.DirectPostingsFormat.fieldsProducer(DirectPostingsFormat.java:112)
[junit4:junit4]    > 	at org.apache.lucene.codecs.perfield.PerFieldPostingsFormat$FieldsReader.<init>(PerFieldPostingsFormat.java:194)
[junit4:junit4]    > 	at org.apache.lucene.codecs.perfield.PerFieldPostingsFormat.fieldsProducer(PerFieldPostingsFormat.java:233)
[junit4:junit4]    > 	at org.apache.lucene.index.BasePostingsFormatTestCase.buildIndex(BasePostingsFormatTestCase.java:486)
[junit4:junit4]    > 	at org.apache.lucene.index.BasePostingsFormatTestCase.testFull(BasePostingsFormatTestCase.java:947)
[junit4:junit4]    > 	at org.apache.lucene.index.BasePostingsFormatTestCase.testDocsAndFreqsAndPositionsAndOffsetsAndPayloads(BasePostingsFormatTestCase.java:988)
[junit4:junit4]    > 	at sun.reflect.NativeMethodAccessorImpl.invoke0(Native Method)
[junit4:junit4]    > 	at sun.reflect.NativeMethodAccessorImpl.invoke(NativeMethodAccessorImpl.java:88)
[junit4:junit4]    > 	at sun.reflect.DelegatingMethodAccessorImpl.invoke(DelegatingMethodAccessorImpl.java:55)
[junit4:junit4]    > 	at java.lang.reflect.Method.invoke(Method.java:613)
[junit4:junit4]    > 	at com.carrotsearch.randomizedtesting.RandomizedRunner.invoke(RandomizedRunner.java:1559)
[junit4:junit4]    > 	at com.carrotsearch.randomizedtesting.RandomizedRunner.access$600(RandomizedRunner.java:79)
[junit4:junit4]    > 	at com.carrotsearch.randomizedtesting.RandomizedRunner$6.evaluate(RandomizedRunner.java:737)
[junit4:junit4]    > 	at com.carrotsearch.randomizedtesting.RandomizedRunner$7.evaluate(RandomizedRunner.java:773)
[junit4:junit4]    > 	at com.carrotsearch.randomizedtesting.RandomizedRunner$8.evaluate(RandomizedRunner.java:787)
[junit4:junit4]    > 	at org.apache.lucene.util.TestRuleSetupTeardownChained$1.evaluate(TestRuleSetupTeardownChained.java:50)
[junit4:junit4]    > 	at org.apache.lucene.util.TestRuleFieldCacheSanity$1.evaluate(TestRuleFieldCacheSanity.java:51)
[junit4:junit4]    > 	at org.apache.lucene.util.AbstractBeforeAfterRule$1.evaluate(AbstractBeforeAfterRule.java:45)
[junit4:junit4]    > 	at com.carrotsearch.randomizedtesting.rules.SystemPropertiesInvariantRule$1.evaluate(SystemPropertiesInvariantRule.java:55)
[junit4:junit4]    > 	at org.apache.lucene.util.TestRuleThreadAndTestName$1.evaluate(TestRuleThreadAndTestName.java:48)
[junit4:junit4]    > 	at org.apache.lucene.util.TestRuleIgnoreAfterMaxFailures$1.evaluate(TestRuleIgnoreAfterMaxFailures.java:70)
[junit4:junit4]    > 	at org.apache.lucene.util.TestRuleMarkFailure$1.evaluate(TestRuleMarkFailure.java:48)
[junit4:junit4]    > 	at com.carrotsearch.randomizedtesting.rules.StatementAdapter.evaluate(StatementAdapter.java:36)
[junit4:junit4]    > 	at com.carrotsearch.randomizedtesting.ThreadLeakControl$StatementRunner.run(ThreadLeakControl.java:358)
[junit4:junit4]    > 	at com.carrotsearch.randomizedtesting.ThreadLeakControl.forkTimeoutingTask(ThreadLeakControl.java:782)
[junit4:junit4]    > 	at com.carrotsearch.randomizedtesting.ThreadLeakControl$3.evaluate(ThreadLeakControl.java:442)
[junit4:junit4]    > 	at com.carrotsearch.randomizedtesting.RandomizedRunner.runSingleTest(RandomizedRunner.java:746)
[junit4:junit4]    > 	at com.carrotsearch.randomizedtesting.RandomizedRunner$3.evaluate(RandomizedRunner.java:648)
[junit4:junit4]    > 	at com.carrotsearch.randomizedtesting.RandomizedRunner$4.evaluate(RandomizedRunner.java:682)
[junit4:junit4]    > 	at com.carrotsearch.randomizedtesting.RandomizedRunner$5.evaluate(RandomizedRunner.java:693)
[junit4:junit4]    > 	at org.apache.lucene.util.AbstractBeforeAfterRule$1.evaluate(AbstractBeforeAfterRule.java:45)
[junit4:junit4]    > 	at org.apache.lucene.util.TestRuleStoreClassName$1.evaluate(TestRuleStoreClassName.java:42)
[junit4:junit4]    > 	at com.carrotsearch.randomizedtesting.rules.SystemPropertiesInvariantRule$1.evaluate(SystemPropertiesInvariantRule.java:55)
[junit4:junit4]    > 	at com.carrotsearch.randomizedtesting.rules.NoShadowingOrOverridesOnMethodsRule$1.evaluate(NoShadowingOrOverridesOnMethodsRule.java:39)
[junit4:junit4]    > 	at com.carrotsearch.randomizedtesting.rules.NoShadowingOrOverridesOnMethodsRule$1.evaluate(NoShadowingOrOverridesOnMethodsRule.java:39)
[junit4:junit4]    > 	at com.carrotsearch.randomizedtesting.rules.StatementAdapter.evaluate(StatementAdapter.java:36)
[junit4:junit4]    > 	at org.apache.lucene.util.TestRuleAssertionsRequired$1.evaluate(TestRuleAssertionsRequired.java:43)
[junit4:junit4]    > 	at org.apache.lucene.util.TestRuleMarkFailure$1.evaluate(TestRuleMarkFailure.java:48)
[junit4:junit4]    > 	at org.apache.lucene.util.TestRuleIgnoreAfterMaxFailures$1.evaluate(TestRuleIgnoreAfterMaxFailures.java:70)
[junit4:junit4]    > 	at org.apache.lucene.util.TestRuleIgnoreTestSuites$1.evaluate(TestRuleIgnoreTestSuites.java:55)
[junit4:junit4]    > 	at com.carrotsearch.randomizedtesting.rules.StatementAdapter.evaluate(StatementAdapter.java:36)
[junit4:junit4]    > 	at com.carrotsearch.randomizedtesting.ThreadLeakControl$StatementRunner.run(ThreadLeakControl.java:358)
[junit4:junit4]    > 	at java.lang.Thread.run(Thread.java:777)
[junit4:junit4]    > Throwable #2: com.carrotsearch.randomizedtesting.UncaughtExceptionError: Captured an uncaught exception in thread: Thread[id=21, name=Attach API wait loop, state=RUNNABLE, group=main]
[junit4:junit4]    > Caused by: java.lang.OutOfMemoryError: Java heap space
[junit4:junit4]    > 	at com.ibm.tools.attach.javaSE.CommonDirectory.waitSemaphore(CommonDirectory.java:195)
[junit4:junit4]    > 	at com.ibm.tools.attach.javaSE.AttachHandler$WaitLoop.waitForNotification(AttachHandler.java:328)
[junit4:junit4]    > 	at com.ibm.tools.attach.javaSE.AttachHandler$WaitLoop.run(AttachHandler.java:406)
[junit4:junit4]   2> NOTE: test params are: codec=Asserting, sim=DefaultSimilarity, locale=es_PR, timezone=Africa/Casablanca
[junit4:junit4]   2> NOTE: Linux 3.2.0-31-generic amd64/IBM Corporation 1.7.0 (64-bit)/cpus=8,threads=1,free=28285912,total=536805376
[junit4:junit4]   2> NOTE: All tests run in this JVM: [TestDocumentsWriterDeleteQueue, TestLongPostings, TestDateSort, TestSpanExplanations, TestFieldCacheRewriteMethod, TestBinaryTerms, TestBooleanMinShouldMatch, TestVersion, TestMultiValuedNumericRangeQuery, TestDirectoryReader, TestAutomatonQuery, TestTypePromotion, TestPositionIncrement, TestFilteredSearch, TestConstantScoreQuery, TestPayloadTermQuery, TestAddIndexes, TestOmitTf, TestUniqueTermCount, TestRAMDirectory, TestCrashCausesCorruptIndex, TestIndexWriterUnicode, TestRegexpRandom, TestDoc, TestDocumentWriter, TestForceMergeForever, TestSpansAdvanced, TestMockAnalyzer, TestSearch, TestNumericRangeQuery64, TestSegmentTermDocs, TestPrefixInBooleanQuery, TestReuseDocsEnum, TestUTF32ToUTF8, TestBytesRef, TestLucene40PostingsReader, TestIndexWriterMerging, TestNumericRangeQuery32, TestFSTs, TestOmitNorms, TestNearSpansOrdered, TestStressIndexing, Test2BTerms, TestDocumentsWriterStallControl, TestSubScorerFreqs, TestPerFieldPostingsFormat]
[junit4:junit4] Completed on J1 in 88.50s, 7 tests, 1 error <<< FAILURES!

[...truncated 558 lines...]
BUILD FAILED
/mnt/ssd/jenkins/workspace/Lucene-Solr-trunk-Linux/build.xml:38: The following error occurred while executing this line:
/mnt/ssd/jenkins/workspace/Lucene-Solr-trunk-Linux/lucene/build.xml:49: The following error occurred while executing this line:
/mnt/ssd/jenkins/workspace/Lucene-Solr-trunk-Linux/lucene/common-build.xml:1143: The following error occurred while executing this line:
/mnt/ssd/jenkins/workspace/Lucene-Solr-trunk-Linux/lucene/common-build.xml:816: There were test failures: 307 suites, 1798 tests, 1 error, 15 ignored (7 assumptions)

Total time: 7 minutes 32 seconds
Build step 'Invoke Ant' marked build as failure
Recording test results
Description set: Java: 64bit/ibm-j9-jdk7 -Xjit:exclude={org/apache/lucene/util/fst/FST.pack(IIF)Lorg/apache/lucene/util/fst/FST;}
Email was triggered for: Failure
Sending email for trigger: Failure



Re: [JENKINS] Lucene-Solr-trunk-Linux (32bit/ibm-j9-jdk6) - Build # 1457 - Still Failing!

Posted by Dawid Weiss <da...@cs.put.poznan.pl>.
That's strange -- should have timed out. I'm guessing the process
never exited for some reason. It'd be nice if you could add a config
so that all *.events files are archived after a build; we had that
with Robert -- what you need to do is add an artefact to be stored
after a build and specify

**/*.events,README.txt

as the pattern. The README.txt is so that jenkins doesn't fail with an
empty fileset in case event files are removed (successful builds). I'd
appreciate this, it'd help in debugging stuff.

Dawid

On Sun, Sep 30, 2012 at 11:15 AM, Uwe Schindler <uw...@thetaphi.de> wrote:
> This one hung in the new test (TestPostingsFormat.testDocsAndFreqsAndPositionsAndOffsets) for 10 hrs.
>
> Unfortunately the kill -3 approach did not produce a stack trace in IBM J9.
>
> Uwe
>
> -----
> Uwe Schindler
> H.-H.-Meier-Allee 63, D-28213 Bremen
> http://www.thetaphi.de
> eMail: uwe@thetaphi.de
>
>> -----Original Message-----
>> From: Policeman Jenkins Server [mailto:jenkins@sd-datasolutions.de]
>> Sent: Sunday, September 30, 2012 11:13 AM
>> To: dev@lucene.apache.org; rmuir@apache.org; mikemccand@apache.org
>> Subject: [JENKINS] Lucene-Solr-trunk-Linux (32bit/ibm-j9-jdk6) - Build # 1457 -
>> Still Failing!
>>
>> Build: http://jenkins.sd-datasolutions.de/job/Lucene-Solr-trunk-Linux/1457/
>> Java: 32bit/ibm-j9-jdk6 -
>> Xjit:exclude={org/apache/lucene/util/fst/FST.pack(IIF)Lorg/apache/lucene/util/f
>> st/FST;}
>>
>> All tests passed
>>
>> Build Log:
>> [...truncated 1718 lines...]
>> [junit4:junit4] ERROR: JVM J0 ended with an exception, command line:
>> /opt/ibm/java-i386-60/jre/bin/java -
>> Xjit:exclude={org/apache/lucene/util/fst/FST.pack(IIF)Lorg/apache/lucene/util/f
>> st/FST;} -Dtests.prefix=tests -Dtests.seed=4AC300401D518FFA -Xmx512M -
>> Dtests.iters= -Dtests.verbose=false -Dtests.infostream=false -
>> Dtests.lockdir=/mnt/ssd/jenkins/workspace/Lucene-Solr-trunk-
>> Linux/lucene/build -Dtests.codec=random -Dtests.postingsformat=random -
>> Dtests.locale=random -Dtests.timezone=random -Dtests.directory=random -
>> Dtests.linedocsfile=europarl.lines.txt.gz -Dtests.luceneMatchVersion=5.0 -
>> Dtests.cleanthreads=perMethod -
>> Djava.util.logging.config.file=/mnt/ssd/jenkins/workspace/Lucene-Solr-trunk-
>> Linux/lucene/tools/junit4/logging.properties -Dtests.nightly=false -
>> Dtests.weekly=false -Dtests.slow=true -Dtests.asserts.gracious=false -
>> Dtests.multiplier=3 -DtempDir=. -Djava.io.tmpdir=. -
>> Dtests.sandbox.dir=/mnt/ssd/jenkins/workspace/Lucene-Solr-trunk-
>> Linux/lucene/build/core -Dclover.db.dir=/mnt/ssd/jenkins/workspace/Lucene-
>> Solr-trunk-Linux/lucene/build/clover/db -
>> Djava.security.manager=org.apache.lucene.util.TestSecurityManager -
>> Djava.security.policy=/mnt/ssd/jenkins/workspace/Lucene-Solr-trunk-
>> Linux/lucene/tools/junit4/tests.policy -Dlucene.version=5.0-SNAPSHOT -
>> Djetty.testMode=1 -Djetty.insecurerandom=1 -
>> Dsolr.directoryFactory=org.apache.solr.core.MockDirectoryFactory -
>> Djava.awt.headless=true -Dfile.encoding=US-ASCII -classpath
>> /mnt/ssd/jenkins/workspace/Lucene-Solr-trunk-
>> Linux/lucene/build/codecs/classes/java:/mnt/ssd/jenkins/workspace/Lucene-
>> Solr-trunk-Linux/lucene/build/test-
>> framework/classes/java:/mnt/ssd/jenkins/workspace/Lucene-Solr-trunk-
>> Linux/lucene/test-framework/lib/junit-
>> 4.10.jar:/mnt/ssd/jenkins/workspace/Lucene-Solr-trunk-Linux/lucene/test-
>> framework/lib/randomizedtesting-runner-
>> 2.0.1.jar:/mnt/ssd/jenkins/workspace/Lucene-Solr-trunk-
>> Linux/lucene/build/core/classes/java:/mnt/ssd/jenkins/workspace/Lucene-Solr-
>> trunk-
>> Linux/lucene/build/core/classes/test:/var/lib/jenkins/tools/Ant/ANT_1.8.2/lib/a
>> nt-launcher.jar:/var/lib/jenkins/.ant/lib/ivy-
>> 2.2.0.jar:/var/lib/jenkins/tools/Ant/ANT_1.8.2/lib/ant-
>> jdepend.jar:/var/lib/jenkins/tools/Ant/ANT_1.8.2/lib/ant-
>> netrexx.jar:/var/lib/jenkins/tools/Ant/ANT_1.8.2/lib/ant-
>> antlr.jar:/var/lib/jenkins/tools/Ant/ANT_1.8.2/lib/ant-commons-
>> net.jar:/var/lib/jenkins/tools/Ant/ANT_1.8.2/lib/ant-
>> javamail.jar:/var/lib/jenkins/tools/Ant/ANT_1.8.2/lib/ant-apache-
>> regexp.jar:/var/lib/jenkins/tools/Ant/ANT_1.8.2/lib/ant-
>> jsch.jar:/var/lib/jenkins/tools/Ant/ANT_1.8.2/lib/ant-apache-
>> xalan2.jar:/var/lib/jenkins/tools/Ant/ANT_1.8.2/lib/ant-
>> junit4.jar:/var/lib/jenkins/tools/Ant/ANT_1.8.2/lib/ant-
>> jmf.jar:/var/lib/jenkins/tools/Ant/ANT_1.8.2/lib/ant.jar:/var/lib/jenkins/tools/A
>> nt/ANT_1.8.2/lib/ant-junit.jar:/var/lib/jenkins/tools/Ant/ANT_1.8.2/lib/ant-
>> apache-bcel.jar:/var/lib/jenkins/tools/Ant/ANT_1.8.2/lib/ant-
>> jai.jar:/var/lib/jenkins/tools/Ant/ANT_1.8.2/lib/ant-commons-
>> logging.jar:/var/lib/jenkins/tools/Ant/ANT_1.8.2/lib/ant-apache-
>> resolver.jar:/var/lib/jenkins/tools/Ant/ANT_1.8.2/lib/ant-apache-
>> oro.jar:/var/lib/jenkins/tools/Ant/ANT_1.8.2/lib/ant-
>> swing.jar:/var/lib/jenkins/tools/Ant/ANT_1.8.2/lib/ant-apache-
>> bsf.jar:/var/lib/jenkins/tools/Ant/ANT_1.8.2/lib/ant-apache-
>> log4j.jar:/var/lib/jenkins/tools/Ant/ANT_1.8.2/lib/ant-testutil.jar:/opt/ibm/java-
>> i386-
>> 60/lib/tools.jar:/var/lib/jenkins/.ivy2/cache/com.carrotsearch.randomizedtestin
>> g/junit4-ant/jars/junit4-ant-2.0.1.jar -ea:org.apache.lucene... -
>> ea:org.apache.solr... com.carrotsearch.ant.tasks.junit4.slave.SlaveMainSafe -
>> eventsfile /mnt/ssd/jenkins/workspace/Lucene-Solr-trunk-
>> Linux/lucene/build/core/test/junit4-J0-20120929_222706_774.events
>> @/mnt/ssd/jenkins/workspace/Lucene-Solr-trunk-
>> Linux/lucene/build/core/test/junit4-J0-20120929_222706_774.suites
>> [junit4:junit4] ERROR: JVM J0 ended with an exception: Forked process exited
>> with an error code: 137
>> [junit4:junit4]       at
>> com.carrotsearch.ant.tasks.junit4.JUnit4.forkProcess(JUnit4.java:1312)
>> [junit4:junit4]       at
>> com.carrotsearch.ant.tasks.junit4.JUnit4.executeSlave(JUnit4.java:1178)
>> [junit4:junit4]       at
>> com.carrotsearch.ant.tasks.junit4.JUnit4.access$000(JUnit4.java:65)
>> [junit4:junit4]       at
>> com.carrotsearch.ant.tasks.junit4.JUnit4$2.call(JUnit4.java:813)
>> [junit4:junit4]       at
>> com.carrotsearch.ant.tasks.junit4.JUnit4$2.call(JUnit4.java:810)
>> [junit4:junit4]       at
>> java.util.concurrent.FutureTask$Sync.innerRun(FutureTask.java:303)
>> [junit4:junit4]       at java.util.concurrent.FutureTask.run(FutureTask.java:138)
>> [junit4:junit4]       at
>> java.util.concurrent.ThreadPoolExecutor$Worker.runTask(ThreadPoolExecutor.j
>> ava:886)
>> [junit4:junit4]       at
>> java.util.concurrent.ThreadPoolExecutor$Worker.run(ThreadPoolExecutor.java:
>> 908)
>> [junit4:junit4]       at java.lang.Thread.run(Thread.java:736)
>>
>> BUILD FAILED
>> /mnt/ssd/jenkins/workspace/Lucene-Solr-trunk-Linux/build.xml:38: The
>> following error occurred while executing this line:
>> /mnt/ssd/jenkins/workspace/Lucene-Solr-trunk-Linux/lucene/build.xml:49: The
>> following error occurred while executing this line:
>> /mnt/ssd/jenkins/workspace/Lucene-Solr-trunk-Linux/lucene/common-
>> build.xml:1143: The following error occurred while executing this line:
>> /mnt/ssd/jenkins/workspace/Lucene-Solr-trunk-Linux/lucene/common-
>> build.xml:816: At least one slave process threw an exception, first: Forked
>> process exited with an error code: 137
>>
>> Total time: 646 minutes 15 seconds
>> Build step 'Invoke Ant' marked build as failure Recording test results
>> Description set: Java: 32bit/ibm-j9-jdk6 -
>> Xjit:exclude={org/apache/lucene/util/fst/FST.pack(IIF)Lorg/apache/lucene/util/f
>> st/FST;}
>> Email was triggered for: Failure
>> Sending email for trigger: Failure
>>
>
>
>
> ---------------------------------------------------------------------
> To unsubscribe, e-mail: dev-unsubscribe@lucene.apache.org
> For additional commands, e-mail: dev-help@lucene.apache.org
>

---------------------------------------------------------------------
To unsubscribe, e-mail: dev-unsubscribe@lucene.apache.org
For additional commands, e-mail: dev-help@lucene.apache.org


RE: [JENKINS] Lucene-Solr-trunk-Linux (32bit/ibm-j9-jdk6) - Build # 1457 - Still Failing!

Posted by Uwe Schindler <uw...@thetaphi.de>.
This one hung in the new test (TestPostingsFormat.testDocsAndFreqsAndPositionsAndOffsets) for 10 hrs.

Unfortunately the kill -3 approach did not produce a stack trace in IBM J9.

Uwe

-----
Uwe Schindler
H.-H.-Meier-Allee 63, D-28213 Bremen
http://www.thetaphi.de
eMail: uwe@thetaphi.de

> -----Original Message-----
> From: Policeman Jenkins Server [mailto:jenkins@sd-datasolutions.de]
> Sent: Sunday, September 30, 2012 11:13 AM
> To: dev@lucene.apache.org; rmuir@apache.org; mikemccand@apache.org
> Subject: [JENKINS] Lucene-Solr-trunk-Linux (32bit/ibm-j9-jdk6) - Build # 1457 -
> Still Failing!
> 
> Build: http://jenkins.sd-datasolutions.de/job/Lucene-Solr-trunk-Linux/1457/
> Java: 32bit/ibm-j9-jdk6 -
> Xjit:exclude={org/apache/lucene/util/fst/FST.pack(IIF)Lorg/apache/lucene/util/f
> st/FST;}
> 
> All tests passed
> 
> Build Log:
> [...truncated 1718 lines...]
> [junit4:junit4] ERROR: JVM J0 ended with an exception, command line:
> /opt/ibm/java-i386-60/jre/bin/java -
> Xjit:exclude={org/apache/lucene/util/fst/FST.pack(IIF)Lorg/apache/lucene/util/f
> st/FST;} -Dtests.prefix=tests -Dtests.seed=4AC300401D518FFA -Xmx512M -
> Dtests.iters= -Dtests.verbose=false -Dtests.infostream=false -
> Dtests.lockdir=/mnt/ssd/jenkins/workspace/Lucene-Solr-trunk-
> Linux/lucene/build -Dtests.codec=random -Dtests.postingsformat=random -
> Dtests.locale=random -Dtests.timezone=random -Dtests.directory=random -
> Dtests.linedocsfile=europarl.lines.txt.gz -Dtests.luceneMatchVersion=5.0 -
> Dtests.cleanthreads=perMethod -
> Djava.util.logging.config.file=/mnt/ssd/jenkins/workspace/Lucene-Solr-trunk-
> Linux/lucene/tools/junit4/logging.properties -Dtests.nightly=false -
> Dtests.weekly=false -Dtests.slow=true -Dtests.asserts.gracious=false -
> Dtests.multiplier=3 -DtempDir=. -Djava.io.tmpdir=. -
> Dtests.sandbox.dir=/mnt/ssd/jenkins/workspace/Lucene-Solr-trunk-
> Linux/lucene/build/core -Dclover.db.dir=/mnt/ssd/jenkins/workspace/Lucene-
> Solr-trunk-Linux/lucene/build/clover/db -
> Djava.security.manager=org.apache.lucene.util.TestSecurityManager -
> Djava.security.policy=/mnt/ssd/jenkins/workspace/Lucene-Solr-trunk-
> Linux/lucene/tools/junit4/tests.policy -Dlucene.version=5.0-SNAPSHOT -
> Djetty.testMode=1 -Djetty.insecurerandom=1 -
> Dsolr.directoryFactory=org.apache.solr.core.MockDirectoryFactory -
> Djava.awt.headless=true -Dfile.encoding=US-ASCII -classpath
> /mnt/ssd/jenkins/workspace/Lucene-Solr-trunk-
> Linux/lucene/build/codecs/classes/java:/mnt/ssd/jenkins/workspace/Lucene-
> Solr-trunk-Linux/lucene/build/test-
> framework/classes/java:/mnt/ssd/jenkins/workspace/Lucene-Solr-trunk-
> Linux/lucene/test-framework/lib/junit-
> 4.10.jar:/mnt/ssd/jenkins/workspace/Lucene-Solr-trunk-Linux/lucene/test-
> framework/lib/randomizedtesting-runner-
> 2.0.1.jar:/mnt/ssd/jenkins/workspace/Lucene-Solr-trunk-
> Linux/lucene/build/core/classes/java:/mnt/ssd/jenkins/workspace/Lucene-Solr-
> trunk-
> Linux/lucene/build/core/classes/test:/var/lib/jenkins/tools/Ant/ANT_1.8.2/lib/a
> nt-launcher.jar:/var/lib/jenkins/.ant/lib/ivy-
> 2.2.0.jar:/var/lib/jenkins/tools/Ant/ANT_1.8.2/lib/ant-
> jdepend.jar:/var/lib/jenkins/tools/Ant/ANT_1.8.2/lib/ant-
> netrexx.jar:/var/lib/jenkins/tools/Ant/ANT_1.8.2/lib/ant-
> antlr.jar:/var/lib/jenkins/tools/Ant/ANT_1.8.2/lib/ant-commons-
> net.jar:/var/lib/jenkins/tools/Ant/ANT_1.8.2/lib/ant-
> javamail.jar:/var/lib/jenkins/tools/Ant/ANT_1.8.2/lib/ant-apache-
> regexp.jar:/var/lib/jenkins/tools/Ant/ANT_1.8.2/lib/ant-
> jsch.jar:/var/lib/jenkins/tools/Ant/ANT_1.8.2/lib/ant-apache-
> xalan2.jar:/var/lib/jenkins/tools/Ant/ANT_1.8.2/lib/ant-
> junit4.jar:/var/lib/jenkins/tools/Ant/ANT_1.8.2/lib/ant-
> jmf.jar:/var/lib/jenkins/tools/Ant/ANT_1.8.2/lib/ant.jar:/var/lib/jenkins/tools/A
> nt/ANT_1.8.2/lib/ant-junit.jar:/var/lib/jenkins/tools/Ant/ANT_1.8.2/lib/ant-
> apache-bcel.jar:/var/lib/jenkins/tools/Ant/ANT_1.8.2/lib/ant-
> jai.jar:/var/lib/jenkins/tools/Ant/ANT_1.8.2/lib/ant-commons-
> logging.jar:/var/lib/jenkins/tools/Ant/ANT_1.8.2/lib/ant-apache-
> resolver.jar:/var/lib/jenkins/tools/Ant/ANT_1.8.2/lib/ant-apache-
> oro.jar:/var/lib/jenkins/tools/Ant/ANT_1.8.2/lib/ant-
> swing.jar:/var/lib/jenkins/tools/Ant/ANT_1.8.2/lib/ant-apache-
> bsf.jar:/var/lib/jenkins/tools/Ant/ANT_1.8.2/lib/ant-apache-
> log4j.jar:/var/lib/jenkins/tools/Ant/ANT_1.8.2/lib/ant-testutil.jar:/opt/ibm/java-
> i386-
> 60/lib/tools.jar:/var/lib/jenkins/.ivy2/cache/com.carrotsearch.randomizedtestin
> g/junit4-ant/jars/junit4-ant-2.0.1.jar -ea:org.apache.lucene... -
> ea:org.apache.solr... com.carrotsearch.ant.tasks.junit4.slave.SlaveMainSafe -
> eventsfile /mnt/ssd/jenkins/workspace/Lucene-Solr-trunk-
> Linux/lucene/build/core/test/junit4-J0-20120929_222706_774.events
> @/mnt/ssd/jenkins/workspace/Lucene-Solr-trunk-
> Linux/lucene/build/core/test/junit4-J0-20120929_222706_774.suites
> [junit4:junit4] ERROR: JVM J0 ended with an exception: Forked process exited
> with an error code: 137
> [junit4:junit4] 	at
> com.carrotsearch.ant.tasks.junit4.JUnit4.forkProcess(JUnit4.java:1312)
> [junit4:junit4] 	at
> com.carrotsearch.ant.tasks.junit4.JUnit4.executeSlave(JUnit4.java:1178)
> [junit4:junit4] 	at
> com.carrotsearch.ant.tasks.junit4.JUnit4.access$000(JUnit4.java:65)
> [junit4:junit4] 	at
> com.carrotsearch.ant.tasks.junit4.JUnit4$2.call(JUnit4.java:813)
> [junit4:junit4] 	at
> com.carrotsearch.ant.tasks.junit4.JUnit4$2.call(JUnit4.java:810)
> [junit4:junit4] 	at
> java.util.concurrent.FutureTask$Sync.innerRun(FutureTask.java:303)
> [junit4:junit4] 	at java.util.concurrent.FutureTask.run(FutureTask.java:138)
> [junit4:junit4] 	at
> java.util.concurrent.ThreadPoolExecutor$Worker.runTask(ThreadPoolExecutor.j
> ava:886)
> [junit4:junit4] 	at
> java.util.concurrent.ThreadPoolExecutor$Worker.run(ThreadPoolExecutor.java:
> 908)
> [junit4:junit4] 	at java.lang.Thread.run(Thread.java:736)
> 
> BUILD FAILED
> /mnt/ssd/jenkins/workspace/Lucene-Solr-trunk-Linux/build.xml:38: The
> following error occurred while executing this line:
> /mnt/ssd/jenkins/workspace/Lucene-Solr-trunk-Linux/lucene/build.xml:49: The
> following error occurred while executing this line:
> /mnt/ssd/jenkins/workspace/Lucene-Solr-trunk-Linux/lucene/common-
> build.xml:1143: The following error occurred while executing this line:
> /mnt/ssd/jenkins/workspace/Lucene-Solr-trunk-Linux/lucene/common-
> build.xml:816: At least one slave process threw an exception, first: Forked
> process exited with an error code: 137
> 
> Total time: 646 minutes 15 seconds
> Build step 'Invoke Ant' marked build as failure Recording test results
> Description set: Java: 32bit/ibm-j9-jdk6 -
> Xjit:exclude={org/apache/lucene/util/fst/FST.pack(IIF)Lorg/apache/lucene/util/f
> st/FST;}
> Email was triggered for: Failure
> Sending email for trigger: Failure
> 



---------------------------------------------------------------------
To unsubscribe, e-mail: dev-unsubscribe@lucene.apache.org
For additional commands, e-mail: dev-help@lucene.apache.org


[JENKINS] Lucene-Solr-trunk-Linux (32bit/ibm-j9-jdk6) - Build # 1457 - Still Failing!

Posted by Policeman Jenkins Server <je...@sd-datasolutions.de>.
Build: http://jenkins.sd-datasolutions.de/job/Lucene-Solr-trunk-Linux/1457/
Java: 32bit/ibm-j9-jdk6 -Xjit:exclude={org/apache/lucene/util/fst/FST.pack(IIF)Lorg/apache/lucene/util/fst/FST;}

All tests passed

Build Log:
[...truncated 1718 lines...]
[junit4:junit4] ERROR: JVM J0 ended with an exception, command line: /opt/ibm/java-i386-60/jre/bin/java -Xjit:exclude={org/apache/lucene/util/fst/FST.pack(IIF)Lorg/apache/lucene/util/fst/FST;} -Dtests.prefix=tests -Dtests.seed=4AC300401D518FFA -Xmx512M -Dtests.iters= -Dtests.verbose=false -Dtests.infostream=false -Dtests.lockdir=/mnt/ssd/jenkins/workspace/Lucene-Solr-trunk-Linux/lucene/build -Dtests.codec=random -Dtests.postingsformat=random -Dtests.locale=random -Dtests.timezone=random -Dtests.directory=random -Dtests.linedocsfile=europarl.lines.txt.gz -Dtests.luceneMatchVersion=5.0 -Dtests.cleanthreads=perMethod -Djava.util.logging.config.file=/mnt/ssd/jenkins/workspace/Lucene-Solr-trunk-Linux/lucene/tools/junit4/logging.properties -Dtests.nightly=false -Dtests.weekly=false -Dtests.slow=true -Dtests.asserts.gracious=false -Dtests.multiplier=3 -DtempDir=. -Djava.io.tmpdir=. -Dtests.sandbox.dir=/mnt/ssd/jenkins/workspace/Lucene-Solr-trunk-Linux/lucene/build/core -Dclover.db.dir=/mnt/ssd/jenkins/workspace/Lucene-Solr-trunk-Linux/lucene/build/clover/db -Djava.security.manager=org.apache.lucene.util.TestSecurityManager -Djava.security.policy=/mnt/ssd/jenkins/workspace/Lucene-Solr-trunk-Linux/lucene/tools/junit4/tests.policy -Dlucene.version=5.0-SNAPSHOT -Djetty.testMode=1 -Djetty.insecurerandom=1 -Dsolr.directoryFactory=org.apache.solr.core.MockDirectoryFactory -Djava.awt.headless=true -Dfile.encoding=US-ASCII -classpath /mnt/ssd/jenkins/workspace/Lucene-Solr-trunk-Linux/lucene/build/codecs/classes/java:/mnt/ssd/jenkins/workspace/Lucene-Solr-trunk-Linux/lucene/build/test-framework/classes/java:/mnt/ssd/jenkins/workspace/Lucene-Solr-trunk-Linux/lucene/test-framework/lib/junit-4.10.jar:/mnt/ssd/jenkins/workspace/Lucene-Solr-trunk-Linux/lucene/test-framework/lib/randomizedtesting-runner-2.0.1.jar:/mnt/ssd/jenkins/workspace/Lucene-Solr-trunk-Linux/lucene/build/core/classes/java:/mnt/ssd/jenkins/workspace/Lucene-Solr-trunk-Linux/lucene/build/core/classes/test:/var/lib/jenkins/tools/Ant/ANT_1.8.2/lib/ant-launcher.jar:/var/lib/jenkins/.ant/lib/ivy-2.2.0.jar:/var/lib/jenkins/tools/Ant/ANT_1.8.2/lib/ant-jdepend.jar:/var/lib/jenkins/tools/Ant/ANT_1.8.2/lib/ant-netrexx.jar:/var/lib/jenkins/tools/Ant/ANT_1.8.2/lib/ant-antlr.jar:/var/lib/jenkins/tools/Ant/ANT_1.8.2/lib/ant-commons-net.jar:/var/lib/jenkins/tools/Ant/ANT_1.8.2/lib/ant-javamail.jar:/var/lib/jenkins/tools/Ant/ANT_1.8.2/lib/ant-apache-regexp.jar:/var/lib/jenkins/tools/Ant/ANT_1.8.2/lib/ant-jsch.jar:/var/lib/jenkins/tools/Ant/ANT_1.8.2/lib/ant-apache-xalan2.jar:/var/lib/jenkins/tools/Ant/ANT_1.8.2/lib/ant-junit4.jar:/var/lib/jenkins/tools/Ant/ANT_1.8.2/lib/ant-jmf.jar:/var/lib/jenkins/tools/Ant/ANT_1.8.2/lib/ant.jar:/var/lib/jenkins/tools/Ant/ANT_1.8.2/lib/ant-junit.jar:/var/lib/jenkins/tools/Ant/ANT_1.8.2/lib/ant-apache-bcel.jar:/var/lib/jenkins/tools/Ant/ANT_1.8.2/lib/ant-jai.jar:/var/lib/jenkins/tools/Ant/ANT_1.8.2/lib/ant-commons-logging.jar:/var/lib/jenkins/tools/Ant/ANT_1.8.2/lib/ant-apache-resolver.jar:/var/lib/jenkins/tools/Ant/ANT_1.8.2/lib/ant-apache-oro.jar:/var/lib/jenkins/tools/Ant/ANT_1.8.2/lib/ant-swing.jar:/var/lib/jenkins/tools/Ant/ANT_1.8.2/lib/ant-apache-bsf.jar:/var/lib/jenkins/tools/Ant/ANT_1.8.2/lib/ant-apache-log4j.jar:/var/lib/jenkins/tools/Ant/ANT_1.8.2/lib/ant-testutil.jar:/opt/ibm/java-i386-60/lib/tools.jar:/var/lib/jenkins/.ivy2/cache/com.carrotsearch.randomizedtesting/junit4-ant/jars/junit4-ant-2.0.1.jar -ea:org.apache.lucene... -ea:org.apache.solr... com.carrotsearch.ant.tasks.junit4.slave.SlaveMainSafe -eventsfile /mnt/ssd/jenkins/workspace/Lucene-Solr-trunk-Linux/lucene/build/core/test/junit4-J0-20120929_222706_774.events @/mnt/ssd/jenkins/workspace/Lucene-Solr-trunk-Linux/lucene/build/core/test/junit4-J0-20120929_222706_774.suites
[junit4:junit4] ERROR: JVM J0 ended with an exception: Forked process exited with an error code: 137
[junit4:junit4] 	at com.carrotsearch.ant.tasks.junit4.JUnit4.forkProcess(JUnit4.java:1312)
[junit4:junit4] 	at com.carrotsearch.ant.tasks.junit4.JUnit4.executeSlave(JUnit4.java:1178)
[junit4:junit4] 	at com.carrotsearch.ant.tasks.junit4.JUnit4.access$000(JUnit4.java:65)
[junit4:junit4] 	at com.carrotsearch.ant.tasks.junit4.JUnit4$2.call(JUnit4.java:813)
[junit4:junit4] 	at com.carrotsearch.ant.tasks.junit4.JUnit4$2.call(JUnit4.java:810)
[junit4:junit4] 	at java.util.concurrent.FutureTask$Sync.innerRun(FutureTask.java:303)
[junit4:junit4] 	at java.util.concurrent.FutureTask.run(FutureTask.java:138)
[junit4:junit4] 	at java.util.concurrent.ThreadPoolExecutor$Worker.runTask(ThreadPoolExecutor.java:886)
[junit4:junit4] 	at java.util.concurrent.ThreadPoolExecutor$Worker.run(ThreadPoolExecutor.java:908)
[junit4:junit4] 	at java.lang.Thread.run(Thread.java:736)

BUILD FAILED
/mnt/ssd/jenkins/workspace/Lucene-Solr-trunk-Linux/build.xml:38: The following error occurred while executing this line:
/mnt/ssd/jenkins/workspace/Lucene-Solr-trunk-Linux/lucene/build.xml:49: The following error occurred while executing this line:
/mnt/ssd/jenkins/workspace/Lucene-Solr-trunk-Linux/lucene/common-build.xml:1143: The following error occurred while executing this line:
/mnt/ssd/jenkins/workspace/Lucene-Solr-trunk-Linux/lucene/common-build.xml:816: At least one slave process threw an exception, first: Forked process exited with an error code: 137

Total time: 646 minutes 15 seconds
Build step 'Invoke Ant' marked build as failure
Recording test results
Description set: Java: 32bit/ibm-j9-jdk6 -Xjit:exclude={org/apache/lucene/util/fst/FST.pack(IIF)Lorg/apache/lucene/util/fst/FST;}
Email was triggered for: Failure
Sending email for trigger: Failure