You are viewing a plain text version of this content. The canonical link for it is here.
Posted to commits@struts.apache.org by Atlassian Open Source Bamboo <ba...@apache.org> on 2009/08/05 21:52:08 UTC

[OSS Bamboo] Struts 2 SVN - Main Build (Java 6) build 912 has FAILED (18 tests failed)

-----------------------------------------------------------
STRUTS-MAINJ6-912 failed.
-----------------------------------------------------------
This build occured because it is a dependant of XWORK-MAIN-397.
18/322 tests failed.

http://opensource.bamboo.atlassian.com/browse/STRUTS-MAINJ6-912/        


--------------
Tests
--------------
Failed Tests (18)
   - PropertyTagTest: Default value (New)
   - PropertyTagTest: Escape java script (New)
   - PropertyTagTest: Simple (New)
   - PropertyTagTest: Top of stack (New)
   - PropertyTagTest: With alt syntax1 (New)
   - PropertyTagTest: With alt syntax2 (New)
   - PropertyTagTest: Without alt syntax1 (New)
   - PropertyTagTest: Without alt syntax2 (New)
   - FilterTest: Using filter dispatcher only (New)
   - FilterTest: Using filter dispatcher only multiple (New)
   - MessageStoreInterceptorTest: Automatic (New)
   - MessageStoreInterceptorTest: Request operation mode1 (New)
   - MessageStoreInterceptorTest: Request operation mode2 (New)
   - MessageStoreInterceptorTest: Request operation mode3 (New)
   - MessageStoreInterceptorTest: Retrieve message (New)
   - MessageStoreInterceptorTest: Store message (New)
   - JSONValidationInterceptorTest: Set up (New)
   - HttpHeaderResultTest: Set up (New)


--------------
Error Summary
--------------
   [INFO] ------------------------------------------------------------------------
   [ERROR] BUILD FAILURE
   [INFO] ------------------------------------------------------------------------
   [INFO] There are test failures.
   [INFO] ------------------------------------------------------------------------
   [INFO] For more information, run Maven with the -e switch


--
This message is automatically generated by Atlassian Bamboo