You are viewing a plain text version of this content. The canonical link for it is here.
Posted to dev@lucene.apache.org by Policeman Jenkins Server <je...@thetaphi.de> on 2014/08/18 22:03:39 UTC
[JENKINS] Lucene-Solr-trunk-Linux (64bit/jdk1.7.0_65) - Build #
11043 - Failure!
Build: http://jenkins.thetaphi.de/job/Lucene-Solr-trunk-Linux/11043/
Java: 64bit/jdk1.7.0_65 -XX:-UseCompressedOops -XX:+UseG1GC
1 tests failed.
REGRESSION: org.apache.lucene.analysis.core.TestRandomChains.testRandomChainsWithLargeStrings
Error Message:
startOffset must be non-negative, and endOffset must be >= startOffset, startOffset=15,endOffset=14
Stack Trace:
java.lang.IllegalArgumentException: startOffset must be non-negative, and endOffset must be >= startOffset, startOffset=15,endOffset=14
at __randomizedtesting.SeedInfo.seed([7061B45954AF4C72:1A3A0B480DE16C81]:0)
at org.apache.lucene.analysis.tokenattributes.PackedTokenAttributeImpl.setOffset(PackedTokenAttributeImpl.java:107)
at org.apache.lucene.analysis.shingle.ShingleFilter.incrementToken(ShingleFilter.java:345)
at org.apache.lucene.analysis.ValidatingTokenFilter.incrementToken(ValidatingTokenFilter.java:68)
at org.apache.lucene.analysis.MockFixedLengthPayloadFilter.incrementToken(MockFixedLengthPayloadFilter.java:47)
at org.apache.lucene.analysis.ValidatingTokenFilter.incrementToken(ValidatingTokenFilter.java:68)
at org.apache.lucene.analysis.BaseTokenStreamTestCase.checkAnalysisConsistency(BaseTokenStreamTestCase.java:704)
at org.apache.lucene.analysis.BaseTokenStreamTestCase.checkRandomData(BaseTokenStreamTestCase.java:615)
at org.apache.lucene.analysis.BaseTokenStreamTestCase.checkRandomData(BaseTokenStreamTestCase.java:513)
at org.apache.lucene.analysis.core.TestRandomChains.testRandomChainsWithLargeStrings(TestRandomChains.java:925)
at sun.reflect.NativeMethodAccessorImpl.invoke0(Native Method)
at sun.reflect.NativeMethodAccessorImpl.invoke(NativeMethodAccessorImpl.java:57)
at sun.reflect.DelegatingMethodAccessorImpl.invoke(DelegatingMethodAccessorImpl.java:43)
at java.lang.reflect.Method.invoke(Method.java:606)
at com.carrotsearch.randomizedtesting.RandomizedRunner.invoke(RandomizedRunner.java:1618)
at com.carrotsearch.randomizedtesting.RandomizedRunner$6.evaluate(RandomizedRunner.java:827)
at com.carrotsearch.randomizedtesting.RandomizedRunner$7.evaluate(RandomizedRunner.java:863)
at com.carrotsearch.randomizedtesting.RandomizedRunner$8.evaluate(RandomizedRunner.java:877)
at org.apache.lucene.util.TestRuleSetupTeardownChained$1.evaluate(TestRuleSetupTeardownChained.java:50)
at org.apache.lucene.util.AbstractBeforeAfterRule$1.evaluate(AbstractBeforeAfterRule.java:46)
at com.carrotsearch.randomizedtesting.rules.SystemPropertiesInvariantRule$1.evaluate(SystemPropertiesInvariantRule.java:55)
at org.apache.lucene.util.TestRuleThreadAndTestName$1.evaluate(TestRuleThreadAndTestName.java:49)
at org.apache.lucene.util.TestRuleIgnoreAfterMaxFailures$1.evaluate(TestRuleIgnoreAfterMaxFailures.java:65)
at org.apache.lucene.util.TestRuleMarkFailure$1.evaluate(TestRuleMarkFailure.java:48)
at com.carrotsearch.randomizedtesting.rules.StatementAdapter.evaluate(StatementAdapter.java:36)
at com.carrotsearch.randomizedtesting.ThreadLeakControl$StatementRunner.run(ThreadLeakControl.java:365)
at com.carrotsearch.randomizedtesting.ThreadLeakControl.forkTimeoutingTask(ThreadLeakControl.java:798)
at com.carrotsearch.randomizedtesting.ThreadLeakControl$3.evaluate(ThreadLeakControl.java:458)
at com.carrotsearch.randomizedtesting.RandomizedRunner.runSingleTest(RandomizedRunner.java:836)
at com.carrotsearch.randomizedtesting.RandomizedRunner$3.evaluate(RandomizedRunner.java:738)
at com.carrotsearch.randomizedtesting.RandomizedRunner$4.evaluate(RandomizedRunner.java:772)
at com.carrotsearch.randomizedtesting.RandomizedRunner$5.evaluate(RandomizedRunner.java:783)
at org.apache.lucene.util.AbstractBeforeAfterRule$1.evaluate(AbstractBeforeAfterRule.java:46)
at org.apache.lucene.util.TestRuleStoreClassName$1.evaluate(TestRuleStoreClassName.java:42)
at com.carrotsearch.randomizedtesting.rules.SystemPropertiesInvariantRule$1.evaluate(SystemPropertiesInvariantRule.java:55)
at com.carrotsearch.randomizedtesting.rules.NoShadowingOrOverridesOnMethodsRule$1.evaluate(NoShadowingOrOverridesOnMethodsRule.java:39)
at com.carrotsearch.randomizedtesting.rules.NoShadowingOrOverridesOnMethodsRule$1.evaluate(NoShadowingOrOverridesOnMethodsRule.java:39)
at com.carrotsearch.randomizedtesting.rules.StatementAdapter.evaluate(StatementAdapter.java:36)
at com.carrotsearch.randomizedtesting.rules.StatementAdapter.evaluate(StatementAdapter.java:36)
at com.carrotsearch.randomizedtesting.rules.StatementAdapter.evaluate(StatementAdapter.java:36)
at org.apache.lucene.util.TestRuleAssertionsRequired$1.evaluate(TestRuleAssertionsRequired.java:43)
at org.apache.lucene.util.TestRuleMarkFailure$1.evaluate(TestRuleMarkFailure.java:48)
at org.apache.lucene.util.TestRuleIgnoreAfterMaxFailures$1.evaluate(TestRuleIgnoreAfterMaxFailures.java:65)
at org.apache.lucene.util.TestRuleIgnoreTestSuites$1.evaluate(TestRuleIgnoreTestSuites.java:55)
at com.carrotsearch.randomizedtesting.rules.StatementAdapter.evaluate(StatementAdapter.java:36)
at com.carrotsearch.randomizedtesting.ThreadLeakControl$StatementRunner.run(ThreadLeakControl.java:365)
at java.lang.Thread.run(Thread.java:745)
Build Log:
[...truncated 5851 lines...]
[junit4] Suite: org.apache.lucene.analysis.core.TestRandomChains
[junit4] 2> TEST FAIL: useCharFilter=true text='jgih el \ue74e\u0000\uf1dc xk e avik |] \u2876\u2874\u28a8 sy \u2d10\u2d2e\u2d0f\u2d18 \u0274\u3c16 o \ufe4b\ufe37\ufe4e\ufe30\ufe4d\ufe3c\ufe46 \ub466#<c\u047b o \u6124\ue60d\ud884\ude6f'
[junit4] 2> Exception from random analyzer:
[junit4] 2> charfilters=
[junit4] 2> org.apache.lucene.analysis.MockCharFilter(java.io.StringReader@4d602e3c)
[junit4] 2> tokenizer=
[junit4] 2> org.apache.lucene.analysis.ngram.NGramTokenizer(org.apache.lucene.util.AttributeFactory$1@ab584219, 28, 48)
[junit4] 2> filters=
[junit4] 2> org.apache.lucene.analysis.miscellaneous.WordDelimiterFilter(ValidatingTokenFilter@7cf2ab87 term=,bytes=[],startOffset=0,endOffset=0,positionIncrement=1,positionLength=1,type=word, [-113, -52, 33, -107, 54, 88, 106, 105, -23, -29, 109, -2, 99, 10, -104, 43, -91, 31, 17, 126, 117, -97, 96, 34, 10, 68, -87, -91, 76, -53, 99, 97, 29, 70, -19, -54, -119, 5, 50, 3, 119, 26, -24, -125, -23, 20, -61, -89, -36, -87, -73, -53, -14, -32, 34, 12, -17, 72, -39, -65, -126, -15, 127, -57, -126, -59, 127, 98, 71, -80, 117, -36, 76, -13, -113, 76, 44, -90, -53, -15, 5, 107, -63, -11, 53, 31, 104, 0, 64, 58, 112, -120, 110, -23, -73, 80, 125, 95, 72, 114, -56, -41, -116, -68, 65, 109, 32, 103, 38, 96, -70, 58, 60, 96, -111, 54], 0, [jtg, ewjnvw])
[junit4] 2> org.apache.lucene.analysis.snowball.SnowballFilter(ValidatingTokenFilter@7e9984c7 term=,bytes=[],startOffset=0,endOffset=0,positionIncrement=1,positionLength=1,type=word,keyword=false, org.tartarus.snowball.ext.HungarianStemmer@14554645)
[junit4] 2> org.apache.lucene.analysis.shingle.ShingleFilter(ValidatingTokenFilter@759c28e5 term=,bytes=[],startOffset=0,endOffset=0,positionIncrement=1,positionLength=1,type=word,keyword=false)
[junit4] 2> org.apache.lucene.analysis.MockFixedLengthPayloadFilter(java.util.Random@282cbdee, ValidatingTokenFilter@116968dd term=,bytes=[],startOffset=0,endOffset=0,positionIncrement=1,positionLength=1,type=word,keyword=false,payload=null, 38)
[junit4] 2> offsetsAreCorrect=false
[junit4] 2> NOTE: reproduce with: ant test -Dtestcase=TestRandomChains -Dtests.method=testRandomChainsWithLargeStrings -Dtests.seed=7061B45954AF4C72 -Dtests.multiplier=3 -Dtests.slow=true -Dtests.locale=zh_CN -Dtests.timezone=Mideast/Riyadh88 -Dtests.file.encoding=ISO-8859-1
[junit4] ERROR 2.71s J1 | TestRandomChains.testRandomChainsWithLargeStrings <<<
[junit4] > Throwable #1: java.lang.IllegalArgumentException: startOffset must be non-negative, and endOffset must be >= startOffset, startOffset=15,endOffset=14
[junit4] > at __randomizedtesting.SeedInfo.seed([7061B45954AF4C72:1A3A0B480DE16C81]:0)
[junit4] > at org.apache.lucene.analysis.tokenattributes.PackedTokenAttributeImpl.setOffset(PackedTokenAttributeImpl.java:107)
[junit4] > at org.apache.lucene.analysis.shingle.ShingleFilter.incrementToken(ShingleFilter.java:345)
[junit4] > at org.apache.lucene.analysis.ValidatingTokenFilter.incrementToken(ValidatingTokenFilter.java:68)
[junit4] > at org.apache.lucene.analysis.MockFixedLengthPayloadFilter.incrementToken(MockFixedLengthPayloadFilter.java:47)
[junit4] > at org.apache.lucene.analysis.ValidatingTokenFilter.incrementToken(ValidatingTokenFilter.java:68)
[junit4] > at org.apache.lucene.analysis.BaseTokenStreamTestCase.checkAnalysisConsistency(BaseTokenStreamTestCase.java:704)
[junit4] > at org.apache.lucene.analysis.BaseTokenStreamTestCase.checkRandomData(BaseTokenStreamTestCase.java:615)
[junit4] > at org.apache.lucene.analysis.BaseTokenStreamTestCase.checkRandomData(BaseTokenStreamTestCase.java:513)
[junit4] > at org.apache.lucene.analysis.core.TestRandomChains.testRandomChainsWithLargeStrings(TestRandomChains.java:925)
[junit4] > at java.lang.Thread.run(Thread.java:745)
[junit4] 2> NOTE: leaving temporary files on disk at: /mnt/ssd/jenkins/workspace/Lucene-Solr-trunk-Linux/lucene/build/analysis/common/test/J1/./temp/lucene.analysis.core.TestRandomChains-7061B45954AF4C72-001
[junit4] 2> NOTE: test params are: codec=Lucene40, sim=DefaultSimilarity, locale=zh_CN, timezone=Mideast/Riyadh88
[junit4] 2> NOTE: Linux 3.13.0-34-generic amd64/Oracle Corporation 1.7.0_65 (64-bit)/cpus=8,threads=1,free=324888680,total=524288000
[junit4] 2> NOTE: All tests run in this JVM: [TestFrenchAnalyzer, TestCollationDocValuesField, TestEnglishMinimalStemFilter, TestCharacterUtils, TestUAX29URLEmailTokenizer, TestCommonGramsFilterFactory, TestSegmentingTokenizerBase, EdgeNGramTokenizerTest, TestArmenianAnalyzer, TestKStemmer, TestCJKWidthFilterFactory, TestGermanAnalyzer, TestCJKWidthFilter, TestDependencies, TestCharTokenizers, TestFrenchLightStemFilter, TestBrazilianStemmer, TestDoubleEscape, TestCodepointCountFilter, TestEnglishMinimalStemFilterFactory, DelimitedPayloadTokenFilterTest, TestGalicianAnalyzer, TestKeywordAnalyzer, TestSoraniStemFilter, TestArabicAnalyzer, TestHindiAnalyzer, TestArabicFilters, TestSnowballPorterFilterFactory, TestSpaces, TestTwoSuffixes, TestCzechStemmer, TestPortugueseStemFilterFactory, TestClassicAnalyzer, TestGalicianStemFilter, TestFinnishLightStemFilterFactory, ShingleFilterTest, TestFlagNum, DateRecognizerSinkTokenizerTest, TestTrimFilterFactory, TestWordnetSynonymParser, TestAnalyzers, TestCollationKeyAnalyzer, TestDictionaryCompoundWordTokenFilterFactory, TestPortugueseLightStemFilter, TestCompoundWordTokenFilter, TestTurkishLowerCaseFilter, TestAllAnalyzersHaveFactories, TestMappingCharFilterFactory, TestSpanishLightStemFilter, TestEnglishAnalyzer, TestLatvianStemFilterFactory, TestNorwegianLightStemFilterFactory, TestCapitalizationFilter, TestPortugueseMinimalStemFilter, TestPortugueseAnalyzer, TestEscaped, TestHungarianLightStemFilter, TestCondition, TestHindiFilters, TestIgnore, TestTurkishLowerCaseFilterFactory, HTMLStripCharFilterTest, TestPortugueseLightStemFilterFactory, TestTurkishAnalyzer, TestRussianAnalyzer, Test64kAffixes, TestSnowball, TestRandomChains]
[junit4] Completed on J1 in 36.24s, 2 tests, 1 error <<< FAILURES!
[...truncated 463 lines...]
BUILD FAILED
/mnt/ssd/jenkins/workspace/Lucene-Solr-trunk-Linux/build.xml:474: The following error occurred while executing this line:
/mnt/ssd/jenkins/workspace/Lucene-Solr-trunk-Linux/build.xml:454: The following error occurred while executing this line:
/mnt/ssd/jenkins/workspace/Lucene-Solr-trunk-Linux/build.xml:45: The following error occurred while executing this line:
/mnt/ssd/jenkins/workspace/Lucene-Solr-trunk-Linux/extra-targets.xml:37: The following error occurred while executing this line:
/mnt/ssd/jenkins/workspace/Lucene-Solr-trunk-Linux/lucene/build.xml:544: The following error occurred while executing this line:
/mnt/ssd/jenkins/workspace/Lucene-Solr-trunk-Linux/lucene/common-build.xml:2106: The following error occurred while executing this line:
/mnt/ssd/jenkins/workspace/Lucene-Solr-trunk-Linux/lucene/analysis/build.xml:106: The following error occurred while executing this line:
/mnt/ssd/jenkins/workspace/Lucene-Solr-trunk-Linux/lucene/analysis/build.xml:38: The following error occurred while executing this line:
/mnt/ssd/jenkins/workspace/Lucene-Solr-trunk-Linux/lucene/module-build.xml:60: The following error occurred while executing this line:
/mnt/ssd/jenkins/workspace/Lucene-Solr-trunk-Linux/lucene/common-build.xml:1350: The following error occurred while executing this line:
/mnt/ssd/jenkins/workspace/Lucene-Solr-trunk-Linux/lucene/common-build.xml:965: There were test failures: 268 suites, 1358 tests, 1 error, 1 ignored
Total time: 26 minutes 16 seconds
Build step 'Invoke Ant' marked build as failure
[description-setter] Description set: Java: 64bit/jdk1.7.0_65 -XX:-UseCompressedOops -XX:+UseG1GC
Archiving artifacts
Recording test results
Email was triggered for: Failure - Any
Sending email for trigger: Failure - Any