You are viewing a plain text version of this content. The canonical link for it is here.
Posted to builds@solr.apache.org by Policeman Jenkins Server <je...@thetaphi.de> on 2024/03/30 05:08:17 UTC

[JENKINS] Solr-main-Linux (64bit/hotspot/jdk-22) - Build # 17540 - Unstable!

Build: https://jenkins.thetaphi.de/job/Solr-main-Linux/17540/
Java: 64bit/hotspot/jdk-22 -XX:-UseCompressedOops -XX:+UseG1GC

1 tests failed.
FAILED:  org.apache.solr.hdfs.cloud.api.collections.TestHdfsCloudBackupRestore.testRestoreFailure

Error Message:
java.lang.AssertionError: Failed collection is still in the clusterstate: DocCollection(hdfsbackuprestore_testfailure_restored//collections/hdfsbackuprestore_testfailure_restored/state.json/0 )={
  "pullReplicas":0,
  "configName":"confFaulty",
  "nrtReplicas":2,
  "replicationFactor":2,
  "tlogReplicas":0,
  "router":{"name":"compositeId"},
  "shards":{
    "shard2":{
      "range":"0-7fffffff",
      "replicas":{},
      "state":"active"},
    "shard1":{
      "range":"80000000-ffffffff",
      "replicas":{},
      "state":"active"}}}
Expected: not a collection containing "hdfsbackuprestore_testfailure_restored"
     but: was <[hdfsbackuprestore_testfailure, hdfsbackuprestore_testfailure_restored, hdfsbackuprestore_testok, hdfsbackuprestore_testok_restored]>

Stack Trace:
java.lang.AssertionError: Failed collection is still in the clusterstate: DocCollection(hdfsbackuprestore_testfailure_restored//collections/hdfsbackuprestore_testfailure_restored/state.json/0 )={
  "pullReplicas":0,
  "configName":"confFaulty",
  "nrtReplicas":2,
  "replicationFactor":2,
  "tlogReplicas":0,
  "router":{"name":"compositeId"},
  "shards":{
    "shard2":{
      "range":"0-7fffffff",
      "replicas":{},
      "state":"active"},
    "shard1":{
      "range":"80000000-ffffffff",
      "replicas":{},
      "state":"active"}}}
Expected: not a collection containing "hdfsbackuprestore_testfailure_restored"
     but: was <[hdfsbackuprestore_testfailure, hdfsbackuprestore_testfailure_restored, hdfsbackuprestore_testok, hdfsbackuprestore_testok_restored]>
	at __randomizedtesting.SeedInfo.seed([3A5C2F6CD7AC968F:1320B149FFF595A2]:0)
	at org.hamcrest.MatcherAssert.assertThat(MatcherAssert.java:20)
	at org.apache.solr.SolrTestCase.assertThat(SolrTestCase.java:212)
	at org.apache.solr.cloud.api.collections.AbstractCloudBackupRestoreTestCase.testRestoreFailure(AbstractCloudBackupRestoreTestCase.java:221)
	at java.base/jdk.internal.reflect.DirectMethodHandleAccessor.invoke(DirectMethodHandleAccessor.java:103)
	at java.base/java.lang.reflect.Method.invoke(Method.java:580)
	at com.carrotsearch.randomizedtesting.RandomizedRunner.invoke(RandomizedRunner.java:1758)
	at com.carrotsearch.randomizedtesting.RandomizedRunner$8.evaluate(RandomizedRunner.java:946)
	at com.carrotsearch.randomizedtesting.RandomizedRunner$9.evaluate(RandomizedRunner.java:982)
	at com.carrotsearch.randomizedtesting.RandomizedRunner$10.evaluate(RandomizedRunner.java:996)
	at com.carrotsearch.randomizedtesting.rules.SystemPropertiesRestoreRule$1.evaluate(SystemPropertiesRestoreRule.java:80)
	at org.junit.rules.RunRules.evaluate(RunRules.java:20)
	at org.apache.lucene.tests.util.TestRuleSetupTeardownChained$1.evaluate(TestRuleSetupTeardownChained.java:48)
	at org.apache.lucene.tests.util.AbstractBeforeAfterRule$1.evaluate(AbstractBeforeAfterRule.java:43)
	at org.apache.lucene.tests.util.TestRuleThreadAndTestName$1.evaluate(TestRuleThreadAndTestName.java:45)
	at org.apache.lucene.tests.util.TestRuleIgnoreAfterMaxFailures$1.evaluate(TestRuleIgnoreAfterMaxFailures.java:60)
	at org.apache.lucene.tests.util.TestRuleMarkFailure$1.evaluate(TestRuleMarkFailure.java:44)
	at org.junit.rules.RunRules.evaluate(RunRules.java:20)
	at com.carrotsearch.randomizedtesting.rules.StatementAdapter.evaluate(StatementAdapter.java:36)
	at com.carrotsearch.randomizedtesting.ThreadLeakControl$StatementRunner.run(ThreadLeakControl.java:390)
	at com.carrotsearch.randomizedtesting.ThreadLeakControl.forkTimeoutingTask(ThreadLeakControl.java:843)
	at com.carrotsearch.randomizedtesting.ThreadLeakControl$3.evaluate(ThreadLeakControl.java:490)
	at com.carrotsearch.randomizedtesting.RandomizedRunner.runSingleTest(RandomizedRunner.java:955)
	at com.carrotsearch.randomizedtesting.RandomizedRunner$5.evaluate(RandomizedRunner.java:840)
	at com.carrotsearch.randomizedtesting.RandomizedRunner$6.evaluate(RandomizedRunner.java:891)
	at com.carrotsearch.randomizedtesting.RandomizedRunner$7.evaluate(RandomizedRunner.java:902)
	at com.carrotsearch.randomizedtesting.rules.StatementAdapter.evaluate(StatementAdapter.java:36)
	at com.carrotsearch.randomizedtesting.rules.StatementAdapter.evaluate(StatementAdapter.java:36)
	at org.apache.lucene.tests.util.AbstractBeforeAfterRule$1.evaluate(AbstractBeforeAfterRule.java:43)
	at com.carrotsearch.randomizedtesting.rules.SystemPropertiesRestoreRule$1.evaluate(SystemPropertiesRestoreRule.java:80)
	at org.junit.rules.RunRules.evaluate(RunRules.java:20)
	at org.apache.lucene.tests.util.AbstractBeforeAfterRule$1.evaluate(AbstractBeforeAfterRule.java:43)
	at com.carrotsearch.randomizedtesting.rules.StatementAdapter.evaluate(StatementAdapter.java:36)
	at org.apache.lucene.tests.util.TestRuleStoreClassName$1.evaluate(TestRuleStoreClassName.java:38)
	at com.carrotsearch.randomizedtesting.rules.NoShadowingOrOverridesOnMethodsRule$1.evaluate(NoShadowingOrOverridesOnMethodsRule.java:40)
	at com.carrotsearch.randomizedtesting.rules.NoShadowingOrOverridesOnMethodsRule$1.evaluate(NoShadowingOrOverridesOnMethodsRule.java:40)
	at com.carrotsearch.randomizedtesting.rules.StatementAdapter.evaluate(StatementAdapter.java:36)
	at com.carrotsearch.randomizedtesting.rules.StatementAdapter.evaluate(StatementAdapter.java:36)
	at org.apache.lucene.tests.util.TestRuleAssertionsRequired$1.evaluate(TestRuleAssertionsRequired.java:53)
	at org.apache.lucene.tests.util.AbstractBeforeAfterRule$1.evaluate(AbstractBeforeAfterRule.java:43)
	at org.apache.lucene.tests.util.TestRuleMarkFailure$1.evaluate(TestRuleMarkFailure.java:44)
	at org.apache.lucene.tests.util.TestRuleIgnoreAfterMaxFailures$1.evaluate(TestRuleIgnoreAfterMaxFailures.java:60)
	at org.apache.lucene.tests.util.TestRuleIgnoreTestSuites$1.evaluate(TestRuleIgnoreTestSuites.java:47)
	at org.junit.rules.RunRules.evaluate(RunRules.java:20)
	at com.carrotsearch.randomizedtesting.rules.StatementAdapter.evaluate(StatementAdapter.java:36)
	at com.carrotsearch.randomizedtesting.ThreadLeakControl$StatementRunner.run(ThreadLeakControl.java:390)
	at com.carrotsearch.randomizedtesting.ThreadLeakControl.lambda$forkTimeoutingTask$0(ThreadLeakControl.java:850)
	at java.base/java.lang.Thread.run(Thread.java:1570)

[JENKINS] Solr-main-Linux (64bit/openj9/jdk-11.0.20) - Build # 17541 - Failure!

Posted by Policeman Jenkins Server <je...@thetaphi.de>.
Build: https://jenkins.thetaphi.de/job/Solr-main-Linux/17541/
Java: 64bit/openj9/jdk-11.0.20 -XX:+UseCompressedOops -Xgcpolicy:gencon

All tests passed