You are viewing a plain text version of this content. The canonical link for it is here.
Posted to builds@beam.apache.org by Apache Jenkins Server <je...@builds.apache.org> on 2019/11/11 20:49:45 UTC

Build failed in Jenkins: beam_PostCommit_Py_ValCont #4781

See <https://builds.apache.org/job/beam_PostCommit_Py_ValCont/4781/display/redirect?page=changes>

Changes:

[robinyqiu] Update BigQueryHllSketchCompatibilityIT to cover empty sketch cases

[andrearaujo] Option to skip display operations in beam's InteractiveRunner. This

[boyuanz] Still use fake pubsub signals when using windmill appliance with

[56301632+RusOr10n] Update pipeline_graph.py

[kcweaver] [BEAM-8472] test Java default GCP region

[pabloem] Merge pull request #9885 from [BEAM-8457] Label Dataflow jobs from

[tweise] Add cross-language efforts to roadmap index page


------------------------------------------
[...truncated 92.44 KB...]
Task ':sdks:python:container:buildDarwinAmd64' is not up-to-date because:
  No history is available.
:sdks:python:container:buildDarwinAmd64 (Thread[Execution worker for ':' Thread 3,5,main]) completed. Took 7.117 secs.
:sdks:python:container:buildLinuxAmd64 (Thread[Execution worker for ':' Thread 3,5,main]) started.

> Task :sdks:python:container:buildLinuxAmd64
Build cache key for task ':sdks:python:container:buildLinuxAmd64' is 7e2b9b69b6d534199011a7c3176fcacf
Caching disabled for task ':sdks:python:container:buildLinuxAmd64': Caching has not been enabled for the task
Task ':sdks:python:container:buildLinuxAmd64' is not up-to-date because:
  No history is available.
:sdks:python:container:buildLinuxAmd64 (Thread[Execution worker for ':' Thread 3,5,main]) completed. Took 4.053 secs.
:sdks:python:container:goBuild (Thread[Execution worker for ':' Thread 3,5,main]) started.

> Task :sdks:python:container:goBuild
Caching disabled for task ':sdks:python:container:goBuild': Caching has not been enabled for the task
Task ':sdks:python:container:goBuild' is not up-to-date because:
  Task has not declared any outputs despite executing actions.
:sdks:python:container:goBuild (Thread[Execution worker for ':' Thread 3,5,main]) completed. Took 0.012 secs.
:sdks:python:container:py2:copyLauncherDependencies (Thread[Execution worker for ':' Thread 3,5,main]) started.

> Task :sdks:python:container:py2:copyLauncherDependencies
Build cache key for task ':sdks:python:container:py2:copyLauncherDependencies' is 9bc7dcaa2ba81d93a386092c08a4d760
Caching disabled for task ':sdks:python:container:py2:copyLauncherDependencies': Caching has not been enabled for the task
Task ':sdks:python:container:py2:copyLauncherDependencies' is not up-to-date because:
  No history is available.
:sdks:python:container:py2:copyLauncherDependencies (Thread[Execution worker for ':' Thread 3,5,main]) completed. Took 0.177 secs.
:sdks:python:container:py2:dockerPrepare (Thread[Execution worker for ':' Thread 3,5,main]) started.

> Task :sdks:python:container:py2:dockerPrepare
Build cache key for task ':sdks:python:container:py2:dockerPrepare' is c60f4d314b9e40b6db5fa0aa40760335
Caching disabled for task ':sdks:python:container:py2:dockerPrepare': Caching has not been enabled for the task
Task ':sdks:python:container:py2:dockerPrepare' is not up-to-date because:
  No history is available.
:sdks:python:container:py2:dockerPrepare (Thread[Execution worker for ':' Thread 3,5,main]) completed. Took 0.186 secs.
:sdks:python:container:py2:docker (Thread[Execution worker for ':' Thread 3,5,main]) started.

> Task :sdks:python:container:py2:docker
Caching disabled for task ':sdks:python:container:py2:docker': Caching has not been enabled for the task
Task ':sdks:python:container:py2:docker' is not up-to-date because:
  Task has not declared any outputs despite executing actions.
Starting process 'command 'docker''. Working directory: <https://builds.apache.org/job/beam_PostCommit_Py_ValCont/ws/src/sdks/python/container/py2/build/docker> Command: docker build --no-cache --build-arg py_version=2.7 -t us.gcr.io/apache-beam-testing/jenkins/python2.7_sdk:20191111-204624 .
Successfully started process 'command 'docker''
Sending build context to Docker daemon  34.17MB
Step 1/13 : ARG py_version
Step 2/13 : FROM python:"${py_version}"-stretch
2.7-stretch: Pulling from library/python
Digest: sha256:74b5af0023eade29406192190898b1bc8e4b881de518c6ebf37cf23cfa949bad
Status: Downloaded newer image for python:2.7-stretch
 ---> 2bc254ad1db5
Step 3/13 : MAINTAINER "Apache Beam <de...@beam.apache.org>"
 ---> Running in 0eda45006559
Removing intermediate container 0eda45006559
 ---> 1ebb3196a451
Step 4/13 : RUN apt-get update &&     apt-get install -y        libsnappy-dev        libyaml-dev        ccache        &&     rm -rf /var/lib/apt/lists/*
 ---> Running in d1d720873bc4
Ign:1 http://deb.debian.org/debian stretch InRelease
Get:2 http://security.debian.org/debian-security stretch/updates InRelease [94.3 kB]
Get:3 http://deb.debian.org/debian stretch-updates InRelease [91.0 kB]
Get:4 http://deb.debian.org/debian stretch Release [118 kB]
Get:5 http://deb.debian.org/debian stretch Release.gpg [2365 B]
Get:6 http://security.debian.org/debian-security stretch/updates/main amd64 Packages [500 kB]
Get:7 http://deb.debian.org/debian stretch-updates/main amd64 Packages [27.9 kB]
Get:8 http://deb.debian.org/debian stretch/main amd64 Packages [7086 kB]
Fetched 7919 kB in 2s (2981 kB/s)
Reading package lists...
Reading package lists...
Building dependency tree...
Reading state information...
libyaml-dev is already the newest version (0.1.7-2).
Suggested packages:
  distcc
The following NEW packages will be installed:
  ccache libsnappy-dev libsnappy1v5
0 upgraded, 3 newly installed, 0 to remove and 3 not upgraded.
Need to get 253 kB of archives.
After this operation, 565 kB of additional disk space will be used.
Get:1 http://deb.debian.org/debian stretch/main amd64 ccache amd64 3.3.4-1 [136 kB]
Get:2 http://deb.debian.org/debian stretch/main amd64 libsnappy1v5 amd64 1.1.3-3 [51.0 kB]
Get:3 http://deb.debian.org/debian stretch/main amd64 libsnappy-dev amd64 1.1.3-3 [65.8 kB]
debconf: delaying package configuration, since apt-utils is not installed
Fetched 253 kB in 0s (3679 kB/s)
Selecting previously unselected package ccache.
(Reading database ... 
(Reading database ... 5%(Reading database ... 10%(Reading database ... 15%(Reading database ... 20%(Reading database ... 25%(Reading database ... 30%(Reading database ... 35%(Reading database ... 40%(Reading database ... 45%(Reading database ... 50%(Reading database ... 55%(Reading database ... 60%(Reading database ... 65%
(Reading database ... 70%
(Reading database ... 75%
(Reading database ... 80%
(Reading database ... 85%
(Reading database ... 90%
(Reading database ... 95%
(Reading database ... 100%(Reading database ... 30537 files and directories currently installed.)
Preparing to unpack .../ccache_3.3.4-1_amd64.deb ...
Unpacking ccache (3.3.4-1) ...
Selecting previously unselected package libsnappy1v5:amd64.
Preparing to unpack .../libsnappy1v5_1.1.3-3_amd64.deb ...
Unpacking libsnappy1v5:amd64 (1.1.3-3) ...
Selecting previously unselected package libsnappy-dev:amd64.
Preparing to unpack .../libsnappy-dev_1.1.3-3_amd64.deb ...
Unpacking libsnappy-dev:amd64 (1.1.3-3) ...
Setting up ccache (3.3.4-1) ...
Updating symlinks in /usr/lib/ccache ...
Processing triggers for libc-bin (2.24-11+deb9u4) ...
Setting up libsnappy1v5:amd64 (1.1.3-3) ...
Setting up libsnappy-dev:amd64 (1.1.3-3) ...
Processing triggers for libc-bin (2.24-11+deb9u4) ...
Removing intermediate container d1d720873bc4
 ---> d1798f147ce6
Step 5/13 : COPY target/base_image_requirements.txt /tmp/base_image_requirements.txt
 ---> 64512754ad0c
Step 6/13 : RUN     pip install -r /tmp/base_image_requirements.txt &&     python -c "from google.protobuf.internal import api_implementation; assert api_implementation._default_implementation_type == 'cpp'; print ('Verified fast protobuf used.')" &&     rm -rf /root/.cache/pip
 ---> Running in 8ca1e685588c
DEPRECATION: Python 2.7 will reach the end of its life on January 1st, 2020. Please upgrade your Python as Python 2.7 won't be maintained after that date. A future version of pip will drop support for Python 2.7. More details about Python 2 support in pip, can be found at https://pip.pypa.io/en/latest/development/release-process/#python-2-support
Ignoring avro-python3: markers 'python_version >= "3.4"' don't match your environment
Collecting avro==1.8.2
  Downloading https://files.pythonhosted.org/packages/eb/27/143f124a7498f841317a92ced877150c5cb8d28a4109ec39666485925d00/avro-1.8.2.tar.gz (43kB)
Collecting fastavro==0.21.24
  Downloading https://files.pythonhosted.org/packages/15/e3/5956c75f68906b119191ef30d9acff661b422cf918a29a03ee0c3ba774be/fastavro-0.21.24-cp27-cp27mu-manylinux1_x86_64.whl (1.0MB)
Collecting crcmod==1.7
  Downloading https://files.pythonhosted.org/packages/6b/b0/e595ce2a2527e169c3bcd6c33d2473c1918e0b7f6826a043ca1245dd4e5b/crcmod-1.7.tar.gz (89kB)
Collecting dill==0.3.0
  Downloading https://files.pythonhosted.org/packages/39/7a/70803635c850e351257029089d38748516a280864c97cbc73087afef6d51/dill-0.3.0.tar.gz (151kB)
Collecting future==0.17.1
  Downloading https://files.pythonhosted.org/packages/90/52/e20466b85000a181e1e144fd8305caf2cf475e2f9674e797b222f8105f5f/future-0.17.1.tar.gz (829kB)
Collecting futures==3.2.0
  Downloading https://files.pythonhosted.org/packages/2d/99/b2c4e9d5a30f6471e410a146232b4118e697fa3ffc06d6a65efde84debd0/futures-3.2.0-py2-none-any.whl
Collecting grpcio==1.22.0
  Downloading https://files.pythonhosted.org/packages/a5/46/5d08b6e26748ed6f3b5e93d980ea5daa63c3a8200b2ad270645b0e2f9566/grpcio-1.22.0-cp27-cp27mu-manylinux1_x86_64.whl (2.2MB)
Collecting hdfs==2.5.6
  Downloading https://files.pythonhosted.org/packages/fc/2f/c25777cbc9eb31c8f5faf07ca016cd724963ada3781a0c02f29636a7cea2/hdfs-2.5.6.tar.gz (41kB)
Collecting httplib2==0.12.0
  Downloading https://files.pythonhosted.org/packages/ce/ed/803905d670b52fa0edfdd135337e545b4496c2ab3a222f1449b7256eb99f/httplib2-0.12.0.tar.gz (218kB)
Collecting mock==2.0.0
  Downloading https://files.pythonhosted.org/packages/e6/35/f187bdf23be87092bd0f1200d43d23076cee4d0dec109f195173fd3ebc79/mock-2.0.0-py2.py3-none-any.whl (56kB)
Collecting oauth2client==3.0.0
  Downloading https://files.pythonhosted.org/packages/c0/7b/bc893e35d6ca46a72faa4b9eaac25c687ce60e1fbe978993fe2de1b0ff0d/oauth2client-3.0.0.tar.gz (77kB)
Collecting protobuf==3.9.0
  Downloading https://files.pythonhosted.org/packages/30/bf/d7f8bc958f9eb4661498cde9f7e630da863e43278222d46105712dde4e13/protobuf-3.9.0-cp27-cp27mu-manylinux1_x86_64.whl (1.2MB)
Collecting pyarrow==0.13.0
  Downloading https://files.pythonhosted.org/packages/83/41/552ed611e2fe1ffca29df430a932426e6b5ce184a1fa26f5b954b0da4909/pyarrow-0.13.0-cp27-cp27mu-manylinux1_x86_64.whl (14.3MB)
Collecting pydot==1.4.1
  Downloading https://files.pythonhosted.org/packages/33/d1/b1479a770f66d962f545c2101630ce1d5592d90cb4f083d38862e93d16d2/pydot-1.4.1-py2.py3-none-any.whl
Collecting pytz==2019.1
  Downloading https://files.pythonhosted.org/packages/3d/73/fe30c2daaaa0713420d0382b16fbb761409f532c56bdcc514bf7b6262bb6/pytz-2019.1-py2.py3-none-any.whl (510kB)
Collecting pyvcf==0.6.8
  Downloading https://files.pythonhosted.org/packages/20/b6/36bfb1760f6983788d916096193fc14c83cce512c7787c93380e09458c09/PyVCF-0.6.8.tar.gz
Collecting pyyaml==5.1
  Downloading https://files.pythonhosted.org/packages/9f/2c/9417b5c774792634834e730932745bc09a7d36754ca00acf1ccd1ac2594d/PyYAML-5.1.tar.gz (274kB)
Collecting typing==3.6.6
  Downloading https://files.pythonhosted.org/packages/cc/3e/29f92b7aeda5b078c86d14f550bf85cff809042e3429ace7af6193c3bc9f/typing-3.6.6-py2-none-any.whl
Collecting nose==1.3.7
  Downloading https://files.pythonhosted.org/packages/99/4f/13fb671119e65c4dce97c60e67d3fd9e6f7f809f2b307e2611f4701205cb/nose-1.3.7-py2-none-any.whl (154kB)
Collecting google-apitools==0.5.28
  Downloading https://files.pythonhosted.org/packages/07/5e/3e04cb66f5ced9267a854184bb09863d85d199646ea8480fee26b4313a00/google_apitools-0.5.28-py2-none-any.whl (134kB)
Collecting googledatastore==7.0.2
  Downloading https://files.pythonhosted.org/packages/3a/cf/5d90efdb2a513d5c02ba0675eefb246250b67a6ec81de610ac94d47cf1ca/googledatastore-7.0.2.tar.gz
Collecting google-cloud-pubsub==0.39.1
  Downloading https://files.pythonhosted.org/packages/c0/9a/4455b1c1450e9b912855b58ca6eee7a27ff1e9b52e4d98c243d93256f469/google_cloud_pubsub-0.39.1-py2.py3-none-any.whl (99kB)
Collecting google-cloud-bigquery==1.17.0
  Downloading https://files.pythonhosted.org/packages/d7/72/e88edd9a0b3c16a7b2c4107b1a9d3ff182b84a29f051ae15293e1375d7fe/google_cloud_bigquery-1.17.0-py2.py3-none-any.whl (140kB)
Collecting proto-google-cloud-datastore-v1==0.90.4
  Downloading https://files.pythonhosted.org/packages/2a/1f/4124f15e1132a2eeeaf616d825990bb1d395b4c2c37362654ea5cd89bb42/proto-google-cloud-datastore-v1-0.90.4.tar.gz
Collecting google-cloud-bigtable==0.32.1
  Downloading https://files.pythonhosted.org/packages/15/81/df8ec275ea39885744ec058f2bbcf393669a423eac18cc6a7707dc4b77d9/google_cloud_bigtable-0.32.1-py2.py3-none-any.whl (156kB)
Collecting google-cloud-core==1.0.2
  Downloading https://files.pythonhosted.org/packages/98/7f/ff56aec313787577e262d5a2e306c04aef61c5c274699ff9fb40095e6691/google_cloud_core-1.0.2-py2.py3-none-any.whl
Collecting google-cloud-datastore==1.7.4
  Downloading https://files.pythonhosted.org/packages/d0/aa/29cbcf8cf7d08ce2d55b9dce858f7c632b434cb6451bed17cb4275804217/google_cloud_datastore-1.7.4-py2.py3-none-any.whl (82kB)
Collecting cython==0.29.10
  Downloading https://files.pythonhosted.org/packages/38/d4/b8aaae645d1d33dfca8f95018fbcafdf5a882b80693a34165ff0b5c26aba/Cython-0.29.10-cp27-cp27mu-manylinux1_x86_64.whl (2.0MB)
Collecting python-snappy==0.5.4
  Downloading https://files.pythonhosted.org/packages/45/35/65d9f8cc537129894b4b32647d80212d1fa342877581c5b8a69872cea8be/python-snappy-0.5.4.tar.gz
Collecting numpy==1.16.4
  Downloading https://files.pythonhosted.org/packages/1f/c7/198496417c9c2f6226616cff7dedf2115a4f4d0276613bab842ec8ac1e23/numpy-1.16.4-cp27-cp27mu-manylinux1_x86_64.whl (17.0MB)
Collecting scipy==1.2.2
  Downloading https://files.pythonhosted.org/packages/1d/f6/7c16d60aeb3694e5611976cb4f1eaf1c6b7f1e7c55771d691013405a02ea/scipy-1.2.2-cp27-cp27mu-manylinux1_x86_64.whl (24.8MB)
Collecting pandas==0.24.2
  Downloading https://files.pythonhosted.org/packages/db/83/7d4008ffc2988066ff37f6a0bb6d7b60822367dcb36ba5e39aa7801fda54/pandas-0.24.2-cp27-cp27mu-manylinux1_x86_64.whl (10.1MB)
Collecting protorpc==0.12.0
  Downloading https://files.pythonhosted.org/packages/cd/b4/4d953c9485e0dd5c94cb1c2e875c3406948cd05d92757b430049054832b3/protorpc-0.12.0-py2-none-any.whl (134kB)
Collecting python-gflags==3.0.6
  Downloading https://files.pythonhosted.org/packages/91/97/84778286b3a1c0d52533a35a0b70a477050df2b83229f56e99c7a0f2d9d6/python-gflags-3.0.6.tar.gz (49kB)
Collecting tensorflow==1.14.0
  Downloading https://files.pythonhosted.org/packages/d3/59/d88fe8c58ffb66aca21d03c0e290cd68327cc133591130c674985e98a482/tensorflow-1.14.0-cp27-cp27mu-manylinux1_x86_64.whl (109.2MB)
ERROR: Exception:
Traceback (most recent call last):
  File "/usr/local/lib/python2.7/site-packages/pip/_internal/cli/base_command.py", line 153, in _main
    status = self.run(options, args)
  File "/usr/local/lib/python2.7/site-packages/pip/_internal/commands/install.py", line 382, in run
    resolver.resolve(requirement_set)
  File "/usr/local/lib/python2.7/site-packages/pip/_internal/legacy_resolve.py", line 201, in resolve
    self._resolve_one(requirement_set, req)
  File "/usr/local/lib/python2.7/site-packages/pip/_internal/legacy_resolve.py", line 365, in _resolve_one
    abstract_dist = self._get_abstract_dist_for(req_to_install)
  File "/usr/local/lib/python2.7/site-packages/pip/_internal/legacy_resolve.py", line 313, in _get_abstract_dist_for
    req, self.session, self.finder, self.require_hashes
  File "/usr/local/lib/python2.7/site-packages/pip/_internal/operations/prepare.py", line 194, in prepare_linked_requirement
    progress_bar=self.progress_bar
  File "/usr/local/lib/python2.7/site-packages/pip/_internal/download.py", line 465, in unpack_url
    progress_bar=progress_bar
  File "/usr/local/lib/python2.7/site-packages/pip/_internal/download.py", line 316, in unpack_http_url
    progress_bar)
  File "/usr/local/lib/python2.7/site-packages/pip/_internal/download.py", line 551, in _download_http_url
    _download_url(resp, link, content_file, hashes, progress_bar)
  File "/usr/local/lib/python2.7/site-packages/pip/_internal/download.py", line 253, in _download_url
    hashes.check_against_chunks(downloaded_chunks)
  File "/usr/local/lib/python2.7/site-packages/pip/_internal/utils/hashes.py", line 80, in check_against_chunks
    for chunk in chunks:
  File "/usr/local/lib/python2.7/site-packages/pip/_internal/download.py", line 223, in written_chunks
    for chunk in chunks:
  File "/usr/local/lib/python2.7/site-packages/pip/_internal/utils/ui.py", line 160, in iter
    for x in it:
  File "/usr/local/lib/python2.7/site-packages/pip/_internal/download.py", line 212, in resp_read
    decode_content=False):
  File "/usr/local/lib/python2.7/site-packages/pip/_vendor/urllib3/response.py", line 564, in stream
    data = self.read(amt=amt, decode_content=decode_content)
  File "/usr/local/lib/python2.7/site-packages/pip/_vendor/urllib3/response.py", line 529, in read
    raise IncompleteRead(self._fp_bytes_read, self.length_remaining)
  File "/usr/local/lib/python2.7/contextlib.py", line 35, in __exit__
    self.gen.throw(type, value, traceback)
  File "/usr/local/lib/python2.7/site-packages/pip/_vendor/urllib3/response.py", line 443, in _error_catcher
    raise ProtocolError("Connection broken: %r" % e, e)
ProtocolError: ("Connection broken: error(104, 'Connection reset by peer')", error(104, 'Connection reset by peer'))
The command '/bin/sh -c pip install -r /tmp/base_image_requirements.txt &&     python -c "from google.protobuf.internal import api_implementation; assert api_implementation._default_implementation_type == 'cpp'; print ('Verified fast protobuf used.')" &&     rm -rf /root/.cache/pip' returned a non-zero code: 2

> Task :sdks:python:container:py2:docker FAILED
:sdks:python:container:py2:docker (Thread[Execution worker for ':' Thread 3,5,main]) completed. Took 48.401 secs.

FAILURE: Build failed with an exception.

* What went wrong:
Execution failed for task ':sdks:python:container:py2:docker'.
> Process 'command 'docker'' finished with non-zero exit value 2

* Try:
Run with --stacktrace option to get the stack trace. Run with --debug option to get more log output. Run with --scan to get full insights.

* Get more help at https://help.gradle.org

Deprecated Gradle features were used in this build, making it incompatible with Gradle 6.0.
Use '--warning-mode all' to show the individual deprecation warnings.
See https://docs.gradle.org/5.2.1/userguide/command_line_interface.html#sec:command_line_warnings

BUILD FAILED in 3m 17s
18 actionable tasks: 17 executed, 1 up-to-date

Publishing build scan...
https://gradle.com/s/jtgto7tit6wle

Build step 'Execute shell' marked build as failure

---------------------------------------------------------------------
To unsubscribe, e-mail: builds-unsubscribe@beam.apache.org
For additional commands, e-mail: builds-help@beam.apache.org


Jenkins build is back to normal : beam_PostCommit_Py_ValCont #4782

Posted by Apache Jenkins Server <je...@builds.apache.org>.
See <https://builds.apache.org/job/beam_PostCommit_Py_ValCont/4782/display/redirect?page=changes>


---------------------------------------------------------------------
To unsubscribe, e-mail: builds-unsubscribe@beam.apache.org
For additional commands, e-mail: builds-help@beam.apache.org