You are viewing a plain text version of this content. The canonical link for it is here.
Posted to notifications@maven.apache.org by Apache Jenkins Server <je...@builds.apache.org> on 2011/08/15 23:06:32 UTC

Build failed in Jenkins: maven-plugins-ITs-m3 #191

See <https://builds.apache.org/job/maven-plugins-ITs-m3/191/changes>

Changes:

[hboutemy] added stagingSiteURL configuration

[hboutemy] [maven-release-plugin] prepare for next development iteration

[hboutemy] [maven-release-plugin] prepare release maven-plugins-22

[hboutemy] prepare maven-plugins version 22 release

[hboutemy] updated parent pom to actual release

[hboutemy] define an artifactId as near as possible from parent artifactId "maven-plugins" to give a good Project Summary report

------------------------------------------
[...truncated 16528 lines...]
AU        maven-resources-plugin/src/test/java/org/apache/maven/plugin/resources/ReflectionPropertiesTest.java
A         maven-resources-plugin/src/test/java/org/apache/maven/plugin/resources/filters
AU        maven-resources-plugin/src/test/java/org/apache/maven/plugin/resources/filters/ItFilter.java
AU        maven-resources-plugin/src/test/java/org/apache/maven/plugin/resources/AbstractPropertyUtilsTest.java
AU        maven-resources-plugin/src/test/java/org/apache/maven/plugin/resources/CopyResourcesMojoTest.java
AU        maven-resources-plugin/src/test/java/org/apache/maven/plugin/resources/TestResourcesTest.java
AU        maven-resources-plugin/src/test/java/org/apache/maven/plugin/resources/EnhancedPropertyUtilsTest.java
A         maven-resources-plugin/src/test/java/org/apache/maven/plugin/resources/stub
AU        maven-resources-plugin/src/test/java/org/apache/maven/plugin/resources/stub/MavenProjectResourcesStub.java
AU        maven-resources-plugin/src/test/java/org/apache/maven/plugin/resources/stub/MavenProjectBuildStub.java
AU        maven-resources-plugin/src/test/java/org/apache/maven/plugin/resources/stub/MavenProjectBasicStub.java
A         maven-resources-plugin/src/test/resources
A         maven-resources-plugin/src/test/resources/unit
A         maven-resources-plugin/src/test/resources/unit/reflectionproperties-test
AU        maven-resources-plugin/src/test/resources/unit/reflectionproperties-test/plugin-config.xml
AU        maven-resources-plugin/src/test/resources/unit/reflectionproperties-test/validation.properties
AU        maven-resources-plugin/src/test/resources/unit/reflectionproperties-test/validation_escapebackslashinpath.properties
A         maven-resources-plugin/src/test/resources/unit/resources-test
AU        maven-resources-plugin/src/test/resources/unit/resources-test/plugin-config.xml
AU        maven-resources-plugin/src/test/resources/unit/resources-test/plugin-config-relative-path.xml
AU        maven-resources-plugin/src/test/resources/unit/resources-test/validation.properties
AU        maven-resources-plugin/src/test/resources/unit/resources-test/plugin-config-absolute-path.xml
A         maven-resources-plugin/src/test/resources/unit/propertiesutils-test
AU        maven-resources-plugin/src/test/resources/unit/propertiesutils-test/enhanced.properties
AU        maven-resources-plugin/src/test/resources/unit/propertiesutils-test/advance_validation.properties
AU        maven-resources-plugin/src/test/resources/unit/propertiesutils-test/basic_validation.properties
AU        maven-resources-plugin/src/test/resources/unit/propertiesutils-test/enhanced_validation.properties
AU        maven-resources-plugin/src/test/resources/unit/propertiesutils-test/advance.properties
AU        maven-resources-plugin/src/test/resources/unit/propertiesutils-test/basic.properties
A         maven-resources-plugin/src/main
A         maven-resources-plugin/src/main/java
A         maven-resources-plugin/src/main/java/org
A         maven-resources-plugin/src/main/java/org/apache
A         maven-resources-plugin/src/main/java/org/apache/maven
A         maven-resources-plugin/src/main/java/org/apache/maven/plugin
A         maven-resources-plugin/src/main/java/org/apache/maven/plugin/resources
AU        maven-resources-plugin/src/main/java/org/apache/maven/plugin/resources/ResourcesMojo.java
AU        maven-resources-plugin/src/main/java/org/apache/maven/plugin/resources/TestResourcesMojo.java
AU        maven-resources-plugin/src/main/java/org/apache/maven/plugin/resources/PropertyUtils.java
AU        maven-resources-plugin/src/main/java/org/apache/maven/plugin/resources/ReflectionProperties.java
AU        maven-resources-plugin/src/main/java/org/apache/maven/plugin/resources/Resource.java
AU        maven-resources-plugin/src/main/java/org/apache/maven/plugin/resources/CopyResourcesMojo.java
A         maven-resources-plugin/src/site
AU        maven-resources-plugin/src/site/site.xml
A         maven-resources-plugin/src/site/apt
AU        maven-resources-plugin/src/site/apt/usage.apt.vm
AU        maven-resources-plugin/src/site/apt/index.apt
A         maven-resources-plugin/src/site/apt/examples
AU        maven-resources-plugin/src/site/apt/examples/binaries-filtering.apt.vm
AU        maven-resources-plugin/src/site/apt/examples/escape-filtering.apt.vm
AU        maven-resources-plugin/src/site/apt/examples/copy-resources.apt.vm
AU        maven-resources-plugin/src/site/apt/examples/filter.apt
AU        maven-resources-plugin/src/site/apt/examples/custom-resource-filters.apt.vm
AU        maven-resources-plugin/src/site/apt/examples/encoding.apt.vm
AU        maven-resources-plugin/src/site/apt/examples/resource-directory.apt
AU        maven-resources-plugin/src/site/apt/examples/include-exclude.apt
A         maven-resources-plugin/src/site/fml
AU        maven-resources-plugin/src/site/fml/faq.fml
A         maven-resources-plugin/src/it
A         maven-resources-plugin/src/it/MRESOURCES-77
AU        maven-resources-plugin/src/it/MRESOURCES-77/verify.bsh
A         maven-resources-plugin/src/it/MRESOURCES-77/src
A         maven-resources-plugin/src/it/MRESOURCES-77/src/main
A         maven-resources-plugin/src/it/MRESOURCES-77/src/main/filters
AU        maven-resources-plugin/src/it/MRESOURCES-77/src/main/filters/filter2.properties
AU        maven-resources-plugin/src/it/MRESOURCES-77/src/main/filters/filter3.properties
A         maven-resources-plugin/src/it/MRESOURCES-77/src/main/filters/my.filter
AU        maven-resources-plugin/src/it/MRESOURCES-77/src/main/filters/custom-filters.properties
A         maven-resources-plugin/src/it/MRESOURCES-77/src/main/resources
AU        maven-resources-plugin/src/it/MRESOURCES-77/src/main/resources/SomeResource.txt
AU        maven-resources-plugin/src/it/MRESOURCES-77/pom.xml
A         maven-resources-plugin/src/it/MRESOURCES-78
A         maven-resources-plugin/src/it/MRESOURCES-78/src
A         maven-resources-plugin/src/it/MRESOURCES-78/src/main
A         maven-resources-plugin/src/it/MRESOURCES-78/src/main/resources
AU        maven-resources-plugin/src/it/MRESOURCES-78/src/main/resources/unfiltered.properties
A         maven-resources-plugin/src/it/MRESOURCES-78/src/main/filtered
AU        maven-resources-plugin/src/it/MRESOURCES-78/src/main/filtered/filtered.properties
AU        maven-resources-plugin/src/it/MRESOURCES-78/verify.groovy
AU        maven-resources-plugin/src/it/MRESOURCES-78/pom.xml
A         maven-resources-plugin/src/it/user-filters
A         maven-resources-plugin/src/it/user-filters/src
A         maven-resources-plugin/src/it/user-filters/src/main
A         maven-resources-plugin/src/it/user-filters/src/main/resources
AU        maven-resources-plugin/src/it/user-filters/src/main/resources/unfiltered.properties
A         maven-resources-plugin/src/it/user-filters/src/main/filtered
AU        maven-resources-plugin/src/it/user-filters/src/main/filtered/filtered.properties
AU        maven-resources-plugin/src/it/user-filters/invoker.properties
AU        maven-resources-plugin/src/it/user-filters/verify.groovy
AU        maven-resources-plugin/src/it/user-filters/pom.xml
AU        maven-resources-plugin/src/it/user-filters/test.properties
A         maven-resources-plugin/src/it/includeEmptyDirs
AU        maven-resources-plugin/src/it/includeEmptyDirs/verify.bsh
A         maven-resources-plugin/src/it/includeEmptyDirs/src
A         maven-resources-plugin/src/it/includeEmptyDirs/src/main
A         maven-resources-plugin/src/it/includeEmptyDirs/src/main/filters
AU        maven-resources-plugin/src/it/includeEmptyDirs/src/main/filters/my.filter
A         maven-resources-plugin/src/it/includeEmptyDirs/src/main/resources
AU        maven-resources-plugin/src/it/includeEmptyDirs/src/main/resources/SomeResource.txt
A         maven-resources-plugin/src/it/includeEmptyDirs/src/main/resources/empty-dir
A         maven-resources-plugin/src/it/includeEmptyDirs/src/main/resources/empty-dir-child
A         maven-resources-plugin/src/it/includeEmptyDirs/src/main/resources/empty-dir-child/child
AU        maven-resources-plugin/src/it/includeEmptyDirs/pom.xml
A         maven-resources-plugin/src/it/filter
AU        maven-resources-plugin/src/it/filter/verify.bsh
A         maven-resources-plugin/src/it/filter/src
A         maven-resources-plugin/src/it/filter/src/main
A         maven-resources-plugin/src/it/filter/src/main/filters
AU        maven-resources-plugin/src/it/filter/src/main/filters/filter2.properties
AU        maven-resources-plugin/src/it/filter/src/main/filters/filter3.properties
AU        maven-resources-plugin/src/it/filter/src/main/filters/my.filter
A         maven-resources-plugin/src/it/filter/src/main/resources
AU        maven-resources-plugin/src/it/filter/src/main/resources/SomeResource.txt
AU        maven-resources-plugin/src/it/filter/pom.xml
A         maven-resources-plugin/src/it/MRESOURCES-110
A         maven-resources-plugin/src/it/MRESOURCES-110/src
A         maven-resources-plugin/src/it/MRESOURCES-110/src/main
A         maven-resources-plugin/src/it/MRESOURCES-110/src/main/resources
AU        maven-resources-plugin/src/it/MRESOURCES-110/src/main/resources/mresources-110.xml
AU        maven-resources-plugin/src/it/MRESOURCES-110/verify.groovy
AU        maven-resources-plugin/src/it/MRESOURCES-110/pom.xml
A         maven-resources-plugin/src/it/custom-delimiter
AU        maven-resources-plugin/src/it/custom-delimiter/verify.bsh
A         maven-resources-plugin/src/it/custom-delimiter/src
A         maven-resources-plugin/src/it/custom-delimiter/src/main
A         maven-resources-plugin/src/it/custom-delimiter/src/main/filters
AU        maven-resources-plugin/src/it/custom-delimiter/src/main/filters/filter2.properties
A         maven-resources-plugin/src/it/custom-delimiter/src/main/filters/my.filter
A         maven-resources-plugin/src/it/custom-delimiter/src/main/resources
AU        maven-resources-plugin/src/it/custom-delimiter/src/main/resources/SomeResource.txt
AU        maven-resources-plugin/src/it/custom-delimiter/pom.xml
A         maven-resources-plugin/src/it/MRESOURCES-104
A         maven-resources-plugin/src/it/MRESOURCES-104/src
A         maven-resources-plugin/src/it/MRESOURCES-104/src/main
A         maven-resources-plugin/src/it/MRESOURCES-104/src/main/resources
AU        maven-resources-plugin/src/it/MRESOURCES-104/src/main/resources/test.properties
AU        maven-resources-plugin/src/it/MRESOURCES-104/verify.groovy
AU        maven-resources-plugin/src/it/MRESOURCES-104/pom.xml
A         maven-resources-plugin/src/it/MRESOURCES-105
AU        maven-resources-plugin/src/it/MRESOURCES-105/my.properties
A         maven-resources-plugin/src/it/MRESOURCES-105/src
A         maven-resources-plugin/src/it/MRESOURCES-105/src/main
A         maven-resources-plugin/src/it/MRESOURCES-105/src/main/resources
AU        maven-resources-plugin/src/it/MRESOURCES-105/src/main/resources/test.properties
AU        maven-resources-plugin/src/it/MRESOURCES-105/pom.xml
A         maven-resources-plugin/src/it/MRESOURCES-106
AU        maven-resources-plugin/src/it/MRESOURCES-106/verify.bsh
A         maven-resources-plugin/src/it/MRESOURCES-106/src
A         maven-resources-plugin/src/it/MRESOURCES-106/src/main
A         maven-resources-plugin/src/it/MRESOURCES-106/src/main/resources
AU        maven-resources-plugin/src/it/MRESOURCES-106/src/main/resources/filter.properties
AU        maven-resources-plugin/src/it/MRESOURCES-106/src/main/resources/file.txt
AU        maven-resources-plugin/src/it/MRESOURCES-106/pom.xml
A         maven-resources-plugin/src/it/copy-resources-it
AU        maven-resources-plugin/src/it/copy-resources-it/verify.bsh
A         maven-resources-plugin/src/it/copy-resources-it/src
A         maven-resources-plugin/src/it/copy-resources-it/src/non-packaged-resources
AU        maven-resources-plugin/src/it/copy-resources-it/src/non-packaged-resources/configuration.properties
AU        maven-resources-plugin/src/it/copy-resources-it/pom.xml
AU        maven-resources-plugin/src/it/settings.xml
A         maven-resources-plugin/src/it/MRESOURCES-20
AU        maven-resources-plugin/src/it/MRESOURCES-20/verify.bsh
A         maven-resources-plugin/src/it/MRESOURCES-20/src
A         maven-resources-plugin/src/it/MRESOURCES-20/src/main
A         maven-resources-plugin/src/it/MRESOURCES-20/src/main/resources
AU        maven-resources-plugin/src/it/MRESOURCES-20/src/main/resources/resource.txt
AU        maven-resources-plugin/src/it/MRESOURCES-20/pom.xml
A         maven-resources-plugin/src/it/escapeInterpolation
AU        maven-resources-plugin/src/it/escapeInterpolation/verify.bsh
A         maven-resources-plugin/src/it/escapeInterpolation/src
A         maven-resources-plugin/src/it/escapeInterpolation/src/test
A         maven-resources-plugin/src/it/escapeInterpolation/src/test/filters
AU        maven-resources-plugin/src/it/escapeInterpolation/src/test/filters/my.filter
A         maven-resources-plugin/src/it/escapeInterpolation/src/test/resources
AU        maven-resources-plugin/src/it/escapeInterpolation/src/test/resources/SomeResource.txt
A         maven-resources-plugin/src/it/escapeInterpolation/src/main
A         maven-resources-plugin/src/it/escapeInterpolation/src/main/filters
AU        maven-resources-plugin/src/it/escapeInterpolation/src/main/filters/my.filter
A         maven-resources-plugin/src/it/escapeInterpolation/src/main/resources
AU        maven-resources-plugin/src/it/escapeInterpolation/src/main/resources/SomeResource.txt
AU        maven-resources-plugin/src/it/escapeInterpolation/pom.xml
A         maven-resources-plugin/src/it/filter-test-resources
AU        maven-resources-plugin/src/it/filter-test-resources/verify.bsh
A         maven-resources-plugin/src/it/filter-test-resources/src
A         maven-resources-plugin/src/it/filter-test-resources/src/test
A         maven-resources-plugin/src/it/filter-test-resources/src/test/filters
AU        maven-resources-plugin/src/it/filter-test-resources/src/test/filters/my.filter
A         maven-resources-plugin/src/it/filter-test-resources/src/test/resources
AU        maven-resources-plugin/src/it/filter-test-resources/src/test/resources/SomeResource.txt
AU        maven-resources-plugin/src/it/filter-test-resources/pom.xml
A         maven-resources-plugin/src/it/profile-override
AU        maven-resources-plugin/src/it/profile-override/verify.bsh
AU        maven-resources-plugin/src/it/profile-override/prebuild.bsh
A         maven-resources-plugin/src/it/profile-override/src
A         maven-resources-plugin/src/it/profile-override/src/main
A         maven-resources-plugin/src/it/profile-override/src/main/resources
A         maven-resources-plugin/src/it/profile-override/src/main/resources/test
AU        maven-resources-plugin/src/it/profile-override/src/main/resources/test/config.properties
A         maven-resources-plugin/src/it/profile-override/src/main/resources/production
AU        maven-resources-plugin/src/it/profile-override/src/main/resources/production/config.properties
AU        maven-resources-plugin/src/it/profile-override/invoker.properties
AU        maven-resources-plugin/src/it/profile-override/pom.xml
A         maven-resources-plugin/src/it/binaries-filtering
AU        maven-resources-plugin/src/it/binaries-filtering/verify.bsh
A         maven-resources-plugin/src/it/binaries-filtering/src
A         maven-resources-plugin/src/it/binaries-filtering/src/main
A         maven-resources-plugin/src/it/binaries-filtering/src/main/resources
AU        maven-resources-plugin/src/it/binaries-filtering/src/main/resources/duke-beerjpg.img
AU        maven-resources-plugin/src/it/binaries-filtering/src/main/resources/file.txt
AU        maven-resources-plugin/src/it/binaries-filtering/src/main/resources/happy_duke.gif
AU        maven-resources-plugin/src/it/binaries-filtering/pom.xml
A         maven-resources-plugin/src/it/MRESOURCES-18
A         maven-resources-plugin/src/it/MRESOURCES-18/src
A         maven-resources-plugin/src/it/MRESOURCES-18/src/test
A         maven-resources-plugin/src/it/MRESOURCES-18/src/test/java
A         maven-resources-plugin/src/it/MRESOURCES-18/src/test/java/org
A         maven-resources-plugin/src/it/MRESOURCES-18/src/test/java/org/apache
A         maven-resources-plugin/src/it/MRESOURCES-18/src/test/java/org/apache/maven
A         maven-resources-plugin/src/it/MRESOURCES-18/src/test/java/org/apache/maven/it0105
AU        maven-resources-plugin/src/it/MRESOURCES-18/src/test/java/org/apache/maven/it0105/FilterTest.java
A         maven-resources-plugin/src/it/MRESOURCES-18/src/main
A         maven-resources-plugin/src/it/MRESOURCES-18/src/main/resources
AU        maven-resources-plugin/src/it/MRESOURCES-18/src/main/resources/test.properties
AU        maven-resources-plugin/src/it/MRESOURCES-18/invoker.properties
AU        maven-resources-plugin/src/it/MRESOURCES-18/pom.xml
AU        maven-resources-plugin/src/it/MRESOURCES-18/test.properties
AU        maven-resources-plugin/pom.xml
 U        .
At revision 1158009
[maven-plugins-ITs-m3] $ /home/jenkins/jenkins-slave/tools/Maven_3.0.3/bin/mvn clean install -Prun-its -U -B -V -fae -Papache.snapshots -T3
Apache Maven 3.0.3 (r1075438; 2011-02-28 17:31:09+0000)
Maven home: /home/jenkins/jenkins-slave/tools/Maven_3.0.3
Java version: 1.5.0_22, vendor: Sun Microsystems Inc.
Java home: /home/jenkins/tools/java/jdk1.5.0_22-32/jre
Default locale: en_US, platform encoding: ANSI_X3.4-1968
OS name: "linux", version: "2.6.32-33-server", arch: "i386", family: "unix"
[INFO] Scanning for projects...
Downloading: http://repo1.maven.org/maven2/org/apache/maven/maven-parent/21/maven-parent-21.pom
[ERROR] The build could not read 1 project -> [Help 1]
[ERROR]   
[ERROR]   The project org.apache.maven.plugins:maven-plugins:23-SNAPSHOT (<https://builds.apache.org/job/maven-plugins-ITs-m3/ws/maven-plugins/pom.xml)> has 1 error
[ERROR]     Non-resolvable parent POM: Could not find artifact org.apache.maven:maven-parent:pom:21 in central (http://repo1.maven.org/maven2) and 'parent.relativePath' points at wrong local POM @ line 23, column 11 -> [Help 2]
[ERROR] 
[ERROR] To see the full stack trace of the errors, re-run Maven with the -e switch.
[ERROR] Re-run Maven using the -X switch to enable full debug logging.
[ERROR] 
[ERROR] For more information about the errors and possible solutions, please read the following articles:
[ERROR] [Help 1] http://cwiki.apache.org/confluence/display/MAVEN/ProjectBuildingException
[ERROR] [Help 2] http://cwiki.apache.org/confluence/display/MAVEN/UnresolvableModelException


Jenkins build is back to normal : maven-plugins-ITs-m3 #197

Posted by Apache Jenkins Server <je...@builds.apache.org>.
See <https://builds.apache.org/job/maven-plugins-ITs-m3/197/changes>



Build failed in Jenkins: maven-plugins-ITs-m3 #196

Posted by Apache Jenkins Server <je...@builds.apache.org>.
See <https://builds.apache.org/job/maven-plugins-ITs-m3/196/>

------------------------------------------
[...truncated 598 lines...]
[INFO] Copying 3 resources
[INFO] 
[INFO] --- maven-compiler-plugin:2.3.2:testCompile (default-testCompile) @ maven-eclipse-plugin ---
[INFO] Compiling 27 source files to /x1/jenkins/jenkins-slave/workspace/maven-plugins-ITs-m3/maven-eclipse-plugin/target/test-classes
[INFO] 
[INFO] --- maven-surefire-plugin:2.7.2:test (default-test) @ maven-eclipse-plugin ---
[INFO] 
[INFO] --- maven-resources-plugin:2.4.3:testResources (default-testResources) @ maven-assembly-plugin ---
[INFO] Using 'UTF-8' encoding to copy filtered resources.
[INFO] Surefire report directory: /x1/jenkins/jenkins-slave/workspace/maven-plugins-ITs-m3/maven-eclipse-plugin/target/surefire-reports
[INFO] Copying 1 resource
[INFO] Copying 3 resources
[INFO] 
[INFO] --- maven-compiler-plugin:2.3.2:testCompile (default-testCompile) @ maven-assembly-plugin ---
[INFO] Compiling 34 source files to /x1/jenkins/jenkins-slave/workspace/maven-plugins-ITs-m3/maven-assembly-plugin/target/test-classes

-------------------------------------------------------
 T E S T S
-------------------------------------------------------
Running org.apache.maven.plugin.eclipse.BuildCommandTest
Tests run: 1, Failures: 0, Errors: 0, Skipped: 0, Time elapsed: 0.013 sec
Running org.apache.maven.plugin.eclipse.AddMavenRepoMojoTest
Tests run: 1, Failures: 0, Errors: 0, Skipped: 0, Time elapsed: 0.316 sec
Running org.apache.maven.plugin.eclipse.WorkspaceConfigurationTest
Tests run: 1, Failures: 0, Errors: 0, Skipped: 0, Time elapsed: 0 sec
Running org.apache.maven.plugin.eclipse.writers.EclipseWtpComponent15WriterTest
Tests run: 1, Failures: 0, Errors: 0, Skipped: 0, Time elapsed: 0.139 sec
Running org.apache.maven.plugin.eclipse.writers.EclipseClasspathWriterUnitTest
[debug] Processing classpath for: resource src/main/resources: output=target/classes, include=[], exclude=[], test=false, filtering=false; default output=target/classes
[debug] Processing classpath for: resource src/test/resources: output=target/classes/test-resources, include=[], exclude=[], test=true, filtering=false; default output=target/classes
[debug] Marking as special to prevent output folder nesting: src/test/resources (output=target/classes/test-resources)
[info] Creating maven-eclipse.xml Ant file to handle resources
[info] Creating external launcher file
Tests run: 2, Failures: 0, Errors: 0, Skipped: 0, Time elapsed: 0.07 sec
Running org.apache.maven.plugin.eclipse.writers.EclipseOSGiManifestWriterTest
Tests run: 3, Failures: 0, Errors: 0, Skipped: 0, Time elapsed: 0.001 sec
Running org.apache.maven.plugin.eclipse.writers.workspace.EclipseCodeFormatterTest
Tests run: 1, Failures: 0, Errors: 0, Skipped: 0, Time elapsed: 0.002 sec
Running org.apache.maven.plugin.eclipse.writers.EclipseProjectWriterTest
[info] File /tmp/EclipseProjectWriter.unitTest.1313579023708/.project already exists.
       Additional settings will be preserved, run mvn eclipse:clean if you want old settings to be removed.
Tests run: 1, Failures: 0, Errors: 0, Skipped: 0, Time elapsed: 0.029 sec
Running org.apache.maven.plugin.eclipse.EclipseSourceDirTest
Tests run: 9, Failures: 0, Errors: 0, Skipped: 0, Time elapsed: 0.002 sec
Running org.apache.maven.plugin.eclipse.EclipsePluginUnitTest
[debug] testOutput toRelativeAndFixSeparator /tmp/EclipsePlugin.unitTest.1313579023746 , target/main-output
[debug] testOutput after toRelative : target/main-output
[debug] Processing resource dir: src/main/resources
[debug] Making relative and fixing separator: { /tmp/EclipsePlugin.unitTest.1313579023746, /tmp/EclipsePlugin.unitTest.1313579023746/target/main-output, false }.
[debug] Processing resource dir: src/main/resources
[debug] Making relative and fixing separator: { /tmp/EclipsePlugin.unitTest.1313579023781, /tmp/EclipsePlugin.unitTest.1313579023781/target/classes/main-output, false }.
[debug] Processing resource dir: src/main/resources
[debug] Making relative and fixing separator: { /tmp/EclipsePlugin.unitTest.1313579023803, /tmp/EclipsePlugin.unitTest.1313579023803/target/main-output, false }.
[debug] Processing resource dir: src/main/resources
[debug] Making relative and fixing separator: { /tmp/EclipsePlugin.unitTest.1313579023824, /tmp/EclipsePlugin.unitTest.1313579023824/target/classes, false }.
[debug] Processing resource dir: src/test/resources
[debug] Making relative and fixing separator: { /tmp/EclipsePlugin.unitTest.1313579023824, /tmp/EclipsePlugin.unitTest.1313579023824/target/test-classes, false }.
[debug] Processing resource dir: src/main/resources
[debug] Making relative and fixing separator: { /tmp/EclipsePlugin.unitTest.1313579023867, /tmp/EclipsePlugin.unitTest.1313579023867/target/classes, false }.
[debug] Processing resource dir: src/test/resources
[debug] Making relative and fixing separator: { /tmp/EclipsePlugin.unitTest.1313579023867, /tmp/EclipsePlugin.unitTest.1313579023867/target/test-classes, false }.
Tests run: 5, Failures: 0, Errors: 0, Skipped: 0, Time elapsed: 0.146 sec
Running org.apache.maven.plugin.eclipse.EclipseToMavenTest
Tests run: 5, Failures: 0, Errors: 0, Skipped: 0, Time elapsed: 0.011 sec
Running org.apache.maven.plugin.eclipse.MakeArtifactsTest
Tests run: 5, Failures: 0, Errors: 0, Skipped: 0, Time elapsed: 0.002 sec
Running org.apache.maven.plugin.eclipse.InstallPluginsMojoTest
[debug] Processing Eclipse plugin dependency: jira.meclipse_418:correct_bundle_headers:eclipse-plugin:classifier-unused:1
[debug] Copying: jira.meclipse_418:correct_bundle_headers:eclipse-plugin:classifier-unused:1 to: /tmp/InstallPluginsMojo.test.1313579023922/plugins/jira.meclipse_418_1.0.0.jar
[INFO] ..SUCCESS (9.5 s)
[INFO] Building: test-custom-selector-it/pom.xml
[debug] Processing Eclipse plugin dependency: jira.meclipse_418:no_bundle_name:eclipse-plugin:classifier-unused:1
[debug] Copying: jira.meclipse_418:no_bundle_name:eclipse-plugin:classifier-unused:1 to: /tmp/InstallPluginsMojo.test.1313579023996/plugins/jira.meclipse_418_1.0.0.jar
[debug] Processing Eclipse plugin dependency: jira.meclipse_418:no_bundle_symbolicname:eclipse-plugin:classifier-unused:1
[debug] Copying: jira.meclipse_418:no_bundle_symbolicname:eclipse-plugin:classifier-unused:1 to: /tmp/InstallPluginsMojo.test.1313579024022/plugins/jira.meclipse_418.no_bundle_symbolicname_1.0.0.jar
[debug] Processing Eclipse plugin dependency: jira.meclipse_418:no_manifest_headers:eclipse-plugin:classifier-unused:1
[debug] Ignoring no_manifest_headers as it is not an OSGi bundle (no Bundle-SymbolicName or Bundle-Name in manifest)
[debug] Processing Eclipse plugin dependency: jira:meclipse_488:eclipse-plugin:classifier-unused:1
[debug] Ignoring meclipse_488 as it is does not have a Manifest (and so is not an OSGi bundle)
[debug] Processing Eclipse plugin dependency: org.eclipse.core:runtime:eclipse-plugin:classifier-unused:3.2.0-v20060603
[debug] Copying: org.eclipse.core:runtime:eclipse-plugin:classifier-unused:3.2.0-v20060603 to: /tmp/InstallPluginsMojo.test.1313579024101/plugins/org.eclipse.core.runtime_3.2.0.v20060603.jar
[debug] Processing Eclipse plugin dependency: org.eclipse.core:runtime:eclipse-plugin:classifier-unused:3.2.0-v20060603
[debug] Copying: org.eclipse.core:runtime:eclipse-plugin:classifier-unused:3.2.0-v20060603 to: /tmp/InstallPluginsMojo.test.1313579024128/plugins/org.eclipse.core.runtime_3.2.0.v20060603.jar
[debug] Processing Eclipse plugin dependency: org.eclipse.core:runtime:eclipse-plugin:classifier-unused:3.2.0-v20060603
[debug] Expanding: org.eclipse.core:runtime:eclipse-plugin:classifier-unused:3.2.0-v20060603 into: /tmp/InstallPluginsMojo.test.1313579024156/plugins/org.eclipse.core.runtime_3.2.0.v20060603
[INFO] Expanding: /x1/jenkins/jenkins-slave/workspace/maven-plugins-ITs-m3/maven-eclipse-plugin/target/test-classes/m2repo/eclipseinstall/org/eclipse/core/runtime/3.2.0-v20060603/runtime-3.2.0-v20060603.jar into /tmp/InstallPluginsMojo.test.1313579024156/plugins/org.eclipse.core.runtime_3.2.0.v20060603
[debug] Processing Eclipse plugin dependency: org.eclipse.core:runtime:eclipse-plugin:classifier-unused:3.2.0-v20060603
[debug] Copying: org.eclipse.core:runtime:eclipse-plugin:classifier-unused:3.2.0-v20060603 to: /tmp/InstallPluginsMojo.test.1313579024229/plugins/org.eclipse.core.runtime_3.2.0.v20060603.jar
[debug] Skipping dependency: org.eclipse.core:runtime:eclipse-plugin:classifier-unused:3.2.0-v20060603. Set pluginDependencyTypes with a comma-separated list of types to change this.
[debug] Processing Eclipse plugin dependency: org.eclipse.core:runtime:eclipse-plugin:classifier-unused:3.2.0-v20060603
[warn] Overwriting old plugin with contents of: org.eclipse.core:runtime:eclipse-plugin:classifier-unused:3.2.0-v20060603
[debug] Removing old plugin from both: /tmp/InstallPluginsMojo.test.1313579024275/plugins/org.eclipse.core.runtime_3.2.0.v20060603.jar and: /tmp/InstallPluginsMojo.test.1313579024275/plugins/org.eclipse.core.runtime_3.2.0.v20060603
[debug] Removal of old plugin is complete; proceeding with plugin installation.
[debug] Expanding: org.eclipse.core:runtime:eclipse-plugin:classifier-unused:3.2.0-v20060603 into: /tmp/InstallPluginsMojo.test.1313579024275/plugins/org.eclipse.core.runtime_3.2.0.v20060603
[INFO] Expanding: /x1/jenkins/jenkins-slave/workspace/maven-plugins-ITs-m3/maven-eclipse-plugin/target/test-classes/m2repo/eclipseinstall/org/eclipse/core/runtime/3.2.0-v20060603/runtime-3.2.0-v20060603.jar into /tmp/InstallPluginsMojo.test.1313579024275/plugins/org.eclipse.core.runtime_3.2.0.v20060603
[debug] Processing Eclipse plugin dependency: org.eclipse.core:runtime:eclipse-plugin:classifier-unused:3.2.0-v20060603
[warn] Overwriting old plugin with contents of: org.eclipse.core:runtime:eclipse-plugin:classifier-unused:3.2.0-v20060603
[debug] Removing old plugin from both: /tmp/InstallPluginsMojo.test.1313579024329/plugins/org.eclipse.core.runtime_3.2.0.v20060603.jar and: /tmp/InstallPluginsMojo.test.1313579024329/plugins/org.eclipse.core.runtime_3.2.0.v20060603
[debug] Removal of old plugin is complete; proceeding with plugin installation.
[debug] Copying: org.eclipse.core:runtime:eclipse-plugin:classifier-unused:3.2.0-v20060603 to: /tmp/InstallPluginsMojo.test.1313579024329/plugins/org.eclipse.core.runtime_3.2.0.v20060603.jar
Tests run: 12, Failures: 0, Errors: 0, Skipped: 0, Time elapsed: 0.454 sec
Running org.apache.maven.plugin.eclipse.reader.ReadWorkspaceLocationsTest
Tests run: 5, Failures: 0, Errors: 0, Skipped: 0, Time elapsed: 0.083 sec
Running org.apache.maven.plugin.ide.IdeUtilsTest
Tests run: 5, Failures: 0, Errors: 0, Skipped: 0, Time elapsed: 0.002 sec

Results :

Tests run: 57, Failures: 0, Errors: 0, Skipped: 0

[INFO] 
[INFO] --- maven-jar-plugin:2.3.1:jar (default-jar) @ maven-eclipse-plugin ---
[INFO] 
[INFO] --- maven-surefire-plugin:2.7.2:test (default-test) @ maven-assembly-plugin ---
[INFO] Building jar: /x1/jenkins/jenkins-slave/workspace/maven-plugins-ITs-m3/maven-eclipse-plugin/target/maven-eclipse-plugin-2.9-SNAPSHOT.jar
[INFO] Surefire report directory: /x1/jenkins/jenkins-slave/workspace/maven-plugins-ITs-m3/maven-assembly-plugin/target/surefire-reports
[INFO] 
[INFO] --- maven-plugin-plugin:2.4.3:addPluginArtifactMetadata (default-addPluginArtifactMetadata) @ maven-eclipse-plugin ---
[INFO] 
[INFO] --- maven-invoker-plugin:1.5:install (integration-test) @ maven-eclipse-plugin ---
[INFO] Installing /x1/jenkins/jenkins-slave/workspace/maven-plugins-ITs-m3/maven-eclipse-plugin/pom.xml to /x1/jenkins/jenkins-slave/workspace/maven-plugins-ITs-m3/maven-eclipse-plugin/target/local-repo/org/apache/maven/plugins/maven-eclipse-plugin/2.9-SNAPSHOT/maven-eclipse-plugin-2.9-SNAPSHOT.pom
[INFO] Installing /x1/jenkins/jenkins-slave/workspace/maven-plugins-ITs-m3/maven-eclipse-plugin/target/maven-eclipse-plugin-2.9-SNAPSHOT.jar to /x1/jenkins/jenkins-slave/workspace/maven-plugins-ITs-m3/maven-eclipse-plugin/target/local-repo/org/apache/maven/plugins/maven-eclipse-plugin/2.9-SNAPSHOT/maven-eclipse-plugin-2.9-SNAPSHOT.jar
[INFO] 
[INFO] --- maven-invoker-plugin:1.5:run (integration-test) @ maven-eclipse-plugin ---

-------------------------------------------------------
 T E S T S
-------------------------------------------------------
Running org.apache.maven.plugin.assembly.interpolation.AssemblyInterpolatorTest
[INFO] Building: MECLIPSE-676/pom.xml
Tests run: 7, Failures: 0, Errors: 0, Skipped: 0, Time elapsed: 0.211 sec
Running org.apache.maven.plugin.assembly.interpolation.AssemblyExpressionEvaluatorTest
Tests run: 5, Failures: 0, Errors: 0, Skipped: 0, Time elapsed: 0.023 sec
Running org.apache.maven.plugin.assembly.filter.ComponentsXmlArchiverFileFilterTest
Tests run: 7, Failures: 0, Errors: 0, Skipped: 0, Time elapsed: 0.182 sec
Running org.apache.maven.plugin.assembly.io.PrefixedClasspathLocatorStrategyTest
Tests run: 4, Failures: 0, Errors: 0, Skipped: 0, Time elapsed: 0.007 sec
Running org.apache.maven.plugin.assembly.io.DefaultAssemblyReaderTest
Tests run: 24, Failures: 0, Errors: 0, Skipped: 0, Time elapsed: 0.398 sec
Running org.apache.maven.plugin.assembly.utils.AssemblyFileUtilsTest
Tests run: 9, Failures: 0, Errors: 0, Skipped: 0, Time elapsed: 0.031 sec
Running org.apache.maven.plugin.assembly.utils.AssemblyFormatUtilsTest
Tests run: 66, Failures: 0, Errors: 0, Skipped: 0, Time elapsed: 0.842 sec
Running org.apache.maven.plugin.assembly.utils.ProjectUtilsTest
Tests run: 5, Failures: 0, Errors: 0, Skipped: 0, Time elapsed: 0.003 sec
Running org.apache.maven.plugin.assembly.utils.TypeConversionUtilsTest
Tests run: 6, Failures: 0, Errors: 0, Skipped: 0, Time elapsed: 0.003 sec
Running org.apache.maven.plugin.assembly.utils.FilterUtilsTest
Tests run: 12, Failures: 0, Errors: 0, Skipped: 0, Time elapsed: 0.011 sec
Running org.apache.maven.plugin.assembly.format.FileSetFormatterTest
[INFO] ..SUCCESS (3.2 s)
[INFO] Building: relative-path-it/pom.xml
[INFO] ..SUCCESS (2.1 s)
[INFO] Building: MECLIPSE-692/pom.xml
Tests run: 8, Failures: 0, Errors: 0, Skipped: 0, Time elapsed: 1.22 sec
Running org.apache.maven.plugin.assembly.format.FileFormatterTest
Tests run: 14, Failures: 0, Errors: 0, Skipped: 0, Time elapsed: 0.789 sec
Running org.apache.maven.plugin.assembly.artifact.DefaultDependencyResolverTest
Tests run: 4, Failures: 0, Errors: 0, Skipped: 0, Time elapsed: 0.212 sec
Running org.apache.maven.plugin.assembly.archive.phase.FileSetAssemblyPhaseTest
Tests run: 2, Failures: 0, Errors: 0, Skipped: 0, Time elapsed: 0.074 sec
Running org.apache.maven.plugin.assembly.archive.phase.FileItemAssemblyPhaseTest
[INFO] ..SUCCESS (2.0 s)
[INFO] Building: skip-test-compilation-it/pom.xml
Tests run: 6, Failures: 0, Errors: 0, Skipped: 0, Time elapsed: 0.235 sec
Running org.apache.maven.plugin.assembly.archive.phase.RepositoryAssemblyPhaseTest
Tests run: 2, Failures: 0, Errors: 0, Skipped: 0, Time elapsed: 0.063 sec
Running org.apache.maven.plugin.assembly.archive.phase.ModuleSetAssemblyPhaseTest
Tests run: 26, Failures: 0, Errors: 0, Skipped: 0, Time elapsed: 0.488 sec
Running org.apache.maven.plugin.assembly.archive.phase.DependencySetAssemblyPhaseTest
Tests run: 2, Failures: 0, Errors: 0, Skipped: 0, Time elapsed: 0.003 sec
Running org.apache.maven.plugin.assembly.archive.DefaultAssemblyArchiverTest
Tests run: 11, Failures: 0, Errors: 0, Skipped: 0, Time elapsed: 0.411 sec
Running org.apache.maven.plugin.assembly.archive.task.AddDependencySetsTaskTest
Tests run: 8, Failures: 0, Errors: 0, Skipped: 0, Time elapsed: 0.007 sec
Running org.apache.maven.plugin.assembly.archive.task.AddDirectoryTaskTest
Tests run: 4, Failures: 0, Errors: 0, Skipped: 0, Time elapsed: 0.062 sec
Running org.apache.maven.plugin.assembly.archive.task.AddArtifactTaskTest
Tests run: 5, Failures: 0, Errors: 0, Skipped: 0, Time elapsed: 0.005 sec
Running org.apache.maven.plugin.assembly.archive.task.AddFileSetsTaskTest
Tests run: 9, Failures: 0, Errors: 0, Skipped: 0, Time elapsed: 0.309 sec
Running org.apache.maven.plugin.assembly.archive.archiver.AssemblyProxyArchiverTest
Tests run: 4, Failures: 0, Errors: 0, Skipped: 0, Time elapsed: 0.104 sec
Running org.apache.maven.plugin.assembly.archive.ManifestCreationFinalizerTest
Tests run: 4, Failures: 0, Errors: 0, Skipped: 0, Time elapsed: 0.027 sec

Results :

Tests run: 254, Failures: 0, Errors: 0, Skipped: 0

Downloading: http://repository.apache.org/snapshots/org/apache/maven/shared/maven-model-converter/2.3-SNAPSHOT/maven-metadata.xml
Downloaded: http://repository.apache.org/snapshots/org/apache/maven/shared/maven-model-converter/2.3-SNAPSHOT/maven-metadata.xml (791 B at 28.6 KB/sec)
Downloading: http://repository.apache.org/snapshots/org/apache/maven/shared/maven-model-converter/2.3-SNAPSHOT/maven-metadata.xml
Downloaded: http://repository.apache.org/snapshots/org/apache/maven/shared/maven-model-converter/2.3-SNAPSHOT/maven-metadata.xml (791 B at 32.2 KB/sec)
Downloading: file:///home/jenkins/.m2/repository/org/codehaus/plexus/plexus-utils/1.4.1/plexus-utils-1.4.1.pom
Downloaded: file:///home/jenkins/.m2/repository/org/codehaus/plexus/plexus-utils/1.4.1/plexus-utils-1.4.1.pom (2 KB at 621.4 KB/sec)
Downloading: file:///home/jenkins/.m2/repository/org/codehaus/plexus/plexus-utils/1.4.1/plexus-utils-1.4.1.jar
Downloaded: file:///home/jenkins/.m2/repository/org/codehaus/plexus/plexus-utils/1.4.1/plexus-utils-1.4.1.jar (185 KB at 4386.3 KB/sec)
Downloading: file:///home/jenkins/.m2/repository/junit/junit/4.5/junit-4.5.pom
Downloaded: file:///home/jenkins/.m2/repository/junit/junit/4.5/junit-4.5.pom (2 KB at 596.2 KB/sec)
Downloading: file:///home/jenkins/.m2/repository/org/codehaus/plexus/plexus-utils/1.0.4/plexus-utils-1.0.4.pom
Downloaded: file:///home/jenkins/.m2/repository/org/codehaus/plexus/plexus-utils/1.0.4/plexus-utils-1.0.4.pom (7 KB at 6695.3 KB/sec)
Downloading: file:///home/jenkins/.m2/repository/org/apache/maven/maven-artifact-manager/2.0.6/maven-artifact-manager-2.0.6.pom
Downloaded: file:///home/jenkins/.m2/repository/org/apache/maven/maven-artifact-manager/2.0.6/maven-artifact-manager-2.0.6.pom (3 KB at 2560.5 KB/sec)
Downloading: file:///home/jenkins/.m2/repository/org/apache/maven/maven-repository-metadata/2.0.6/maven-repository-metadata-2.0.6.pom
Downloaded: file:///home/jenkins/.m2/repository/org/apache/maven/maven-repository-metadata/2.0.6/maven-repository-metadata-2.0.6.pom (2 KB at 1806.6 KB/sec)
Downloading: file:///home/jenkins/.m2/repository/org/apache/maven/wagon/wagon-provider-api/1.0-beta-2/wagon-provider-api-1.0-beta-2.pom
Downloaded: file:///home/jenkins/.m2/repository/org/apache/maven/wagon/wagon-provider-api/1.0-beta-2/wagon-provider-api-1.0-beta-2.pom (680 B at 664.1 KB/sec)
Downloading: file:///home/jenkins/.m2/repository/org/apache/maven/wagon/wagon/1.0-beta-2/wagon-1.0-beta-2.pom
Downloaded: file:///home/jenkins/.m2/repository/org/apache/maven/wagon/wagon/1.0-beta-2/wagon-1.0-beta-2.pom (6 KB at 2872.1 KB/sec)
Downloading: file:///home/jenkins/.m2/repository/org/apache/maven/maven-parent/4/maven-parent-4.pom
Downloaded: file:///home/jenkins/.m2/repository/org/apache/maven/maven-parent/4/maven-parent-4.pom (10 KB at 9761.7 KB/sec)
Downloading: file:///home/jenkins/.m2/repository/junit/junit/4.5/junit-4.5.jar
Downloading: file:///home/jenkins/.m2/repository/org/apache/maven/maven-artifact-manager/2.0.6/maven-artifact-manager-2.0.6.jar
Downloading: file:///home/jenkins/.m2/repository/org/apache/maven/maven-repository-metadata/2.0.6/maven-repository-metadata-2.0.6.jar
Downloading: file:///home/jenkins/.m2/repository/org/apache/maven/wagon/wagon-provider-api/1.0-beta-2/wagon-provider-api-1.0-beta-2.jar
Downloaded: file:///home/jenkins/.m2/repository/org/apache/maven/maven-repository-metadata/2.0.6/maven-repository-metadata-2.0.6.jar (24 KB at 11950.7 KB/sec)
Downloaded: file:///home/jenkins/.m2/repository/org/apache/maven/maven-artifact-manager/2.0.6/maven-artifact-manager-2.0.6.jar (56 KB at 1283.3 KB/sec)
Downloaded: file:///home/jenkins/.m2/repository/org/apache/maven/wagon/wagon-provider-api/1.0-beta-2/wagon-provider-api-1.0-beta-2.jar (46 KB at 11310.1 KB/sec)
Downloaded: file:///home/jenkins/.m2/repository/junit/junit/4.5/junit-4.5.jar (195 KB at 3964.9 KB/sec)
Downloading: file:///home/jenkins/.m2/repository/org/codehaus/plexus/plexus-container-default/1.0-alpha-15/plexus-container-default-1.0-alpha-15.pom
Downloaded: file:///home/jenkins/.m2/repository/org/codehaus/plexus/plexus-container-default/1.0-alpha-15/plexus-container-default-1.0-alpha-15.pom (2 KB at 1668.0 KB/sec)
Downloading: file:///home/jenkins/.m2/repository/org/codehaus/plexus/plexus-containers/1.0-alpha-15/plexus-containers-1.0-alpha-15.pom
Downloaded: file:///home/jenkins/.m2/repository/org/codehaus/plexus/plexus-containers/1.0-alpha-15/plexus-containers-1.0-alpha-15.pom (2 KB at 1846.7 KB/sec)
Downloading: file:///home/jenkins/.m2/repository/org/codehaus/plexus/plexus/1.0.9/plexus-1.0.9.pom
Downloaded: file:///home/jenkins/.m2/repository/org/codehaus/plexus/plexus/1.0.9/plexus-1.0.9.pom (8 KB at 7500.0 KB/sec)
Downloading: file:///home/jenkins/.m2/repository/org/codehaus/plexus/plexus-utils/1.3/plexus-utils-1.3.pom
Downloaded: file:///home/jenkins/.m2/repository/org/codehaus/plexus/plexus-utils/1.3/plexus-utils-1.3.pom (2 KB at 1009.8 KB/sec)
Downloading: file:///home/jenkins/.m2/repository/org/codehaus/plexus/plexus/1.0.8/plexus-1.0.8.pom
Downloaded: file:///home/jenkins/.m2/repository/org/codehaus/plexus/plexus/1.0.8/plexus-1.0.8.pom (8 KB at 7060.5 KB/sec)
Downloading: file:///home/jenkins/.m2/repository/org/codehaus/plexus/plexus-classworlds/1.2-alpha-6/plexus-classworlds-1.2-alpha-6.pom
Downloaded: file:///home/jenkins/.m2/repository/org/codehaus/plexus/plexus-classworlds/1.2-alpha-6/plexus-classworlds-1.2-alpha-6.pom (3 KB at 1158.2 KB/sec)
Downloading: file:///home/jenkins/.m2/repository/org/codehaus/plexus/plexus-utils/1.2/plexus-utils-1.2.pom
Downloaded: file:///home/jenkins/.m2/repository/org/codehaus/plexus/plexus-utils/1.2/plexus-utils-1.2.pom (767 B at 749.0 KB/sec)
Downloading: file:///home/jenkins/.m2/repository/org/codehaus/plexus/plexus/1.0.5/plexus-1.0.5.pom
Downloaded: file:///home/jenkins/.m2/repository/org/codehaus/plexus/plexus/1.0.5/plexus-1.0.5.pom (6 KB at 5802.7 KB/sec)
Downloading: file:///home/jenkins/.m2/repository/org/codehaus/plexus/plexus-container-default/1.0-alpha-15/plexus-container-default-1.0-alpha-15.jar
Downloading: file:///home/jenkins/.m2/repository/org/codehaus/plexus/plexus-classworlds/1.2-alpha-6/plexus-classworlds-1.2-alpha-6.jar
Downloading: http://repo1.maven.org/maven2/org/codehaus/plexus/plexus-container-default/1.0-alpha-15/plexus-container-default-1.0-alpha-15.jar
Downloading: http://repo1.maven.org/maven2/org/codehaus/plexus/plexus-classworlds/1.2-alpha-6/plexus-classworlds-1.2-alpha-6.jar
Downloaded: http://repo1.maven.org/maven2/org/codehaus/plexus/plexus-classworlds/1.2-alpha-6/plexus-classworlds-1.2-alpha-6.jar (42 KB at 26.2 KB/sec)
Downloaded: http://repo1.maven.org/maven2/org/codehaus/plexus/plexus-container-default/1.0-alpha-15/plexus-container-default-1.0-alpha-15.jar (196 KB at 93.7 KB/sec)
Downloading: file:///home/jenkins/.m2/repository/org/codehaus/plexus/plexus-utils/1.0.4/plexus-utils-1.0.4.jar
Downloaded: file:///home/jenkins/.m2/repository/org/codehaus/plexus/plexus-utils/1.0.4/plexus-utils-1.0.4.jar (160 KB at 26660.6 KB/sec)
Downloading: file:///home/jenkins/.m2/repository/org/codehaus/plexus/plexus-utils/1.4/plexus-utils-1.4.pom
Downloaded: file:///home/jenkins/.m2/repository/org/codehaus/plexus/plexus-utils/1.4/plexus-utils-1.4.pom (2 KB at 1124.0 KB/sec)
Downloading: file:///home/jenkins/.m2/repository/org/codehaus/plexus/plexus-utils/1.4/plexus-utils-1.4.jar
Downloaded: file:///home/jenkins/.m2/repository/org/codehaus/plexus/plexus-utils/1.4/plexus-utils-1.4.jar (178 KB at 25413.9 KB/sec)
Build step 'Invoke top-level Maven targets' marked build as failure


Build failed in Jenkins: maven-plugins-ITs-m3 #195

Posted by Apache Jenkins Server <je...@builds.apache.org>.
See <https://builds.apache.org/job/maven-plugins-ITs-m3/195/>

------------------------------------------
Started by an SCM change
Building remotely on ubuntu4
Updating http://svn.apache.org/repos/asf/maven/plugins/trunk
U         maven-jar-plugin/src/site/apt/usage.apt.vm
At revision 1158608
hudson.util.IOException2: revision check failed on http://svn.apache.org/repos/asf/maven/plugins/trunk
	at hudson.scm.SubversionChangeLogBuilder.buildModule(SubversionChangeLogBuilder.java:158)
	at hudson.scm.SubversionChangeLogBuilder.run(SubversionChangeLogBuilder.java:100)
	at hudson.scm.SubversionSCM.calcChangeLog(SubversionSCM.java:536)
	at hudson.scm.SubversionSCM.checkout(SubversionSCM.java:653)
	at hudson.model.AbstractProject.checkout(AbstractProject.java:1193)
	at hudson.model.AbstractBuild$AbstractRunner.checkout(AbstractBuild.java:555)
	at hudson.model.AbstractBuild$AbstractRunner.run(AbstractBuild.java:443)
	at hudson.model.Run.run(Run.java:1376)
	at hudson.model.FreeStyleBuild.run(FreeStyleBuild.java:46)
	at hudson.model.ResourceController.execute(ResourceController.java:88)
	at hudson.model.Executor.run(Executor.java:230)
Caused by: org.tmatesoft.svn.core.SVNException: svn: OPTIONS /repos/asf/maven/plugins/trunk failed
	at org.tmatesoft.svn.core.internal.io.dav.http.HTTPConnection.request(HTTPConnection.java:291)
	at org.tmatesoft.svn.core.internal.io.dav.http.HTTPConnection.request(HTTPConnection.java:276)
	at org.tmatesoft.svn.core.internal.io.dav.http.HTTPConnection.request(HTTPConnection.java:264)
	at org.tmatesoft.svn.core.internal.io.dav.DAVConnection.exchangeCapabilities(DAVConnection.java:516)
	at org.tmatesoft.svn.core.internal.io.dav.DAVConnection.open(DAVConnection.java:98)
	at org.tmatesoft.svn.core.internal.io.dav.DAVRepository.openConnection(DAVRepository.java:1001)
	at org.tmatesoft.svn.core.internal.io.dav.DAVRepository.getLatestRevision(DAVRepository.java:178)
	at org.tmatesoft.svn.core.wc.SVNBasicClient.getRevisionNumber(SVNBasicClient.java:482)
	at org.tmatesoft.svn.core.wc.SVNBasicClient.getLocations(SVNBasicClient.java:873)
	at org.tmatesoft.svn.core.wc.SVNBasicClient.createRepository(SVNBasicClient.java:534)
	at org.tmatesoft.svn.core.wc.SVNLogClient.doLog(SVNLogClient.java:1019)
	at org.tmatesoft.svn.core.wc.SVNLogClient.doLog(SVNLogClient.java:894)
	at org.tmatesoft.svn.core.wc.SVNLogClient.doLog(SVNLogClient.java:826)
	at hudson.scm.SubversionChangeLogBuilder.buildModule(SubversionChangeLogBuilder.java:146)
	... 10 more
Caused by: org.tmatesoft.svn.core.SVNErrorMessage: svn: OPTIONS /repos/asf/maven/plugins/trunk failed
	at org.tmatesoft.svn.core.SVNErrorMessage.create(SVNErrorMessage.java:200)
	at org.tmatesoft.svn.core.SVNErrorMessage.create(SVNErrorMessage.java:146)
	at org.tmatesoft.svn.core.SVNErrorMessage.create(SVNErrorMessage.java:89)
	... 24 more
Caused by: org.tmatesoft.svn.core.SVNException: svn: OPTIONS request failed on '/repos/asf/maven/plugins/trunk'
svn: Connection reset
	at org.tmatesoft.svn.core.internal.wc.SVNErrorManager.error(SVNErrorManager.java:64)
	at org.tmatesoft.svn.core.internal.wc.SVNErrorManager.error(SVNErrorManager.java:51)
	at org.tmatesoft.svn.core.internal.io.dav.http.HTTPConnection._request(HTTPConnection.java:644)
	at org.tmatesoft.svn.core.internal.io.dav.http.HTTPConnection.request(HTTPConnection.java:285)
	... 23 more
Caused by: org.tmatesoft.svn.core.SVNErrorMessage: svn: OPTIONS request failed on '/repos/asf/maven/plugins/trunk'
	at org.tmatesoft.svn.core.SVNErrorMessage.create(SVNErrorMessage.java:200)
	at org.tmatesoft.svn.core.internal.io.dav.http.HTTPConnection._request(HTTPConnection.java:642)
	... 24 more
Caused by: org.tmatesoft.svn.core.SVNErrorMessage: svn: Connection reset
	at org.tmatesoft.svn.core.SVNErrorMessage.create(SVNErrorMessage.java:101)
	at org.tmatesoft.svn.core.internal.io.dav.http.HTTPConnection._request(HTTPConnection.java:408)
	... 24 more
Caused by: java.net.SocketException: Connection reset
	at java.net.SocketOutputStream.socketWrite(SocketOutputStream.java:96)
	at java.net.SocketOutputStream.write(SocketOutputStream.java:136)
	at java.io.BufferedOutputStream.flushBuffer(BufferedOutputStream.java:65)
	at java.io.BufferedOutputStream.flush(BufferedOutputStream.java:123)
	at org.tmatesoft.svn.core.internal.io.dav.http.HTTPConnection.sendData(HTTPConnection.java:229)
	at org.tmatesoft.svn.core.internal.io.dav.http.HTTPRequest.dispatch(HTTPRequest.java:166)
	at org.tmatesoft.svn.core.internal.io.dav.http.HTTPConnection._request(HTTPConnection.java:364)
	... 24 more


Build failed in Jenkins: maven-plugins-ITs-m3 #194

Posted by Apache Jenkins Server <je...@builds.apache.org>.
See <https://builds.apache.org/job/maven-plugins-ITs-m3/194/>

------------------------------------------
[...truncated 3847 lines...]
[INFO] 
[INFO] --- maven-plugin-plugin:2.7:helpmojo (generated-helpmojo) @ maven-jar-plugin ---
[INFO] Using 'UTF-8' encoding to read mojo metadata.
[INFO] Applying mojo extractor for language: java
[INFO] Mojo extractor for language: java found 4 mojo descriptors.
[INFO] Applying mojo extractor for language: bsh
[INFO] Mojo extractor for language: bsh found 0 mojo descriptors.
[INFO] 
[INFO] --- maven-plugin-plugin:2.7:descriptor (default-descriptor) @ maven-jar-plugin ---
[INFO] Using 'UTF-8' encoding to read mojo metadata.
[INFO] Applying mojo extractor for language: java
[INFO] Mojo extractor for language: java found 5 mojo descriptors.
[INFO] Applying mojo extractor for language: bsh
[INFO] Mojo extractor for language: bsh found 0 mojo descriptors.
[INFO] 
[INFO] --- maven-remote-resources-plugin:1.1:process (default) @ maven-jar-plugin ---
[INFO] 
[INFO] --- maven-resources-plugin:2.4.3:testResources (default-testResources) @ maven-install-plugin ---
[INFO] Using 'UTF-8' encoding to copy filtered resources.
[INFO] 
[INFO] --- maven-resources-plugin:2.4.3:resources (default-resources) @ maven-jar-plugin ---
[INFO] Using 'UTF-8' encoding to copy filtered resources.
[INFO] skip non existing resourceDirectory <https://builds.apache.org/job/maven-plugins-ITs-m3/ws/maven-jar-plugin/src/main/resources>
[INFO] Copying 3 resources
[INFO] 
[INFO] --- maven-compiler-plugin:2.3.2:compile (default-compile) @ maven-jar-plugin ---
[INFO] Compiling 6 source files to <https://builds.apache.org/job/maven-plugins-ITs-m3/ws/maven-jar-plugin/target/classes>
[INFO] ..SUCCESS (2.1 s)
[INFO] Building: effective-settings/pom.xml
[INFO] 
[INFO] --- maven-resources-plugin:2.4.3:testResources (default-testResources) @ maven-jar-plugin ---
[INFO] Using 'UTF-8' encoding to copy filtered resources.
[INFO] Copying 4 resources
[INFO] Copying 3 resources
[INFO] 
[INFO] --- maven-compiler-plugin:2.3.2:testCompile (default-testCompile) @ maven-jar-plugin ---
[INFO] Copying 22 resources
[INFO] Compiling 4 source files to <https://builds.apache.org/job/maven-plugins-ITs-m3/ws/maven-jar-plugin/target/test-classes>
[INFO] Copying 3 resources
[INFO] 
[INFO] --- maven-compiler-plugin:2.3.2:testCompile (default-testCompile) @ maven-install-plugin ---
[INFO] Compiling 6 source files to <https://builds.apache.org/job/maven-plugins-ITs-m3/ws/maven-install-plugin/target/test-classes>
[INFO] 
[INFO] --- maven-surefire-plugin:2.7.2:test (default-test) @ maven-jar-plugin ---
[INFO] Surefire report directory: <https://builds.apache.org/job/maven-plugins-ITs-m3/ws/maven-jar-plugin/target/surefire-reports>

-------------------------------------------------------
 T E S T S
-------------------------------------------------------
Running org.apache.maven.plugin.jar.JarSignVerifyMojoTest
[debug] jarsigner executable=[/home/hudson/tools/java/jdk1.5.0_22-32/jre/../bin/jarsigner]
[debug] Executing: /bin/sh -c cd /tmp && /home/hudson/tools/java/jdk1.5.0_22-32/jre/../bin/jarsigner -verify /tmp/signed/file-version.jar
[info] jar verified.
[debug] jarsigner executable=[/home/hudson/tools/java/jdk1.5.0_22-32/jre/../bin/jarsigner]
[debug] Executing: /bin/sh -c cd /tmp && /home/hudson/tools/java/jdk1.5.0_22-32/jre/../bin/jarsigner -verify -verbose -certs /tmp/signed/file-version.jar
[info] jar verified.
[debug] jarsigner executable=[/home/hudson/tools/java/jdk1.5.0_22-32/jre/../bin/jarsigner]
[debug] Executing: /bin/sh -c cd /tmp && /home/hudson/tools/java/jdk1.5.0_22-32/jre/../bin/jarsigner -verify /tmp/signed/file-version.jar
[debug] jarsigner executable=[/home/hudson/tools/java/jdk1.5.0_22-32/jre/../bin/jarsigner]
[debug] Executing: /bin/sh -c cd /tmp && /home/hudson/tools/java/jdk1.5.0_22-32/jre/../bin/jarsigner -verify /tmp/signed/file-version.jar
[info] jar is unsigned.
[debug] jarsigner executable=[/home/hudson/tools/java/jdk1.5.0_22-32/jre/../bin/jarsigner]
[debug] Executing: /bin/sh -c cd /tmp && /home/hudson/tools/java/jdk1.5.0_22-32/jre/../bin/jarsigner -verify /tmp/signed/file-version.jar
Tests run: 6, Failures: 0, Errors: 0, Skipped: 0, Time elapsed: 0.033 sec
Running org.apache.maven.plugin.jar.JarSignMojoTest
[debug] jarsigner executable=[/home/hudson/tools/java/jdk1.5.0_22-32/jre/../bin/jarsigner]
[debug] mdkirs: false /tmp
[debug] jarsigner executable=[/home/hudson/tools/java/jdk1.5.0_22-32/jre/../bin/jarsigner]
[debug] mdkirs: false /tmp
[debug] jarsigner executable=[/home/hudson/tools/java/jdk1.5.0_22-32/jre/../bin/jarsigner]
[debug] mdkirs: false /tmp
[debug] jarsigner executable=[/home/hudson/tools/java/jdk1.5.0_22-32/jre/../bin/jarsigner]
[debug] Executing: /bin/sh -c cd /tmp && /home/hudson/tools/java/jdk1.5.0_22-32/jre/../bin/jarsigner -verify /tmp/signed.jar
[info] jar verified.
[debug] jarsigner executable=[/home/hudson/tools/java/jdk1.5.0_22-32/jre/../bin/jarsigner]
[debug] Signing JAR in-place (overwritting original JAR).
[debug] jarsigner executable=[/home/hudson/tools/java/jdk1.5.0_22-32/jre/../bin/jarsigner]
[debug] Executing: /bin/sh -c cd /tmp && /home/hudson/tools/java/jdk1.5.0_22-32/jre/../bin/jarsigner -verify /tmp/null.jar
[info] jar verified.
[debug] jarsigner executable=[/home/hudson/tools/java/jdk1.5.0_22-32/jre/../bin/jarsigner]
[debug] mdkirs: false /tmp
[info] JAR /tmp/signed.jar is already signed. Skipping.
[debug] jarsigner executable=[/home/hudson/tools/java/jdk1.5.0_22-32/jre/../bin/jarsigner]
[debug] mdkirs: false /tmp
Tests run: 6, Failures: 0, Errors: 0, Skipped: 0, Time elapsed: 0.03 sec
Running org.apache.maven.plugin.jar.JarMojoTest
[INFO] 
[INFO] --- maven-surefire-plugin:2.7.2:test (default-test) @ maven-install-plugin ---
[INFO] Surefire report directory: <https://builds.apache.org/job/maven-plugins-ITs-m3/ws/maven-install-plugin/target/surefire-reports>

-------------------------------------------------------
 T E S T S
-------------------------------------------------------
Running org.apache.maven.plugin.install.InstallFileMojoTest
Tests run: 1, Failures: 0, Errors: 0, Skipped: 0, Time elapsed: 0.331 sec

Results :

Tests run: 13, Failures: 0, Errors: 0, Skipped: 0

[INFO] 
[INFO] --- maven-jar-plugin:2.3.1:jar (default-jar) @ maven-jar-plugin ---
[INFO] Building jar: <https://builds.apache.org/job/maven-plugins-ITs-m3/ws/maven-jar-plugin/target/maven-jar-plugin-2.4-SNAPSHOT.jar>
[INFO] 
[INFO] --- maven-plugin-plugin:2.7:addPluginArtifactMetadata (default-addPluginArtifactMetadata) @ maven-jar-plugin ---
[INFO] 
[INFO] --- maven-invoker-plugin:1.5:install (integration-test) @ maven-jar-plugin ---
[INFO] Installing <https://builds.apache.org/job/maven-plugins-ITs-m3/ws/maven-jar-plugin/pom.xml> to <https://builds.apache.org/job/maven-plugins-ITs-m3/ws/maven-jar-plugin/target/local-repo/org/apache/maven/plugins/maven-jar-plugin/2.4-SNAPSHOT/maven-jar-plugin-2.4-SNAPSHOT.pom>
[INFO] Installing <https://builds.apache.org/job/maven-plugins-ITs-m3/ws/maven-install-plugin/src/test/resources/unit/install-file-basic-test/target/maven-install-test-1.0-SNAPSHOT.jar> to <https://builds.apache.org/job/maven-plugins-ITs-m3/ws/maven-install-plugin/target/local-repo/org/apache/maven/test/maven-install-file-test/1.0-SNAPSHOT/maven-install-file-test-1.0-SNAPSHOT.jar>
[INFO] Installing <https://builds.apache.org/job/maven-plugins-ITs-m3/ws/maven-jar-plugin/target/maven-jar-plugin-2.4-SNAPSHOT.jar> to <https://builds.apache.org/job/maven-plugins-ITs-m3/ws/maven-jar-plugin/target/local-repo/org/apache/maven/plugins/maven-jar-plugin/2.4-SNAPSHOT/maven-jar-plugin-2.4-SNAPSHOT.jar>
[INFO] 
[INFO] --- maven-invoker-plugin:1.5:run (integration-test) @ maven-jar-plugin ---
[INFO] Installing <https://builds.apache.org/job/maven-plugins-ITs-m3/ws/maven-install-plugin/src/test/resources/unit/install-file-basic-test/target/maven-install-test-1.0-SNAPSHOT.jar> to <https://builds.apache.org/job/maven-plugins-ITs-m3/ws/maven-install-plugin/target/local-repo/org.apache.maven.test/jars/maven-install-file-test-1.0-SNAPSHOT.jar>
[INFO] Installing <https://builds.apache.org/job/maven-plugins-ITs-m3/ws/maven-install-plugin/src/test/resources/unit/install-file-with-classifier/target/maven-install-test-1.0-SNAPSHOT.jar> to <https://builds.apache.org/job/maven-plugins-ITs-m3/ws/maven-install-plugin/target/local-repo/org/apache/maven/test/maven-install-file-test/1.0-SNAPSHOT/maven-install-file-test-1.0-SNAPSHOT-sources.jar>
[INFO] Installing <https://builds.apache.org/job/maven-plugins-ITs-m3/ws/maven-install-plugin/src/test/resources/unit/install-file-test-generatePom/target/maven-install-test-1.0-SNAPSHOT.jar> to <https://builds.apache.org/job/maven-plugins-ITs-m3/ws/maven-install-plugin/target/local-repo/org/apache/maven/test/maven-install-file-test/1.0-SNAPSHOT/maven-install-file-test-1.0-SNAPSHOT.jar>
[INFO] Installing <https://builds.apache.org/job/maven-plugins-ITs-m3/ws/maven-install-plugin/src/test/resources/unit/install-file-with-pomFile-test/target/maven-install-test-1.0-SNAPSHOT.jar> to <https://builds.apache.org/job/maven-plugins-ITs-m3/ws/maven-install-plugin/target/local-repo/org/apache/maven/test/maven-install-file-test/1.0-SNAPSHOT/maven-install-file-test-1.0-SNAPSHOT.jar>
[INFO] ..SUCCESS (2.2 s)
[INFO] Building: expressions/pom.xml
[INFO] Installing <https://builds.apache.org/job/maven-plugins-ITs-m3/ws/maven-install-plugin/src/test/resources/unit/install-file-with-pomFile-test/plugin-config.xml> to <https://builds.apache.org/job/maven-plugins-ITs-m3/ws/maven-install-plugin/target/local-repo/org/apache/maven/test/maven-install-file-test/1.0-SNAPSHOT/maven-install-file-test-1.0-SNAPSHOT.pom>
[INFO] Installing <https://builds.apache.org/job/maven-plugins-ITs-m3/ws/maven-install-plugin/src/test/resources/unit/install-file-with-checksum/maven-test-jar.jar> to <https://builds.apache.org/job/maven-plugins-ITs-m3/ws/maven-install-plugin/target/local-repo/org/apache/maven/test/maven-install-file-test/1.0-SNAPSHOT/maven-install-file-test-1.0-SNAPSHOT.jar>
Tests run: 8, Failures: 0, Errors: 0, Skipped: 0, Time elapsed: 0.739 sec
Running org.apache.maven.plugin.install.InstallMojoTest
>>>Cleaning local repo <https://builds.apache.org/job/maven-plugins-ITs-m3/ws/maven-install-plugin/target/local-repo/...>
>>>Cleaning local repo <https://builds.apache.org/job/maven-plugins-ITs-m3/ws/maven-install-plugin/target/local-repo/...>
[INFO] Installing <https://builds.apache.org/job/maven-plugins-ITs-m3/ws/maven-install-plugin/target/test-classes/unit/basic-install-test/target/maven-install-test-1.0-SNAPSHOT.jar> to <https://builds.apache.org/job/maven-plugins-ITs-m3/ws/maven-install-plugin/target/local-repo/org/apache/maven/test/maven-install-test/1.0-SNAPSHOT/maven-install-test-1.0-SNAPSHOT.jar>
>>>Cleaning local repo <https://builds.apache.org/job/maven-plugins-ITs-m3/ws/maven-install-plugin/target/local-repo/...>
[INFO] No primary artifact to install, installing attached artifacts instead.
[INFO] Installing <https://builds.apache.org/job/maven-plugins-ITs-m3/ws/maven-install-plugin/src/test/resources/unit/basic-install-test-with-attached-artifacts/plugin-config.xml> to <https://builds.apache.org/job/maven-plugins-ITs-m3/ws/maven-install-plugin/target/local-repo/org/apache/maven/test/maven-install-test/1.0-SNAPSHOT/maven-install-test-1.0-SNAPSHOT.pom>
[INFO] Installing <https://builds.apache.org/job/maven-plugins-ITs-m3/ws/maven-install-plugin/target/test-classes/unit/basic-install-test-with-attached-artifacts/target/maven-install-test-1.0-SNAPSHOT.jar> to <https://builds.apache.org/job/maven-plugins-ITs-m3/ws/maven-install-plugin/target/local-repo/org/apache/maven/test/attached-artifact-test-0/1.0-SNAPSHOT/attached-artifact-test-0-1.0-SNAPSHOT.jar>
[INFO] Installing <https://builds.apache.org/job/maven-plugins-ITs-m3/ws/maven-install-plugin/target/test-classes/unit/basic-install-test-with-attached-artifacts/target/maven-install-test-1.0-SNAPSHOT.jar> to <https://builds.apache.org/job/maven-plugins-ITs-m3/ws/maven-install-plugin/target/local-repo/org/apache/maven/test/attached-artifact-test-1/1.0-SNAPSHOT/attached-artifact-test-1-1.0-SNAPSHOT.jar>
>>>Cleaning local repo <https://builds.apache.org/job/maven-plugins-ITs-m3/ws/maven-install-plugin/target/local-repo/...>
[INFO] Installing <https://builds.apache.org/job/maven-plugins-ITs-m3/ws/maven-install-plugin/target/test-classes/unit/configured-install-test/target/maven-install-test-1.0-SNAPSHOT.jar> to <https://builds.apache.org/job/maven-plugins-ITs-m3/ws/maven-install-plugin/target/local-repo/org/apache/maven/test/maven-install-test/1.0-SNAPSHOT/maven-install-test-1.0-SNAPSHOT.jar>
>>>Cleaning local repo <https://builds.apache.org/job/maven-plugins-ITs-m3/ws/maven-install-plugin/target/local-repo/...>
>>>Cleaning local repo <https://builds.apache.org/job/maven-plugins-ITs-m3/ws/maven-install-plugin/target/local-repo/...>
[INFO] Installing <https://builds.apache.org/job/maven-plugins-ITs-m3/ws/maven-install-plugin/src/test/resources/unit/basic-install-test-packaging-pom/plugin-config.xml> to <https://builds.apache.org/job/maven-plugins-ITs-m3/ws/maven-install-plugin/target/local-repo/org/apache/maven/test/maven-install-test/1.0-SNAPSHOT/maven-install-test-1.0-SNAPSHOT.jar>
>>>Cleaning local repo <https://builds.apache.org/job/maven-plugins-ITs-m3/ws/maven-install-plugin/target/local-repo/...>
[INFO] Installing <https://builds.apache.org/job/maven-plugins-ITs-m3/ws/maven-install-plugin/target/test-classes/unit/basic-install-checksum/maven-test-jar.jar> to <https://builds.apache.org/job/maven-plugins-ITs-m3/ws/maven-install-plugin/target/local-repo/org/apache/maven/test/maven-install-test/1.0-SNAPSHOT/maven-install-test-1.0-SNAPSHOT.jar>
Tests run: 7, Failures: 0, Errors: 0, Skipped: 0, Time elapsed: 0.234 sec

Results :

Tests run: 15, Failures: 0, Errors: 0, Skipped: 0

[INFO] 
[INFO] --- maven-jar-plugin:2.3.1:jar (default-jar) @ maven-install-plugin ---
[INFO] Building jar: <https://builds.apache.org/job/maven-plugins-ITs-m3/ws/maven-install-plugin/target/maven-install-plugin-2.4-SNAPSHOT.jar>
[INFO] 
[INFO] --- maven-plugin-plugin:2.7:addPluginArtifactMetadata (default-addPluginArtifactMetadata) @ maven-install-plugin ---
[INFO] 
[INFO] --- maven-invoker-plugin:1.5:install (integration-test) @ maven-install-plugin ---
[INFO] Installing <https://builds.apache.org/job/maven-plugins-ITs-m3/ws/maven-install-plugin/pom.xml> to <https://builds.apache.org/job/maven-plugins-ITs-m3/ws/maven-install-plugin/target/local-repo/org/apache/maven/plugins/maven-install-plugin/2.4-SNAPSHOT/maven-install-plugin-2.4-SNAPSHOT.pom>
[INFO] Installing <https://builds.apache.org/job/maven-plugins-ITs-m3/ws/maven-install-plugin/target/maven-install-plugin-2.4-SNAPSHOT.jar> to <https://builds.apache.org/job/maven-plugins-ITs-m3/ws/maven-install-plugin/target/local-repo/org/apache/maven/plugins/maven-install-plugin/2.4-SNAPSHOT/maven-install-plugin-2.4-SNAPSHOT.jar>
[INFO] 
[INFO] --- maven-invoker-plugin:1.5:run (integration-test) @ maven-install-plugin ---
[INFO] Building: minstall-55/pom.xml
[INFO] Building: MJAR-80-fullcontent/pom.xml
[INFO] ..SUCCESS (2.2 s)
[INFO] Building: pom-checksum/pom.xml
[INFO] ..SUCCESS (2.2 s)
[INFO] ..SUCCESS (2.2 s)
[INFO] Building: active-profiles/pom.xml
[INFO] ..SUCCESS (2.5 s)
[INFO] Building: generate-pom-auto-1/pom.xml
Downloading: http://repository.apache.org/snapshots/org/apache/maven/shared/maven-model-converter/2.3-SNAPSHOT/maven-metadata.xml
Downloaded: http://repository.apache.org/snapshots/org/apache/maven/shared/maven-model-converter/2.3-SNAPSHOT/maven-metadata.xml (791 B at 0.4 KB/sec)
Downloading: http://repository.apache.org/snapshots/org/apache/maven/shared/maven-model-converter/2.3-SNAPSHOT/maven-model-converter-2.3-20110817.060716-74.pom
Downloaded: http://repository.apache.org/snapshots/org/apache/maven/shared/maven-model-converter/2.3-SNAPSHOT/maven-model-converter-2.3-20110817.060716-74.pom (4 KB at 23.8 KB/sec)
Downloading: http://repository.apache.org/snapshots/org/apache/maven/shared/maven-model-converter/2.3-SNAPSHOT/maven-model-converter-2.3-20110817.060716-74.jar
Downloaded: http://repository.apache.org/snapshots/org/apache/maven/shared/maven-model-converter/2.3-SNAPSHOT/maven-model-converter-2.3-20110817.060716-74.jar (73 KB at 104.9 KB/sec)
Downloading: http://repository.apache.org/snapshots/org/apache/maven/shared/maven-model-converter/2.3-SNAPSHOT/maven-metadata.xml
Downloaded: http://repository.apache.org/snapshots/org/apache/maven/shared/maven-model-converter/2.3-SNAPSHOT/maven-metadata.xml (791 B at 5.6 KB/sec)
Running org.apache.maven.plugins.repository.BundleCreateMojoTest
Tests run: 12, Failures: 0, Errors: 0, Skipped: 0, Time elapsed: 0.856 sec
Running org.apache.maven.plugins.repository.BundlePackMojoTest
Tests run: 6, Failures: 0, Errors: 0, Skipped: 0, Time elapsed: 0.312 sec
Downloading: file:///home/hudson/.m2/repository/org/codehaus/plexus/plexus-utils/1.4.1/plexus-utils-1.4.1.pom
Downloaded: file:///home/hudson/.m2/repository/org/codehaus/plexus/plexus-utils/1.4.1/plexus-utils-1.4.1.pom (2 KB at 1864.3 KB/sec)
Downloading: file:///home/hudson/.m2/repository/org/codehaus/plexus/plexus-utils/1.4.1/plexus-utils-1.4.1.jar
Downloaded: file:///home/hudson/.m2/repository/org/codehaus/plexus/plexus-utils/1.4.1/plexus-utils-1.4.1.jar (185 KB at 30704.4 KB/sec)
Downloading: file:///home/hudson/.m2/repository/junit/junit/4.5/junit-4.5.pom
Downloaded: file:///home/hudson/.m2/repository/junit/junit/4.5/junit-4.5.pom (2 KB at 170.3 KB/sec)
Downloading: file:///home/hudson/.m2/repository/org/codehaus/plexus/plexus-utils/1.0.4/plexus-utils-1.0.4.pom
Downloaded: file:///home/hudson/.m2/repository/org/codehaus/plexus/plexus-utils/1.0.4/plexus-utils-1.0.4.pom (7 KB at 6695.3 KB/sec)
Downloading: file:///home/hudson/.m2/repository/org/apache/maven/maven-artifact-manager/2.0.6/maven-artifact-manager-2.0.6.pom
Downloaded: file:///home/hudson/.m2/repository/org/apache/maven/maven-artifact-manager/2.0.6/maven-artifact-manager-2.0.6.pom (3 KB at 2560.5 KB/sec)
Downloading: file:///home/hudson/.m2/repository/org/apache/maven/maven-repository-metadata/2.0.6/maven-repository-metadata-2.0.6.pom
Downloaded: file:///home/hudson/.m2/repository/org/apache/maven/maven-repository-metadata/2.0.6/maven-repository-metadata-2.0.6.pom (2 KB at 1806.6 KB/sec)
Downloading: file:///home/hudson/.m2/repository/org/apache/maven/wagon/wagon-provider-api/1.0-beta-2/wagon-provider-api-1.0-beta-2.pom
Downloaded: file:///home/hudson/.m2/repository/org/apache/maven/wagon/wagon-provider-api/1.0-beta-2/wagon-provider-api-1.0-beta-2.pom (680 B at 664.1 KB/sec)
Downloading: file:///home/hudson/.m2/repository/org/apache/maven/wagon/wagon/1.0-beta-2/wagon-1.0-beta-2.pom
Downloaded: file:///home/hudson/.m2/repository/org/apache/maven/wagon/wagon/1.0-beta-2/wagon-1.0-beta-2.pom (6 KB at 5744.1 KB/sec)
Downloading: file:///home/hudson/.m2/repository/org/apache/maven/maven-parent/4/maven-parent-4.pom
Downloaded: file:///home/hudson/.m2/repository/org/apache/maven/maven-parent/4/maven-parent-4.pom (10 KB at 1627.0 KB/sec)
Downloading: file:///home/hudson/.m2/repository/junit/junit/4.5/junit-4.5.jar
Downloading: file:///home/hudson/.m2/repository/org/apache/maven/maven-artifact-manager/2.0.6/maven-artifact-manager-2.0.6.jar
Downloading: file:///home/hudson/.m2/repository/org/apache/maven/maven-repository-metadata/2.0.6/maven-repository-metadata-2.0.6.jar
Downloading: file:///home/hudson/.m2/repository/org/apache/maven/wagon/wagon-provider-api/1.0-beta-2/wagon-provider-api-1.0-beta-2.jar
Downloaded: file:///home/hudson/.m2/repository/org/apache/maven/maven-repository-metadata/2.0.6/maven-repository-metadata-2.0.6.jar (24 KB at 11950.7 KB/sec)
Downloaded: file:///home/hudson/.m2/repository/org/apache/maven/maven-artifact-manager/2.0.6/maven-artifact-manager-2.0.6.jar (56 KB at 18394.5 KB/sec)
Downloaded: file:///home/hudson/.m2/repository/org/apache/maven/wagon/wagon-provider-api/1.0-beta-2/wagon-provider-api-1.0-beta-2.jar (46 KB at 6462.9 KB/sec)
Downloaded: file:///home/hudson/.m2/repository/junit/junit/4.5/junit-4.5.jar (195 KB at 4223.5 KB/sec)
Downloading: file:///home/hudson/.m2/repository/org/codehaus/plexus/plexus-container-default/1.0-alpha-15/plexus-container-default-1.0-alpha-15.pom
Downloaded: file:///home/hudson/.m2/repository/org/codehaus/plexus/plexus-container-default/1.0-alpha-15/plexus-container-default-1.0-alpha-15.pom (2 KB at 1668.0 KB/sec)
Downloading: file:///home/hudson/.m2/repository/org/codehaus/plexus/plexus-containers/1.0-alpha-15/plexus-containers-1.0-alpha-15.pom
Downloaded: file:///home/hudson/.m2/repository/org/codehaus/plexus/plexus-containers/1.0-alpha-15/plexus-containers-1.0-alpha-15.pom (2 KB at 1846.7 KB/sec)
Downloading: file:///home/hudson/.m2/repository/org/codehaus/plexus/plexus/1.0.9/plexus-1.0.9.pom
Downloaded: file:///home/hudson/.m2/repository/org/codehaus/plexus/plexus/1.0.9/plexus-1.0.9.pom (8 KB at 7500.0 KB/sec)
Downloading: file:///home/hudson/.m2/repository/org/codehaus/plexus/plexus-utils/1.3/plexus-utils-1.3.pom
Downloaded: file:///home/hudson/.m2/repository/org/codehaus/plexus/plexus-utils/1.3/plexus-utils-1.3.pom (2 KB at 1009.8 KB/sec)
Downloading: file:///home/hudson/.m2/repository/org/codehaus/plexus/plexus/1.0.8/plexus-1.0.8.pom
Downloaded: file:///home/hudson/.m2/repository/org/codehaus/plexus/plexus/1.0.8/plexus-1.0.8.pom (8 KB at 7060.5 KB/sec)
Downloading: file:///home/hudson/.m2/repository/org/codehaus/plexus/plexus-classworlds/1.2-alpha-6/plexus-classworlds-1.2-alpha-6.pom
Downloaded: file:///home/hudson/.m2/repository/org/codehaus/plexus/plexus-classworlds/1.2-alpha-6/plexus-classworlds-1.2-alpha-6.pom (3 KB at 2316.4 KB/sec)
Downloading: file:///home/hudson/.m2/repository/org/codehaus/plexus/plexus-utils/1.2/plexus-utils-1.2.pom
Downloaded: file:///home/hudson/.m2/repository/org/codehaus/plexus/plexus-utils/1.2/plexus-utils-1.2.pom (767 B at 749.0 KB/sec)
Downloading: file:///home/hudson/.m2/repository/org/codehaus/plexus/plexus/1.0.5/plexus-1.0.5.pom
Downloaded: file:///home/hudson/.m2/repository/org/codehaus/plexus/plexus/1.0.5/plexus-1.0.5.pom (6 KB at 5802.7 KB/sec)
Downloading: file:///home/hudson/.m2/repository/org/codehaus/plexus/plexus-classworlds/1.2-alpha-6/plexus-classworlds-1.2-alpha-6.jar
Downloading: file:///home/hudson/.m2/repository/org/codehaus/plexus/plexus-container-default/1.0-alpha-15/plexus-container-default-1.0-alpha-15.jar
Downloaded: file:///home/hudson/.m2/repository/org/codehaus/plexus/plexus-classworlds/1.2-alpha-6/plexus-classworlds-1.2-alpha-6.jar (42 KB at 20715.8 KB/sec)
Downloading: http://repo1.maven.org/maven2/org/codehaus/plexus/plexus-container-default/1.0-alpha-15/plexus-container-default-1.0-alpha-15.jar
Downloaded: http://repo1.maven.org/maven2/org/codehaus/plexus/plexus-container-default/1.0-alpha-15/plexus-container-default-1.0-alpha-15.jar (196 KB at 50.7 KB/sec)
Downloading: file:///home/hudson/.m2/repository/org/codehaus/plexus/plexus-utils/1.0.4/plexus-utils-1.0.4.jar
Downloaded: file:///home/hudson/.m2/repository/org/codehaus/plexus/plexus-utils/1.0.4/plexus-utils-1.0.4.jar (160 KB at 31992.8 KB/sec)
Downloading: file:///home/hudson/.m2/repository/org/codehaus/plexus/plexus-utils/1.4/plexus-utils-1.4.pom
Downloaded: file:///home/hudson/.m2/repository/org/codehaus/plexus/plexus-utils/1.4/plexus-utils-1.4.pom (2 KB at 1124.0 KB/sec)
Downloading: file:///home/hudson/.m2/repository/org/codehaus/plexus/plexus-utils/1.4/plexus-utils-1.4.jar
Downloaded: file:///home/hudson/.m2/repository/org/codehaus/plexus/plexus-utils/1.4/plexus-utils-1.4.jar (178 KB at 7412.4 KB/sec)
Running org.apache.maven.plugins.repository.it.BundleCreateIT
Tests run: 3, Failures: 0, Errors: 0, Skipped: 0, Time elapsed: 94.655 sec
Running org.apache.maven.plugins.repository.it.BundlePackIT
Tests run: 2, Failures: 0, Errors: 0, Skipped: 0, Time elapsed: 107.031 sec
Running org.apache.maven.plugin.resources.remote.it.IT_RunOnlyAtExecutionRoot
Tests run: 1, Failures: 0, Errors: 0, Skipped: 0, Time elapsed: 119.438 sec
Running org.apache.maven.plugin.resources.remote.it.IT_GenerateFromOverride
Tests run: 1, Failures: 0, Errors: 0, Skipped: 0, Time elapsed: 2.385 sec
Running org.apache.maven.plugin.resources.remote.it.IT_GetDependencyProjects
Tests run: 1, Failures: 0, Errors: 0, Skipped: 0, Time elapsed: 5.868 sec
Running org.apache.maven.plugin.resources.remote.it.IT_SupplementalArtifact
Tests run: 1, Failures: 0, Errors: 0, Skipped: 0, Time elapsed: 6.351 sec
Running org.apache.maven.plugin.resources.remote.it.IT_CustomFilterDelimiter
Tests run: 1, Failures: 0, Errors: 0, Skipped: 0, Time elapsed: 2.334 sec
Running org.apache.maven.plugin.resources.remote.it.IT_FilterLocalOverride
Tests run: 1, Failures: 0, Errors: 0, Skipped: 0, Time elapsed: 2.332 sec
Running org.apache.maven.plugin.resources.remote.it.IT_BadDependencyPoms
Tests run: 1, Failures: 0, Errors: 0, Skipped: 0, Time elapsed: 2.534 sec
Running org.apache.maven.plugin.resources.remote.it.IT_GenerateFromBundle
Tests run: 1, Failures: 0, Errors: 0, Skipped: 0, Time elapsed: 2.331 sec
Build step 'Invoke top-level Maven targets' marked build as failure


Build failed in Jenkins: maven-plugins-ITs-m3 #193

Posted by Apache Jenkins Server <je...@builds.apache.org>.
See <https://builds.apache.org/job/maven-plugins-ITs-m3/193/changes>

Changes:

[hboutemy] updated parent pom

------------------------------------------
[...truncated 510 lines...]
Downloading: http://repo1.maven.org/maven2/org/apache/maven/scm/maven-scm-provider-cvsexe/1.1/maven-scm-provider-cvsexe-1.1.jar
Downloading: http://repo1.maven.org/maven2/org/apache/maven/scm/maven-scm-provider-cvs-commons/1.1/maven-scm-provider-cvs-commons-1.1.jar
Downloaded: http://repo1.maven.org/maven2/org/apache/maven/scm/maven-scm-provider-accurev/1.1/maven-scm-provider-accurev-1.1.jar (26 KB at 10.7 KB/sec)
Downloading: http://repo1.maven.org/maven2/org/apache/maven/scm/maven-scm-provider-cvsjava/1.1/maven-scm-provider-cvsjava-1.1.jar
Downloaded: http://repo1.maven.org/maven2/org/apache/maven/scm/maven-scm-provider-clearcase/1.1/maven-scm-provider-clearcase-1.1.jar (59 KB at 22.7 KB/sec)
Downloading: http://repo1.maven.org/maven2/org/apache/maven/scm/maven-scm-provider-gitexe/1.1/maven-scm-provider-gitexe-1.1.jar
Downloaded: http://repo1.maven.org/maven2/org/apache/maven/scm/maven-scm-provider-bazaar/1.1/maven-scm-provider-bazaar-1.1.jar (46 KB at 15.9 KB/sec)
Downloading: http://repo1.maven.org/maven2/org/apache/maven/scm/maven-scm-provider-git-commons/1.1/maven-scm-provider-git-commons-1.1.jar
Downloaded: http://repo1.maven.org/maven2/org/apache/maven/scm/maven-scm-provider-cvs-commons/1.1/maven-scm-provider-cvs-commons-1.1.jar (69 KB at 22.3 KB/sec)
Downloading: http://repo1.maven.org/maven2/org/apache/maven/scm/maven-scm-provider-hg/1.1/maven-scm-provider-hg-1.1.jar
Downloaded: http://repo1.maven.org/maven2/org/apache/maven/scm/maven-scm-provider-cvsexe/1.1/maven-scm-provider-cvsexe-1.1.jar (26 KB at 7.6 KB/sec)
Downloading: http://repo1.maven.org/maven2/org/apache/maven/scm/maven-scm-provider-perforce/1.1/maven-scm-provider-perforce-1.1.jar
Downloaded: http://repo1.maven.org/maven2/org/apache/maven/scm/maven-scm-provider-cvsjava/1.1/maven-scm-provider-cvsjava-1.1.jar (40 KB at 11.5 KB/sec)
Downloading: http://repo1.maven.org/maven2/org/apache/maven/scm/maven-scm-provider-starteam/1.1/maven-scm-provider-starteam-1.1.jar
Downloaded: http://repo1.maven.org/maven2/org/apache/maven/scm/maven-scm-provider-gitexe/1.1/maven-scm-provider-gitexe-1.1.jar (45 KB at 12.6 KB/sec)
Downloading: http://repo1.maven.org/maven2/org/apache/maven/scm/maven-scm-provider-svnexe/1.1/maven-scm-provider-svnexe-1.1.jar
Downloaded: http://repo1.maven.org/maven2/org/apache/maven/scm/maven-scm-provider-git-commons/1.1/maven-scm-provider-git-commons-1.1.jar (35 KB at 9.9 KB/sec)
Downloading: http://repo1.maven.org/maven2/org/apache/maven/scm/maven-scm-provider-svn-commons/1.1/maven-scm-provider-svn-commons-1.1.jar
Downloaded: http://repo1.maven.org/maven2/org/apache/maven/scm/maven-scm-provider-hg/1.1/maven-scm-provider-hg-1.1.jar (51 KB at 13.7 KB/sec)
Downloading: http://repo1.maven.org/maven2/org/apache/maven/scm/maven-scm-provider-synergy/1.1/maven-scm-provider-synergy-1.1.jar
Downloaded: http://repo1.maven.org/maven2/org/apache/maven/scm/maven-scm-provider-perforce/1.1/maven-scm-provider-perforce-1.1.jar (64 KB at 18.1 KB/sec)
Downloading: http://repo1.maven.org/maven2/org/apache/maven/scm/maven-scm-provider-vss/1.1/maven-scm-provider-vss-1.1.jar
Downloaded: http://repo1.maven.org/maven2/org/apache/maven/scm/maven-scm-provider-starteam/1.1/maven-scm-provider-starteam-1.1.jar (68 KB at 22.5 KB/sec)
Downloading: http://repo1.maven.org/maven2/org/apache/maven/scm/maven-scm-api/1.1/maven-scm-api-1.1.jar
Downloaded: http://repo1.maven.org/maven2/org/apache/maven/scm/maven-scm-provider-svnexe/1.1/maven-scm-provider-svnexe-1.1.jar (58 KB at 17.7 KB/sec)
Downloading: http://repo1.maven.org/maven2/org/apache/maven/scm/maven-scm-manager-plexus/1.1/maven-scm-manager-plexus-1.1.jar
Downloaded: http://repo1.maven.org/maven2/org/apache/maven/scm/maven-scm-provider-svn-commons/1.1/maven-scm-provider-svn-commons-1.1.jar (37 KB at 10.1 KB/sec)
Downloaded: http://repo1.maven.org/maven2/org/apache/maven/scm/maven-scm-provider-synergy/1.1/maven-scm-provider-synergy-1.1.jar (50 KB at 12.8 KB/sec)
Downloaded: http://repo1.maven.org/maven2/org/apache/maven/scm/maven-scm-provider-vss/1.1/maven-scm-provider-vss-1.1.jar (54 KB at 14.3 KB/sec)
Downloaded: http://repo1.maven.org/maven2/org/apache/maven/scm/maven-scm-api/1.1/maven-scm-api-1.1.jar (81 KB at 29.3 KB/sec)
Downloaded: http://repo1.maven.org/maven2/org/apache/maven/scm/maven-scm-manager-plexus/1.1/maven-scm-manager-plexus-1.1.jar (10 KB at 3.6 KB/sec)
Downloading: http://repo1.maven.org/maven2/org/sonatype/plugins/maven-repository-collector-plugin/1.0/maven-repository-collector-plugin-1.0.pom
Downloaded: http://repo1.maven.org/maven2/org/sonatype/plugins/maven-repository-collector-plugin/1.0/maven-repository-collector-plugin-1.0.pom (4 KB at 2.8 KB/sec)
Downloading: http://repo1.maven.org/maven2/org/sonatype/plugins/plugins-parent/4/plugins-parent-4.pom
Downloaded: http://repo1.maven.org/maven2/org/sonatype/plugins/plugins-parent/4/plugins-parent-4.pom (3 KB at 1.6 KB/sec)
Downloading: http://repo1.maven.org/maven2/org/sonatype/plugins/maven-repository-collector-plugin/1.0/maven-repository-collector-plugin-1.0.jar
Downloaded: http://repo1.maven.org/maven2/org/sonatype/plugins/maven-repository-collector-plugin/1.0/maven-repository-collector-plugin-1.0.jar (21 KB at 13.6 KB/sec)
Downloading: http://repo1.maven.org/maven2/org/codehaus/plexus/plexus-archiver/1.0-alpha-10/plexus-archiver-1.0-alpha-10.pom
Downloaded: http://repo1.maven.org/maven2/org/codehaus/plexus/plexus-archiver/1.0-alpha-10/plexus-archiver-1.0-alpha-10.pom (2 KB at 1.2 KB/sec)
Downloading: http://repo1.maven.org/maven2/org/codehaus/plexus/plexus-io/1.0-alpha-2/plexus-io-1.0-alpha-2.pom
Downloaded: http://repo1.maven.org/maven2/org/codehaus/plexus/plexus-io/1.0-alpha-2/plexus-io-1.0-alpha-2.pom (2 KB at 1.0 KB/sec)
Downloading: http://repo1.maven.org/maven2/org/apache/maven/shared/maven-verifier/1.2/maven-verifier-1.2.pom
Downloaded: http://repo1.maven.org/maven2/org/apache/maven/shared/maven-verifier/1.2/maven-verifier-1.2.pom (2 KB at 1.3 KB/sec)
Downloading: http://repo1.maven.org/maven2/org/codehaus/plexus/plexus-archiver/1.0-alpha-10/plexus-archiver-1.0-alpha-10.jar
Downloading: http://repo1.maven.org/maven2/org/codehaus/plexus/plexus-io/1.0-alpha-2/plexus-io-1.0-alpha-2.jar
Downloading: http://repo1.maven.org/maven2/org/apache/maven/shared/maven-verifier/1.2/maven-verifier-1.2.jar
Downloaded: http://repo1.maven.org/maven2/org/codehaus/plexus/plexus-io/1.0-alpha-2/plexus-io-1.0-alpha-2.jar (31 KB at 15.7 KB/sec)
Downloaded: http://repo1.maven.org/maven2/org/codehaus/plexus/plexus-archiver/1.0-alpha-10/plexus-archiver-1.0-alpha-10.jar (169 KB at 76.0 KB/sec)
Downloaded: http://repo1.maven.org/maven2/org/apache/maven/shared/maven-verifier/1.2/maven-verifier-1.2.jar (82 KB at 33.1 KB/sec)
Downloading: http://repo1.maven.org/maven2/org/codehaus/plexus/plexus-interpolation/1.11/plexus-interpolation-1.11.jar
Downloading: http://repo1.maven.org/maven2/org/apache/maven/shared/maven-common-artifact-filters/1.0-alpha-1/maven-common-artifact-filters-1.0-alpha-1.jar
Downloaded: http://repo1.maven.org/maven2/org/codehaus/plexus/plexus-interpolation/1.11/plexus-interpolation-1.11.jar (50 KB at 30.3 KB/sec)
Downloaded: http://repo1.maven.org/maven2/org/apache/maven/shared/maven-common-artifact-filters/1.0-alpha-1/maven-common-artifact-filters-1.0-alpha-1.jar (14 KB at 7.1 KB/sec)
Downloading: file:///home/jenkins/.m2/repository/org/codehaus/plexus/plexus-utils/1.4.1/plexus-utils-1.4.1.pom
Downloaded: file:///home/jenkins/.m2/repository/org/codehaus/plexus/plexus-utils/1.4.1/plexus-utils-1.4.1.pom (2 KB at 932.1 KB/sec)
Downloading: file:///home/jenkins/.m2/repository/org/codehaus/plexus/plexus-utils/1.4.1/plexus-utils-1.4.1.jar
Downloaded: file:///home/jenkins/.m2/repository/org/codehaus/plexus/plexus-utils/1.4.1/plexus-utils-1.4.1.jar (185 KB at 30704.4 KB/sec)
Downloading: file:///home/jenkins/.m2/repository/junit/junit/4.5/junit-4.5.pom
Downloaded: file:///home/jenkins/.m2/repository/junit/junit/4.5/junit-4.5.pom (2 KB at 5.9 KB/sec)
Downloading: file:///home/jenkins/.m2/repository/org/codehaus/plexus/plexus-utils/1.0.4/plexus-utils-1.0.4.pom
Downloaded: file:///home/jenkins/.m2/repository/org/codehaus/plexus/plexus-utils/1.0.4/plexus-utils-1.0.4.pom (7 KB at 6695.3 KB/sec)
Downloading: file:///home/jenkins/.m2/repository/org/apache/maven/maven-artifact-manager/2.0.6/maven-artifact-manager-2.0.6.pom
Downloaded: file:///home/jenkins/.m2/repository/org/apache/maven/maven-artifact-manager/2.0.6/maven-artifact-manager-2.0.6.pom (3 KB at 2560.5 KB/sec)
Downloading: file:///home/jenkins/.m2/repository/org/apache/maven/maven-repository-metadata/2.0.6/maven-repository-metadata-2.0.6.pom
Downloaded: file:///home/jenkins/.m2/repository/org/apache/maven/maven-repository-metadata/2.0.6/maven-repository-metadata-2.0.6.pom (2 KB at 1806.6 KB/sec)
Downloading: file:///home/jenkins/.m2/repository/org/apache/maven/wagon/wagon-provider-api/1.0-beta-2/wagon-provider-api-1.0-beta-2.pom
Downloaded: file:///home/jenkins/.m2/repository/org/apache/maven/wagon/wagon-provider-api/1.0-beta-2/wagon-provider-api-1.0-beta-2.pom (680 B at 1.3 KB/sec)
Downloading: file:///home/jenkins/.m2/repository/org/apache/maven/wagon/wagon/1.0-beta-2/wagon-1.0-beta-2.pom
Downloaded: file:///home/jenkins/.m2/repository/org/apache/maven/wagon/wagon/1.0-beta-2/wagon-1.0-beta-2.pom (6 KB at 18.7 KB/sec)
Downloading: file:///home/jenkins/.m2/repository/org/apache/maven/maven-parent/4/maven-parent-4.pom
Downloaded: file:///home/jenkins/.m2/repository/org/apache/maven/maven-parent/4/maven-parent-4.pom (10 KB at 39.4 KB/sec)
Downloading: file:///home/jenkins/.m2/repository/junit/junit/4.5/junit-4.5.jar
Downloading: file:///home/jenkins/.m2/repository/org/apache/maven/maven-artifact-manager/2.0.6/maven-artifact-manager-2.0.6.jar
Downloading: file:///home/jenkins/.m2/repository/org/apache/maven/maven-repository-metadata/2.0.6/maven-repository-metadata-2.0.6.jar
Downloading: file:///home/jenkins/.m2/repository/org/apache/maven/wagon/wagon-provider-api/1.0-beta-2/wagon-provider-api-1.0-beta-2.jar
Downloaded: file:///home/jenkins/.m2/repository/org/apache/maven/maven-repository-metadata/2.0.6/maven-repository-metadata-2.0.6.jar (24 KB at 11950.7 KB/sec)
Downloaded: file:///home/jenkins/.m2/repository/org/apache/maven/maven-artifact-manager/2.0.6/maven-artifact-manager-2.0.6.jar (56 KB at 13795.9 KB/sec)
Downloaded: file:///home/jenkins/.m2/repository/org/apache/maven/wagon/wagon-provider-api/1.0-beta-2/wagon-provider-api-1.0-beta-2.jar (46 KB at 3231.4 KB/sec)
Downloaded: file:///home/jenkins/.m2/repository/junit/junit/4.5/junit-4.5.jar (195 KB at 8831.0 KB/sec)
Downloading: file:///home/jenkins/.m2/repository/org/codehaus/plexus/plexus-container-default/1.0-alpha-15/plexus-container-default-1.0-alpha-15.pom
Downloaded: file:///home/jenkins/.m2/repository/org/codehaus/plexus/plexus-container-default/1.0-alpha-15/plexus-container-default-1.0-alpha-15.pom (2 KB at 1668.0 KB/sec)
Downloading: file:///home/jenkins/.m2/repository/org/codehaus/plexus/plexus-containers/1.0-alpha-15/plexus-containers-1.0-alpha-15.pom
Downloaded: file:///home/jenkins/.m2/repository/org/codehaus/plexus/plexus-containers/1.0-alpha-15/plexus-containers-1.0-alpha-15.pom (2 KB at 1846.7 KB/sec)
Downloading: file:///home/jenkins/.m2/repository/org/codehaus/plexus/plexus/1.0.9/plexus-1.0.9.pom
Downloaded: file:///home/jenkins/.m2/repository/org/codehaus/plexus/plexus/1.0.9/plexus-1.0.9.pom (8 KB at 7500.0 KB/sec)
Downloading: file:///home/jenkins/.m2/repository/org/codehaus/plexus/plexus-utils/1.3/plexus-utils-1.3.pom
Downloaded: file:///home/jenkins/.m2/repository/org/codehaus/plexus/plexus-utils/1.3/plexus-utils-1.3.pom (2 KB at 1009.8 KB/sec)
Downloading: file:///home/jenkins/.m2/repository/org/codehaus/plexus/plexus/1.0.8/plexus-1.0.8.pom
Downloaded: file:///home/jenkins/.m2/repository/org/codehaus/plexus/plexus/1.0.8/plexus-1.0.8.pom (8 KB at 7060.5 KB/sec)
Downloading: file:///home/jenkins/.m2/repository/org/codehaus/plexus/plexus-classworlds/1.2-alpha-6/plexus-classworlds-1.2-alpha-6.pom
Downloaded: file:///home/jenkins/.m2/repository/org/codehaus/plexus/plexus-classworlds/1.2-alpha-6/plexus-classworlds-1.2-alpha-6.pom (3 KB at 2316.4 KB/sec)
Downloading: file:///home/jenkins/.m2/repository/org/codehaus/plexus/plexus-utils/1.2/plexus-utils-1.2.pom
Downloaded: file:///home/jenkins/.m2/repository/org/codehaus/plexus/plexus-utils/1.2/plexus-utils-1.2.pom (767 B at 749.0 KB/sec)
Downloading: file:///home/jenkins/.m2/repository/org/codehaus/plexus/plexus/1.0.5/plexus-1.0.5.pom
Downloaded: file:///home/jenkins/.m2/repository/org/codehaus/plexus/plexus/1.0.5/plexus-1.0.5.pom (6 KB at 5802.7 KB/sec)
Downloading: file:///home/jenkins/.m2/repository/org/codehaus/plexus/plexus-classworlds/1.2-alpha-6/plexus-classworlds-1.2-alpha-6.jar
Downloading: file:///home/jenkins/.m2/repository/org/codehaus/plexus/plexus-container-default/1.0-alpha-15/plexus-container-default-1.0-alpha-15.jar
Downloading: http://repo1.maven.org/maven2/org/codehaus/plexus/plexus-container-default/1.0-alpha-15/plexus-container-default-1.0-alpha-15.jar
Downloading: http://repo1.maven.org/maven2/org/codehaus/plexus/plexus-classworlds/1.2-alpha-6/plexus-classworlds-1.2-alpha-6.jar
Downloaded: http://repo1.maven.org/maven2/org/codehaus/plexus/plexus-container-default/1.0-alpha-15/plexus-container-default-1.0-alpha-15.jar (196 KB at 120.0 KB/sec)
Downloaded: http://repo1.maven.org/maven2/org/codehaus/plexus/plexus-classworlds/1.2-alpha-6/plexus-classworlds-1.2-alpha-6.jar (42 KB at 22.1 KB/sec)
Downloading: file:///home/jenkins/.m2/repository/org/codehaus/plexus/plexus-utils/1.0.4/plexus-utils-1.0.4.jar
Downloaded: file:///home/jenkins/.m2/repository/org/codehaus/plexus/plexus-utils/1.0.4/plexus-utils-1.0.4.jar (160 KB at 26660.6 KB/sec)
Downloading: file:///home/jenkins/.m2/repository/org/codehaus/plexus/plexus-utils/1.4/plexus-utils-1.4.pom
Downloaded: file:///home/jenkins/.m2/repository/org/codehaus/plexus/plexus-utils/1.4/plexus-utils-1.4.pom (2 KB at 1124.0 KB/sec)
Downloading: file:///home/jenkins/.m2/repository/org/codehaus/plexus/plexus-utils/1.4/plexus-utils-1.4.jar
Downloaded: file:///home/jenkins/.m2/repository/org/codehaus/plexus/plexus-utils/1.4/plexus-utils-1.4.jar (178 KB at 7412.4 KB/sec)
Downloading: http://repo1.maven.org/maven2/asm/asm/3.3.1/asm-3.3.1.pom
Downloaded: http://repo1.maven.org/maven2/asm/asm/3.3.1/asm-3.3.1.pom (266 B at 0.1 KB/sec)
Downloading: http://repo1.maven.org/maven2/asm/asm-parent/3.3.1/asm-parent-3.3.1.pom
Downloaded: http://repo1.maven.org/maven2/asm/asm-parent/3.3.1/asm-parent-3.3.1.pom (5 KB at 2.1 KB/sec)
Downloading: http://repo1.maven.org/maven2/asm/asm-commons/3.3.1/asm-commons-3.3.1.pom
Downloaded: http://repo1.maven.org/maven2/asm/asm-commons/3.3.1/asm-commons-3.3.1.pom (417 B at 0.2 KB/sec)
Downloading: http://repo1.maven.org/maven2/asm/asm-tree/3.3.1/asm-tree-3.3.1.pom
Downloaded: http://repo1.maven.org/maven2/asm/asm-tree/3.3.1/asm-tree-3.3.1.pom (406 B at 0.1 KB/sec)
Downloading: http://repo1.maven.org/maven2/org/vafer/jdependency/0.7/jdependency-0.7.pom
Downloaded: http://repo1.maven.org/maven2/org/vafer/jdependency/0.7/jdependency-0.7.pom (8 KB at 2.4 KB/sec)
Downloading: http://repo1.maven.org/maven2/asm/asm/3.3.1/asm-3.3.1.jar
Downloading: http://repo1.maven.org/maven2/asm/asm-commons/3.3.1/asm-commons-3.3.1.jar
Downloading: http://repo1.maven.org/maven2/asm/asm-tree/3.3.1/asm-tree-3.3.1.jar
Downloading: http://repo1.maven.org/maven2/org/vafer/jdependency/0.7/jdependency-0.7.jar
Downloaded: http://repo1.maven.org/maven2/asm/asm/3.3.1/asm-3.3.1.jar (43 KB at 15.8 KB/sec)
Downloaded: http://repo1.maven.org/maven2/asm/asm-tree/3.3.1/asm-tree-3.3.1.jar (22 KB at 7.2 KB/sec)
Downloaded: http://repo1.maven.org/maven2/org/vafer/jdependency/0.7/jdependency-0.7.jar (12 KB at 3.6 KB/sec)
Downloaded: http://repo1.maven.org/maven2/asm/asm-commons/3.3.1/asm-commons-3.3.1.jar (38 KB at 10.2 KB/sec)
Downloading: http://repo1.maven.org/maven2/org/apache/maven/maven-settings/3.0-alpha-4/maven-settings-3.0-alpha-4.pom
Downloaded: http://repo1.maven.org/maven2/org/apache/maven/maven-settings/3.0-alpha-4/maven-settings-3.0-alpha-4.pom (2 KB at 1.6 KB/sec)
Downloading: http://repo1.maven.org/maven2/org/apache/maven/maven-artifact/3.0-alpha-4/maven-artifact-3.0-alpha-4.pom
Downloaded: http://repo1.maven.org/maven2/org/apache/maven/maven-artifact/3.0-alpha-4/maven-artifact-3.0-alpha-4.pom (2 KB at 0.6 KB/sec)
Downloading: http://repo1.maven.org/maven2/org/codehaus/plexus/plexus-container-default/1.5.1/plexus-container-default-1.5.1.pom
Downloaded: http://repo1.maven.org/maven2/org/codehaus/plexus/plexus-container-default/1.5.1/plexus-container-default-1.5.1.pom (3 KB at 0.9 KB/sec)
Downloading: http://repo1.maven.org/maven2/org/codehaus/plexus/plexus-containers/1.5.1/plexus-containers-1.5.1.pom
Downloaded: http://repo1.maven.org/maven2/org/codehaus/plexus/plexus-containers/1.5.1/plexus-containers-1.5.1.pom (5 KB at 1.9 KB/sec)
Downloading: http://repo1.maven.org/maven2/org/apache/maven/maven-model-builder/3.0-alpha-4/maven-model-builder-3.0-alpha-4.pom
Downloaded: http://repo1.maven.org/maven2/org/apache/maven/maven-model-builder/3.0-alpha-4/maven-model-builder-3.0-alpha-4.pom (3 KB at 0.7 KB/sec)
Downloading: http://repo1.maven.org/maven2/org/codehaus/plexus/plexus-component-annotations/1.5.1/plexus-component-annotations-1.5.1.pom
Downloaded: http://repo1.maven.org/maven2/org/codehaus/plexus/plexus-component-annotations/1.5.1/plexus-component-annotations-1.5.1.pom (815 B at 0.3 KB/sec)
Downloading: http://repo1.maven.org/maven2/org/apache/maven/wagon/wagon-file/1.0-beta-3/wagon-file-1.0-beta-3.pom
Downloaded: http://repo1.maven.org/maven2/org/apache/maven/wagon/wagon-file/1.0-beta-3/wagon-file-1.0-beta-3.pom (575 B at 0.6 KB/sec)
Downloading: http://repo1.maven.org/maven2/org/apache/maven/wagon/wagon-providers/1.0-beta-3/wagon-providers-1.0-beta-3.pom
Downloaded: http://repo1.maven.org/maven2/org/apache/maven/wagon/wagon-providers/1.0-beta-3/wagon-providers-1.0-beta-3.pom (2 KB at 1.7 KB/sec)
Downloading: http://repo1.maven.org/maven2/org/apache/maven/wagon/wagon/1.0-beta-3/wagon-1.0-beta-3.pom
Downloaded: http://repo1.maven.org/maven2/org/apache/maven/wagon/wagon/1.0-beta-3/wagon-1.0-beta-3.pom (9 KB at 10.9 KB/sec)
Downloading: http://repo1.maven.org/maven2/org/apache/maven/wagon/wagon-provider-api/1.0-beta-3/wagon-provider-api-1.0-beta-3.pom
Downloaded: http://repo1.maven.org/maven2/org/apache/maven/wagon/wagon-provider-api/1.0-beta-3/wagon-provider-api-1.0-beta-3.pom (906 B at 1.8 KB/sec)
Downloading: http://repo1.maven.org/maven2/org/apache/maven/wagon/wagon-http-lightweight/1.0-beta-3/wagon-http-lightweight-1.0-beta-3.pom
Downloaded: http://repo1.maven.org/maven2/org/apache/maven/wagon/wagon-http-lightweight/1.0-beta-3/wagon-http-lightweight-1.0-beta-3.pom (2 KB at 2.7 KB/sec)
Downloading: http://repo1.maven.org/maven2/org/apache/maven/wagon/wagon-http-shared/1.0-beta-3/wagon-http-shared-1.0-beta-3.pom
Downloaded: http://repo1.maven.org/maven2/org/apache/maven/wagon/wagon-http-shared/1.0-beta-3/wagon-http-shared-1.0-beta-3.pom (2 KB at 2.5 KB/sec)
Downloading: http://repo1.maven.org/maven2/org/apache/maven/wagon/wagon-ssh/1.0-beta-3/wagon-ssh-1.0-beta-3.pom
Downloaded: http://repo1.maven.org/maven2/org/apache/maven/wagon/wagon-ssh/1.0-beta-3/wagon-ssh-1.0-beta-3.pom (2 KB at 3.6 KB/sec)
Downloading: http://repo1.maven.org/maven2/org/apache/maven/wagon/wagon-ssh-common/1.0-beta-3/wagon-ssh-common-1.0-beta-3.pom
Downloaded: http://repo1.maven.org/maven2/org/apache/maven/wagon/wagon-ssh-common/1.0-beta-3/wagon-ssh-common-1.0-beta-3.pom (968 B at 1.9 KB/sec)
Downloading: http://repo1.maven.org/maven2/org/apache/maven/maven-artifact/2.0.10/maven-artifact-2.0.10.jar
Downloading: http://repo1.maven.org/maven2/org/apache/maven/maven-artifact-manager/2.0.10/maven-artifact-manager-2.0.10.jar
Downloading: http://repo1.maven.org/maven2/org/apache/maven/maven-plugin-api/2.0.10/maven-plugin-api-2.0.10.jar
Downloading: http://repo1.maven.org/maven2/org/apache/maven/maven-repository-metadata/2.0.10/maven-repository-metadata-2.0.10.jar
Downloading: http://repo1.maven.org/maven2/org/apache/maven/wagon/wagon-file/1.0-beta-3/wagon-file-1.0-beta-3.jar
Downloading: http://repo1.maven.org/maven2/org/apache/maven/wagon/wagon-http-lightweight/1.0-beta-3/wagon-http-lightweight-1.0-beta-3.jar
Downloaded: http://repo1.maven.org/maven2/org/apache/maven/maven-artifact/2.0.10/maven-artifact-2.0.10.jar (88 KB at 58.3 KB/sec)
Downloading: http://repo1.maven.org/maven2/org/apache/maven/wagon/wagon-http-shared/1.0-beta-3/wagon-http-shared-1.0-beta-3.jar
Downloaded: http://repo1.maven.org/maven2/org/apache/maven/maven-repository-metadata/2.0.10/maven-repository-metadata-2.0.10.jar (26 KB at 11.2 KB/sec)
Downloading: http://repo1.maven.org/maven2/org/apache/maven/wagon/wagon-provider-api/1.0-beta-3/wagon-provider-api-1.0-beta-3.jar
Downloaded: http://repo1.maven.org/maven2/org/apache/maven/maven-artifact-manager/2.0.10/maven-artifact-manager-2.0.10.jar (57 KB at 22.7 KB/sec)
Downloading: http://repo1.maven.org/maven2/org/apache/maven/wagon/wagon-ssh/1.0-beta-3/wagon-ssh-1.0-beta-3.jar
Downloaded: http://repo1.maven.org/maven2/org/apache/maven/wagon/wagon-file/1.0-beta-3/wagon-file-1.0-beta-3.jar (10 KB at 3.6 KB/sec)
Downloading: http://repo1.maven.org/maven2/org/apache/maven/wagon/wagon-ssh-common/1.0-beta-3/wagon-ssh-common-1.0-beta-3.jar
Downloaded: http://repo1.maven.org/maven2/org/apache/maven/wagon/wagon-http-lightweight/1.0-beta-3/wagon-http-lightweight-1.0-beta-3.jar (14 KB at 5.3 KB/sec)
Downloaded: http://repo1.maven.org/maven2/org/apache/maven/wagon/wagon-http-shared/1.0-beta-3/wagon-http-shared-1.0-beta-3.jar (19 KB at 6.2 KB/sec)
Downloaded: http://repo1.maven.org/maven2/org/apache/maven/wagon/wagon-provider-api/1.0-beta-3/wagon-provider-api-1.0-beta-3.jar (51 KB at 17.0 KB/sec)
Downloaded: http://repo1.maven.org/maven2/org/apache/maven/wagon/wagon-ssh/1.0-beta-3/wagon-ssh-1.0-beta-3.jar (28 KB at 9.3 KB/sec)
Downloaded: http://repo1.maven.org/maven2/org/apache/maven/wagon/wagon-ssh-common/1.0-beta-3/wagon-ssh-common-1.0-beta-3.jar (24 KB at 7.7 KB/sec)
Downloading: http://repo1.maven.org/maven2/org/apache/maven/maven-toolchain/2.0.9/maven-toolchain-2.0.9.jar
Downloaded: http://repo1.maven.org/maven2/org/apache/maven/maven-toolchain/2.0.9/maven-toolchain-2.0.9.jar (38 KB at 26.0 KB/sec)
Downloading: http://repo1.maven.org/maven2/org/codehaus/modello/modello-maven-plugin/1.4/modello-maven-plugin-1.4.pom
Downloaded: http://repo1.maven.org/maven2/org/codehaus/modello/modello-maven-plugin/1.4/modello-maven-plugin-1.4.pom (6 KB at 5.2 KB/sec)
Downloading: http://repo1.maven.org/maven2/org/codehaus/modello/modello/1.4/modello-1.4.pom
Downloaded: http://repo1.maven.org/maven2/org/codehaus/modello/modello/1.4/modello-1.4.pom (24 KB at 23.7 KB/sec)
Downloading: http://repo1.maven.org/maven2/org/codehaus/modello/modello-maven-plugin/1.4/modello-maven-plugin-1.4.jar
Downloaded: http://repo1.maven.org/maven2/org/codehaus/modello/modello-maven-plugin/1.4/modello-maven-plugin-1.4.jar (24 KB at 23.9 KB/sec)
Downloading: http://repo1.maven.org/maven2/org/apache/maven/plugins/maven-jarsigner-plugin/1.2/maven-jarsigner-plugin-1.2.pom
Downloading: http://repo1.maven.org/maven2/org/codehaus/groovy/groovy/1.7.5/groovy-1.7.5.pom
Downloaded: http://repo1.maven.org/maven2/org/apache/maven/plugins/maven-jarsigner-plugin/1.2/maven-jarsigner-plugin-1.2.pom (6 KB at 5.3 KB/sec)
Downloading: http://repo1.maven.org/maven2/org/apache/maven/plugins/maven-jarsigner-plugin/1.2/maven-jarsigner-plugin-1.2.jar
Downloaded: http://repo1.maven.org/maven2/org/codehaus/groovy/groovy/1.7.5/groovy-1.7.5.pom (29 KB at 22.7 KB/sec)
Downloading: http://repo1.maven.org/maven2/org/apache/maven/doxia/doxia-sink-api/1.1.4/doxia-sink-api-1.1.4.jar
Downloading: http://repo1.maven.org/maven2/org/codehaus/groovy/groovy/1.7.5/groovy-1.7.5.jar
Downloaded: http://repo1.maven.org/maven2/org/apache/maven/plugins/maven-jarsigner-plugin/1.2/maven-jarsigner-plugin-1.2.jar (28 KB at 15.8 KB/sec)
Downloaded: http://repo1.maven.org/maven2/org/apache/maven/doxia/doxia-sink-api/1.1.4/doxia-sink-api-1.1.4.jar (13 KB at 7.2 KB/sec)
Downloaded: http://repo1.maven.org/maven2/org/codehaus/groovy/groovy/1.7.5/groovy-1.7.5.jar (4750 KB at 2175.6 KB/sec)
Downloading: http://repo1.maven.org/maven2/httpunit/httpunit/1.6/httpunit-1.6.pom
Downloading: http://repo1.maven.org/maven2/org/codehaus/modello/modello-core/1.4/modello-core-1.4.pom
Downloaded: http://repo1.maven.org/maven2/httpunit/httpunit/1.6/httpunit-1.6.pom (3 KB at 3.1 KB/sec)
Downloading: http://repo1.maven.org/maven2/xerces/xmlParserAPIs/2.2.1/xmlParserAPIs-2.2.1.pom
Downloaded: http://repo1.maven.org/maven2/org/codehaus/modello/modello-core/1.4/modello-core-1.4.pom (2 KB at 1.0 KB/sec)
Downloading: http://repo1.maven.org/maven2/org/codehaus/modello/modello-plugin-converters/1.4/modello-plugin-converters-1.4.pom
Downloaded: http://repo1.maven.org/maven2/xerces/xmlParserAPIs/2.2.1/xmlParserAPIs-2.2.1.pom (153 B at 0.1 KB/sec)
Downloading: http://repo1.maven.org/maven2/nekohtml/nekohtml/0.9.1/nekohtml-0.9.1.pom
Downloaded: http://repo1.maven.org/maven2/org/codehaus/modello/modello-plugin-converters/1.4/modello-plugin-converters-1.4.pom (2 KB at 1.0 KB/sec)
Downloading: http://repo1.maven.org/maven2/org/codehaus/modello/modello-plugins/1.4/modello-plugins-1.4.pom
Downloaded: http://repo1.maven.org/maven2/nekohtml/nekohtml/0.9.1/nekohtml-0.9.1.pom (346 B at 0.2 KB/sec)
Downloading: http://repo1.maven.org/maven2/rhino/js/1.5R4.1/js-1.5R4.1.pom
Downloaded: http://repo1.maven.org/maven2/org/codehaus/modello/modello-plugins/1.4/modello-plugins-1.4.pom (3 KB at 1.0 KB/sec)
Downloading: http://repo1.maven.org/maven2/org/codehaus/modello/modello-plugin-java/1.4/modello-plugin-java-1.4.pom
Downloaded: http://repo1.maven.org/maven2/rhino/js/1.5R4.1/js-1.5R4.1.pom (143 B at 0.1 KB/sec)
Downloading: http://repo1.maven.org/maven2/httpunit/httpunit/1.6/httpunit-1.6.jar
Downloading: http://repo1.maven.org/maven2/xerces/xmlParserAPIs/2.2.1/xmlParserAPIs-2.2.1.jar
Downloading: http://repo1.maven.org/maven2/nekohtml/nekohtml/0.9.1/nekohtml-0.9.1.jar
Downloading: http://repo1.maven.org/maven2/rhino/js/1.5R4.1/js-1.5R4.1.jar
Downloaded: http://repo1.maven.org/maven2/org/codehaus/modello/modello-plugin-java/1.4/modello-plugin-java-1.4.pom (3 KB at 1.6 KB/sec)
Downloading: http://repo1.maven.org/maven2/org/codehaus/modello/modello-plugin-dom4j/1.4/modello-plugin-dom4j-1.4.pom
Downloaded: http://repo1.maven.org/maven2/httpunit/httpunit/1.6/httpunit-1.6.jar (402 KB at 162.7 KB/sec)
Downloaded: http://repo1.maven.org/maven2/xerces/xmlParserAPIs/2.2.1/xmlParserAPIs-2.2.1.jar (82 KB at 29.9 KB/sec)
Downloaded: http://repo1.maven.org/maven2/nekohtml/nekohtml/0.9.1/nekohtml-0.9.1.jar (66 KB at 20.4 KB/sec)
Downloaded: http://repo1.maven.org/maven2/rhino/js/1.5R4.1/js-1.5R4.1.jar (584 KB at 156.1 KB/sec)
Downloaded: http://repo1.maven.org/maven2/org/codehaus/modello/modello-plugin-dom4j/1.4/modello-plugin-dom4j-1.4.pom (2 KB at 0.5 KB/sec)
Downloading: http://repo1.maven.org/maven2/org/codehaus/modello/modello-plugin-xml/1.4/modello-plugin-xml-1.4.pom
Downloaded: http://repo1.maven.org/maven2/org/codehaus/modello/modello-plugin-xml/1.4/modello-plugin-xml-1.4.pom (2 KB at 1.0 KB/sec)
Downloading: http://repo1.maven.org/maven2/org/codehaus/modello/modello-plugin-jdom/1.4/modello-plugin-jdom-1.4.pom
Downloaded: http://repo1.maven.org/maven2/org/codehaus/modello/modello-plugin-jdom/1.4/modello-plugin-jdom-1.4.pom (2 KB at 1.6 KB/sec)
Downloading: http://repo1.maven.org/maven2/org/codehaus/modello/modello-plugin-stax/1.4/modello-plugin-stax-1.4.pom
Downloaded: http://repo1.maven.org/maven2/org/codehaus/modello/modello-plugin-stax/1.4/modello-plugin-stax-1.4.pom (3 KB at 2.4 KB/sec)
Downloading: http://repo1.maven.org/maven2/org/codehaus/modello/modello-plugin-xdoc/1.4/modello-plugin-xdoc-1.4.pom
Downloaded: http://repo1.maven.org/maven2/org/codehaus/modello/modello-plugin-xdoc/1.4/modello-plugin-xdoc-1.4.pom (2 KB at 2.4 KB/sec)
Downloading: http://repo1.maven.org/maven2/org/codehaus/modello/modello-plugin-xsd/1.4/modello-plugin-xsd-1.4.pom
Downloaded: http://repo1.maven.org/maven2/org/codehaus/modello/modello-plugin-xsd/1.4/modello-plugin-xsd-1.4.pom (2 KB at 1.3 KB/sec)
Downloading: http://repo1.maven.org/maven2/org/codehaus/modello/modello-plugin-xpp3/1.4/modello-plugin-xpp3-1.4.pom
Downloaded: http://repo1.maven.org/maven2/org/codehaus/modello/modello-plugin-xpp3/1.4/modello-plugin-xpp3-1.4.pom (2 KB at 1.5 KB/sec)
Downloading: http://repo1.maven.org/maven2/org/codehaus/modello/modello-core/1.4/modello-core-1.4.jar
Downloading: http://repo1.maven.org/maven2/org/codehaus/modello/modello-plugin-converters/1.4/modello-plugin-converters-1.4.jar
Downloading: http://repo1.maven.org/maven2/org/codehaus/modello/modello-plugin-dom4j/1.4/modello-plugin-dom4j-1.4.jar
Downloading: http://repo1.maven.org/maven2/org/codehaus/modello/modello-plugin-xml/1.4/modello-plugin-xml-1.4.jar
Downloading: http://repo1.maven.org/maven2/org/codehaus/modello/modello-plugin-java/1.4/modello-plugin-java-1.4.jar
Downloaded: http://repo1.maven.org/maven2/org/codehaus/modello/modello-core/1.4/modello-core-1.4.jar (57 KB at 28.0 KB/sec)
Downloading: http://repo1.maven.org/maven2/org/codehaus/modello/modello-plugin-jdom/1.4/modello-plugin-jdom-1.4.jar
Downloaded: http://repo1.maven.org/maven2/org/codehaus/modello/modello-plugin-dom4j/1.4/modello-plugin-dom4j-1.4.jar (18 KB at 8.0 KB/sec)
Downloading: http://repo1.maven.org/maven2/org/codehaus/modello/modello-plugin-stax/1.4/modello-plugin-stax-1.4.jar
Downloaded: http://repo1.maven.org/maven2/org/codehaus/modello/modello-plugin-java/1.4/modello-plugin-java-1.4.jar (82 KB at 32.9 KB/sec)
Downloading: http://repo1.maven.org/maven2/org/codehaus/modello/modello-plugin-xdoc/1.4/modello-plugin-xdoc-1.4.jar
Downloaded: http://repo1.maven.org/maven2/org/codehaus/modello/modello-plugin-xml/1.4/modello-plugin-xml-1.4.jar (15 KB at 5.3 KB/sec)
Downloading: http://repo1.maven.org/maven2/org/codehaus/modello/modello-plugin-xpp3/1.4/modello-plugin-xpp3-1.4.jar
Downloaded: http://repo1.maven.org/maven2/org/codehaus/modello/modello-plugin-converters/1.4/modello-plugin-converters-1.4.jar (10 KB at 3.1 KB/sec)
Downloading: http://repo1.maven.org/maven2/org/codehaus/modello/modello-plugin-xsd/1.4/modello-plugin-xsd-1.4.jar
Downloaded: http://repo1.maven.org/maven2/org/codehaus/modello/modello-plugin-jdom/1.4/modello-plugin-jdom-1.4.jar (14 KB at 4.0 KB/sec)
Downloaded: http://repo1.maven.org/maven2/org/codehaus/modello/modello-plugin-stax/1.4/modello-plugin-stax-1.4.jar (36 KB at 10.2 KB/sec)
Downloaded: http://repo1.maven.org/maven2/org/codehaus/modello/modello-plugin-xdoc/1.4/modello-plugin-xdoc-1.4.jar (14 KB at 3.8 KB/sec)
Downloaded: http://repo1.maven.org/maven2/org/codehaus/modello/modello-plugin-xpp3/1.4/modello-plugin-xpp3-1.4.jar (26 KB at 7.3 KB/sec)
Downloaded: http://repo1.maven.org/maven2/org/codehaus/modello/modello-plugin-xsd/1.4/modello-plugin-xsd-1.4.jar (14 KB at 4.0 KB/sec)
Build step 'Invoke top-level Maven targets' marked build as failure


Build failed in Jenkins: maven-plugins-ITs-m3 #192

Posted by Apache Jenkins Server <je...@builds.apache.org>.
See <https://builds.apache.org/job/maven-plugins-ITs-m3/192/changes>

Changes:

[brett] add readme

------------------------------------------
Started by an SCM change
Building remotely on ubuntu3
Updating http://svn.apache.org/repos/asf/maven/plugins/trunk
U         maven-plugins/src/site-docs/apt/index.apt
U         maven-plugins/pom.xml
U         maven-plugins/site-pom.xml
AU        maven-checkstyle-plugin/src/it/MCHECKSTYLE-131/module/src/main/java/example/module/package-info.java
U         maven-checkstyle-plugin/src/it/MCHECKSTYLE-131/checkstyle.xml
U         maven-site-plugin/src/site/apt/examples/sitedescriptor.apt
AU        README
At revision 1158313
[maven-plugins-ITs-m3] $ /home/jenkins/jenkins-slave/tools/Maven_3.0.3/bin/mvn clean install -Prun-its -U -B -V -fae -Papache.snapshots -T3
Apache Maven 3.0.3 (r1075438; 2011-02-28 17:31:09+0000)
Maven home: /home/jenkins/jenkins-slave/tools/Maven_3.0.3
Java version: 1.5.0_22, vendor: Sun Microsystems Inc.
Java home: /x1/jenkins/tools/java/jdk1.5.0_22-32/jre
Default locale: en_US, platform encoding: ANSI_X3.4-1968
OS name: "linux", version: "2.6.32-32-server", arch: "i386", family: "unix"
[INFO] Scanning for projects...
Downloading: http://repo1.maven.org/maven2/org/apache/maven/maven-parent/21/maven-parent-21.pom
[ERROR] The build could not read 1 project -> [Help 1]
[ERROR]   
[ERROR]   The project org.apache.maven.plugins:maven-plugins:23-SNAPSHOT (/x1/jenkins/jenkins-slave/workspace/maven-plugins-ITs-m3/maven-plugins/pom.xml) has 1 error
[ERROR]     Non-resolvable parent POM: Could not find artifact org.apache.maven:maven-parent:pom:21 in central (http://repo1.maven.org/maven2) and 'parent.relativePath' points at wrong local POM @ line 23, column 11 -> [Help 2]
[ERROR] 
[ERROR] To see the full stack trace of the errors, re-run Maven with the -e switch.
[ERROR] Re-run Maven using the -X switch to enable full debug logging.
[ERROR] 
[ERROR] For more information about the errors and possible solutions, please read the following articles:
[ERROR] [Help 1] http://cwiki.apache.org/confluence/display/MAVEN/ProjectBuildingException
[ERROR] [Help 2] http://cwiki.apache.org/confluence/display/MAVEN/UnresolvableModelException