You are viewing a plain text version of this content. The canonical link for it is here.
Posted to builds@cassandra.apache.org by Apache Jenkins Server <je...@builds.apache.org> on 2023/10/11 17:20:42 UTC
Build complete: Cassandra-trunk #1742 [UNSTABLE] b8b17dc5db7b112ab2b7fe1308c2089cdc38eb1d
-------------------------------------------------------------------------------
Build Cassandra-trunk #1742 Still Unstable
URL: https://ci-cassandra.apache.org/job/Cassandra-trunk/1742/
-------------------------------------------------------------------------------
Changes:
[David Capwell] Gossip NPE due to shutdown event corrupting empty statuses
-------------------------------------------------------------------------------
Failed Tests:
19 tests failed.
FAILED: dtest-large.consistency_test.TestAccuracy.test_network_topology_strategy_each_quorum_counters
FAILED: dtest-novnode.materialized_views_test.TestMaterializedViewsConsistency.test_multi_partition_consistent_reads_after_write
FAILED: dtest-novnode.cqlsh_tests.test_cqlsh_copy.TestCqlshCopy.test_bulk_round_trip_with_timeouts
FAILED: dtest-novnode.snapshot_test.TestArchiveCommitlog.test_archive_commitlog
FAILED: dtest-novnode.cqlsh_tests.test_cqlsh_copy.TestCqlshCopy.test_bulk_round_trip_default
FAILED: dtest-offheap.paging_test.TestPagingData.test_paging_with_filtering_on_partition_key_with_limit
FAILED: dtest-offheap.cqlsh_tests.test_cqlsh_copy.TestCqlshCopy.test_bulk_round_trip_with_single_core
FAILED: dtest-offheap.topology_test.TestTopology.test_decommissioned_node_cant_rejoin
FAILED: dtest-offheap.cqlsh_tests.test_cqlsh_copy.TestCqlshCopy.test_bulk_round_trip_with_backoff
FAILED: dtest-offheap.bootstrap_test.TestBootstrap.test_simultaneous_bootstrap
FAILED: dtest-offheap.snapshot_test.TestArchiveCommitlog.test_archive_commitlog_restore_skip_by_position
FAILED: dtest-offheap.cqlsh_tests.test_cqlsh_copy.TestCqlshCopy.test_bulk_round_trip_non_prepared_statements
FAILED: dtest-offheap.repair_tests.repair_test.TestRepair.test_dc_repair
FAILED: dtest-offheap.cqlsh_tests.test_cqlsh_copy.TestCqlshCopy.test_bulk_round_trip_with_single_core
FAILED: dtest-offheap.topology_test.TestTopology.test_decommissioned_node_cant_rejoin
FAILED: dtest-offheap.cqlsh_tests.test_cqlsh_copy.TestCqlshCopy.test_bulk_round_trip_with_backoff
FAILED: dtest-upgrade.upgrade_tests.upgrade_through_versions_test.TestProtoV3Upgrade_AllVersions_EndsAt_Trunk_HEAD.test_parallel_upgrade_with_internode_ssl
FAILED: dtest-upgrade.upgrade_tests.upgrade_through_versions_test.TestProtoV5Upgrade_AllVersions_RandomPartitioner_EndsAt_Trunk_HEAD.test_parallel_upgrade
FAILED: dtest.replace_address_test.TestReplaceAddress.test_unsafe_replace
-------------------------------------------------------------------------------
For complete test report and logs see https://nightlies.apache.org/cassandra/Cassandra-trunk/1742/