You are viewing a plain text version of this content. The canonical link for it is here.
Posted to notifications@maven.apache.org by Apache Jenkins Server <je...@builds.apache.org> on 2019/07/06 15:52:12 UTC

Build failed in Jenkins: Maven TLP » maven-surefire » maven2surefire-jvm-communication #1

See https://builds.apache.org/job/maven-box/job/maven-surefire/job/maven2surefire-jvm-communication/1/

No changes.

No tests ran.

Build log:
[...truncated 877 lines...]
[2019-07-06T15:51:59.165Z]  > git reset --hard # timeout=10
[Pipeline] archiveArtifacts
[2019-07-06T15:51:59.578Z] Recording test results
[2019-07-06T15:51:59.716Z] Archiving artifacts
[Pipeline] fileExists
[Pipeline] cleanWs
[Pipeline] }
[Pipeline] // stage
[Pipeline] echo
[2019-07-06T15:52:00.030Z] Setting JDK for testing JDK 1.8 (latest)
[Pipeline] stage
[Pipeline] { (build windows-jdk7-maven3.6.x)
[Pipeline] fileExists
[Pipeline] isUnix
[Pipeline] tool
[Pipeline] tool
[Pipeline] tool
[Pipeline] tool
[2019-07-06T15:52:00.190Z] [WS-CLEANUP] Deleting project workspace...
[2019-07-06T15:52:00.190Z] [WS-CLEANUP] Deferred wipeout is used...
[Pipeline] withEnv
[Pipeline] {
[Pipeline] bat
[2019-07-06T15:52:00.496Z] [WS-CLEANUP] done
[Pipeline] }
[Pipeline] // ws
[Pipeline] }
[2019-07-06T15:52:00.566Z] 
[2019-07-06T15:52:00.566Z] C:\Users\jenkins\AppData\Local\Temp\2\jenkins-maven-box-maven-surefire-maven2surefire-jvm-communication-1@3>echo JAVA_HOME=f:\\jenkins\\tools\\java\\latest1.8, JAVA_HOME_IT=f:\\jenkins\\tools\\java\\latest1.7, PATH=F:\\jenkins\\tools\\maven\\apache-maven-3.6.0\bin;f:\\jenkins\\tools\\java\\latest1.8\bin;C:\Program Files (x86)\Common Files\Oracle\Java\javapath;C:\ProgramData\Oracle\Java\javapath;C:\Windows\system32;C:\Windows;C:\Windows\System32\Wbem;C:\Windows\System32\WindowsPowerShell\v1.0\;C:\Program Files\Amazon\cfn-bootstrap\;C:\Program Files\Puppet Labs\Puppet\bin;c:\Program Files (x86)\Subversion\bin;C:\Program Files\Git\cmd;C:\Program Files\Microsoft SQL Server\130\Tools\Binn\;C:\Users\Administrator\.dnx\bin;C:\Program Files\Microsoft DNX\Dnvm\;C:\Program Files (x86)\Windows Kits\8.1\Windows Performance Toolkit\;F:\Program Files\CMake\bin;C:\Users\Administrator\AppData\Local\Microsoft\WindowsApps;F:\jenkins\tools\gpg4win\3.1.5\bin; 
[2019-07-06T15:52:00.566Z] JAVA_HOME=f:\\jenkins\\tools\\java\\latest1.8, JAVA_HOME_IT=f:\\jenkins\\tools\\java\\latest1.7, PATH=F:\\jenkins\\tools\\maven\\apache-maven-3.6.0\bin;f:\\jenkins\\tools\\java\\latest1.8\bin;C:\Program Files (x86)\Common Files\Oracle\Java\javapath;C:\ProgramData\Oracle\Java\javapath;C:\Windows\system32;C:\Windows;C:\Windows\System32\Wbem;C:\Windows\System32\WindowsPowerShell\v1.0\;C:\Program Files\Amazon\cfn-bootstrap\;C:\Program Files\Puppet Labs\Puppet\bin;c:\Program Files (x86)\Subversion\bin;C:\Program Files\Git\cmd;C:\Program Files\Microsoft SQL Server\130\Tools\Binn\;C:\Users\Administrator\.dnx\bin;C:\Program Files\Microsoft DNX\Dnvm\;C:\Program Files (x86)\Windows Kits\8.1\Windows Performance Toolkit\;F:\Program Files\CMake\bin;C:\Users\Administrator\AppData\Local\Microsoft\WindowsApps;F:\jenkins\tools\gpg4win\3.1.5\bin;
[Pipeline] // timestamps
[Pipeline] }
[Pipeline] // node
[Pipeline] }
[Pipeline] bat
[Pipeline] archiveArtifacts
[2019-07-06T15:51:59.959Z] fatal: bad object 231a3fd4025bb4364e3accacf0ac0ee6e2191219
[2019-07-06T15:52:00.966Z] Archiving artifacts
[2019-07-06T15:52:01.033Z] 
[2019-07-06T15:52:01.033Z] C:\Users\jenkins\AppData\Local\Temp\2\jenkins-maven-box-maven-surefire-maven2surefire-jvm-communication-1@3>mvn clean install -e -V -B -nsu -P run-its -Dfailsafe-integration-test-port=8030 -Dfailsafe-integration-test-stop-port=8031 -Djacoco.skip=true "-Dmaven.repo.local=C:\Users\jenkins\AppData\Local\Temp\2\jenkins-maven-box-maven-surefire-maven2surefire-jvm-communication-1@3\.m2" "-Djdk.home=f:\\jenkins\\tools\\java\\latest1.7" 
[Pipeline] cleanWs
[2019-07-06T15:52:01.456Z] [WS-CLEANUP] Deleting project workspace...
[2019-07-06T15:52:01.456Z] [WS-CLEANUP] Deferred wipeout is used...
[2019-07-06T15:51:59.543Z]  > git clean -fdx # timeout=10
[2019-07-06T15:52:01.773Z] [WS-CLEANUP] done
[Pipeline] }
[Pipeline] // ws
[Pipeline] }
[Pipeline] // timestamps
[Pipeline] }
[Pipeline] // node
[Pipeline] }
[2019-07-06T15:52:06.382Z] Apache Maven 3.6.0 (97c98ec64a1fdfee7767ce5ffb20918da4f719f3; 2018-10-24T11:41:47-07:00)
[2019-07-06T15:52:06.383Z] Maven home: F:\jenkins\tools\maven\apache-maven-3.6.0\bin\..
[2019-07-06T15:52:06.383Z] Java version: 1.8.0_152, vendor: Oracle Corporation, runtime: f:\jenkins\tools\java\latest1.8\jre
[2019-07-06T15:52:06.383Z] Default locale: en_US, platform encoding: Cp1252
[2019-07-06T15:52:06.383Z] OS name: "windows server 2016", version: "10.0", arch: "amd64", family: "windows"
[2019-07-06T15:52:07.140Z] Apache Maven 3.6.0 (97c98ec64a1fdfee7767ce5ffb20918da4f719f3; 2018-10-24T11:41:47-07:00)
[2019-07-06T15:52:07.140Z] Maven home: F:\jenkins\tools\maven\apache-maven-3.6.0\bin\..
[2019-07-06T15:52:07.140Z] Java version: 1.8.0_152, vendor: Oracle Corporation, runtime: f:\jenkins\tools\java\latest1.8\jre
[2019-07-06T15:52:07.140Z] Default locale: en_US, platform encoding: Cp1252
[2019-07-06T15:52:07.140Z] OS name: "windows server 2016", version: "10.0", arch: "amd64", family: "windows"
[2019-07-06T15:52:07.372Z] Apache Maven 3.6.0 (97c98ec64a1fdfee7767ce5ffb20918da4f719f3; 2018-10-24T11:41:47-07:00)
[2019-07-06T15:52:07.372Z] Maven home: F:\jenkins\tools\maven\apache-maven-3.6.0\bin\..
[2019-07-06T15:52:07.372Z] Java version: 1.8.0_152, vendor: Oracle Corporation, runtime: f:\jenkins\tools\java\latest1.8\jre
[2019-07-06T15:52:07.372Z] Default locale: en_US, platform encoding: Cp1252
[2019-07-06T15:52:07.372Z] OS name: "windows server 2016", version: "10.0", arch: "amd64", family: "windows"
[2019-07-06T15:52:07.961Z] [INFO] Error stacktraces are turned on.
[2019-07-06T15:52:07.961Z] [INFO] Scanning for projects...
[2019-07-06T15:52:08.109Z] [INFO] Error stacktraces are turned on.
[2019-07-06T15:52:08.110Z] [INFO] Scanning for projects...
[2019-07-06T15:52:08.339Z] [INFO] Error stacktraces are turned on.
[2019-07-06T15:52:08.339Z] [INFO] Scanning for projects...
[2019-07-06T15:52:08.933Z] [INFO] Downloading from central: https://repo.maven.apache.org/maven2/org/apache/maven/maven-parent/33/maven-parent-33.pom
[2019-07-06T15:52:08.953Z] [INFO] Downloading from central: https://repo.maven.apache.org/maven2/org/apache/maven/maven-parent/33/maven-parent-33.pom
[2019-07-06T15:52:09.080Z] [INFO] Downloading from central: https://repo.maven.apache.org/maven2/org/apache/maven/maven-parent/33/maven-parent-33.pom
[2019-07-06T15:52:10.353Z] [INFO] Downloaded from central: https://repo.maven.apache.org/maven2/org/apache/maven/maven-parent/33/maven-parent-33.pom (44 kB at 33 kB/s)
[2019-07-06T15:52:10.353Z] [INFO] Downloading from central: https://repo.maven.apache.org/maven2/org/apache/apache/21/apache-21.pom
[2019-07-06T15:52:10.353Z] [INFO] Downloaded from central: https://repo.maven.apache.org/maven2/org/apache/apache/21/apache-21.pom (17 kB at 252 kB/s)
[2019-07-06T15:52:10.375Z] [INFO] Downloaded from central: https://repo.maven.apache.org/maven2/org/apache/maven/maven-parent/33/maven-parent-33.pom (44 kB at 33 kB/s)
[2019-07-06T15:52:10.375Z] [INFO] Downloading from central: https://repo.maven.apache.org/maven2/org/apache/apache/21/apache-21.pom
[2019-07-06T15:52:10.375Z] [INFO] Downloaded from central: https://repo.maven.apache.org/maven2/org/apache/apache/21/apache-21.pom (17 kB at 248 kB/s)
[2019-07-06T15:52:10.503Z] [INFO] Downloaded from central: https://repo.maven.apache.org/maven2/org/apache/maven/maven-parent/33/maven-parent-33.pom (44 kB at 33 kB/s)
[2019-07-06T15:52:10.503Z] [INFO] Downloading from central: https://repo.maven.apache.org/maven2/org/apache/apache/21/apache-21.pom
[2019-07-06T15:52:10.503Z] [INFO] Downloaded from central: https://repo.maven.apache.org/maven2/org/apache/apache/21/apache-21.pom (17 kB at 244 kB/s)
[2019-07-06T15:52:11.330Z] [ERROR] [ERROR] Some problems were encountered while processing the POMs:
[2019-07-06T15:52:11.330Z] [ERROR] Child module C:\Users\jenkins\AppData\Local\Temp\2\jenkins-maven-box-maven-surefire-maven2surefire-jvm-communication-1\surefire-providers\surefire-provider-api of C:\Users\jenkins\AppData\Local\Temp\2\jenkins-maven-box-maven-surefire-maven2surefire-jvm-communication-1\surefire-providers\pom.xml does not exist @ 
[2019-07-06T15:52:11.330Z]  @ 
[2019-07-06T15:52:11.330Z] [ERROR] The build could not read 1 project -> [Help 1]
[2019-07-06T15:52:11.330Z] org.apache.maven.project.ProjectBuildingException: Some problems were encountered while processing the POMs:
[2019-07-06T15:52:11.330Z] [ERROR] Child module C:\Users\jenkins\AppData\Local\Temp\2\jenkins-maven-box-maven-surefire-maven2surefire-jvm-communication-1\surefire-providers\surefire-provider-api of C:\Users\jenkins\AppData\Local\Temp\2\jenkins-maven-box-maven-surefire-maven2surefire-jvm-communication-1\surefire-providers\pom.xml does not exist @ 
[2019-07-06T15:52:11.330Z] 
[2019-07-06T15:52:11.330Z]     at org.apache.maven.project.DefaultProjectBuilder.build (DefaultProjectBuilder.java:383)
[2019-07-06T15:52:11.330Z]     at org.apache.maven.graph.DefaultGraphBuilder.collectProjects (DefaultGraphBuilder.java:414)
[2019-07-06T15:52:11.330Z]     at org.apache.maven.graph.DefaultGraphBuilder.getProjectsForMavenReactor (DefaultGraphBuilder.java:405)
[2019-07-06T15:52:11.330Z]     at org.apache.maven.graph.DefaultGraphBuilder.build (DefaultGraphBuilder.java:82)
[2019-07-06T15:52:11.330Z]     at org.apache.maven.DefaultMaven.buildGraph (DefaultMaven.java:507)
[2019-07-06T15:52:11.330Z]     at org.apache.maven.DefaultMaven.doExecute (DefaultMaven.java:219)
[2019-07-06T15:52:11.330Z]     at org.apache.maven.DefaultMaven.doExecute (DefaultMaven.java:192)
[2019-07-06T15:52:11.360Z] [ERROR] [ERROR] Some problems were encountered while processing the POMs:
[2019-07-06T15:52:11.360Z] [ERROR] Child module C:\Users\jenkins\AppData\Local\Temp\2\jenkins-maven-box-maven-surefire-maven2surefire-jvm-communication-1@3\surefire-providers\surefire-provider-api of C:\Users\jenkins\AppData\Local\Temp\2\jenkins-maven-box-maven-surefire-maven2surefire-jvm-communication-1@3\surefire-providers\pom.xml does not exist @ 
[2019-07-06T15:52:11.360Z]  @ 
[2019-07-06T15:52:11.360Z] [ERROR] The build could not read 1 project -> [Help 1]
[2019-07-06T15:52:11.360Z] org.apache.maven.project.ProjectBuildingException: Some problems were encountered while processing the POMs:
[2019-07-06T15:52:11.360Z] [ERROR] Child module C:\Users\jenkins\AppData\Local\Temp\2\jenkins-maven-box-maven-surefire-maven2surefire-jvm-communication-1@3\surefire-providers\surefire-provider-api of C:\Users\jenkins\AppData\Local\Temp\2\jenkins-maven-box-maven-surefire-maven2surefire-jvm-communication-1@3\surefire-providers\pom.xml does not exist @ 
[2019-07-06T15:52:11.360Z] 
[2019-07-06T15:52:11.360Z]     at org.apache.maven.project.DefaultProjectBuilder.build (DefaultProjectBuilder.java:383)
[2019-07-06T15:52:11.360Z]     at org.apache.maven.graph.DefaultGraphBuilder.collectProjects (DefaultGraphBuilder.java:414)
[2019-07-06T15:52:11.360Z]     at org.apache.maven.graph.DefaultGraphBuilder.getProjectsForMavenReactor (DefaultGraphBuilder.java:405)
[2019-07-06T15:52:11.360Z]     at org.apache.maven.graph.DefaultGraphBuilder.build (DefaultGraphBuilder.java:82)
[2019-07-06T15:52:11.360Z]     at org.apache.maven.DefaultMaven.buildGraph (DefaultMaven.java:507)
[2019-07-06T15:52:11.360Z]     at org.apache.maven.DefaultMaven.doExecute (DefaultMaven.java:219)
[2019-07-06T15:52:11.360Z]     at org.apache.maven.DefaultMaven.doExecute (DefaultMaven.java:192)
[2019-07-06T15:52:11.360Z]     at org.apache.maven.DefaultMaven.execute (DefaultMaven.java:105)
[2019-07-06T15:52:11.360Z]     at org.apache.maven.cli.MavenCli.execute (MavenCli.java:956)
[2019-07-06T15:52:11.360Z]     at org.apache.maven.cli.MavenCli.doMain (MavenCli.java:288)
[2019-07-06T15:52:11.360Z]     at org.apache.maven.cli.MavenCli.main (MavenCli.java:192)
[2019-07-06T15:52:11.360Z]     at sun.reflect.NativeMethodAccessorImpl.invoke0 (Native Method)
[2019-07-06T15:52:11.360Z]     at sun.reflect.NativeMethodAccessorImpl.invoke (NativeMethodAccessorImpl.java:62)
[2019-07-06T15:52:11.360Z]     at sun.reflect.DelegatingMethodAccessorImpl.invoke (DelegatingMethodAccessorImpl.java:43)
[2019-07-06T15:52:11.360Z]     at java.lang.reflect.Method.invoke (Method.java:498)
[2019-07-06T15:52:11.360Z]     at org.codehaus.plexus.classworlds.launcher.Launcher.launchEnhanced (Launcher.java:289)
[2019-07-06T15:52:11.360Z]     at org.codehaus.plexus.classworlds.launcher.Launcher.launch (Launcher.java:229)
[2019-07-06T15:52:11.360Z]     at org.codehaus.plexus.classworlds.launcher.Launcher.mainWithExitCode (Launcher.java:415)
[2019-07-06T15:52:11.360Z]     at org.codehaus.plexus.classworlds.launcher.Launcher.main (Launcher.java:356)
[2019-07-06T15:52:11.360Z] [ERROR]   
[2019-07-06T15:52:11.360Z] [ERROR]   The project org.apache.maven.surefire:surefire-providers:3.0.0-SNAPSHOT (C:\Users\jenkins\AppData\Local\Temp\2\jenkins-maven-box-maven-surefire-maven2surefire-jvm-communication-1@3\surefire-providers\pom.xml) has 1 error
[2019-07-06T15:52:11.360Z] [ERROR]     Child module C:\Users\jenkins\AppData\Local\Temp\2\jenkins-maven-box-maven-surefire-maven2surefire-jvm-communication-1@3\surefire-providers\surefire-provider-api of C:\Users\jenkins\AppData\Local\Temp\2\jenkins-maven-box-maven-surefire-maven2surefire-jvm-communication-1@3\surefire-providers\pom.xml does not exist
[2019-07-06T15:52:11.360Z] [ERROR] 
[2019-07-06T15:52:11.360Z] [ERROR] Re-run Maven using the -X switch to enable full debug logging.
[2019-07-06T15:52:11.360Z] [ERROR] 
[2019-07-06T15:52:11.360Z] [ERROR] For more information about the errors and possible solutions, please read the following articles:
[2019-07-06T15:52:11.360Z] [ERROR] [Help 1] http://cwiki.apache.org/confluence/display/MAVEN/ProjectBuildingException
[Pipeline] }
[Pipeline] // withEnv
[Pipeline] }
[Pipeline] // stage
[Pipeline] fileExists
[2019-07-06T15:52:11.487Z] [ERROR] [ERROR] Some problems were encountered while processing the POMs:
[2019-07-06T15:52:11.487Z] [ERROR] Child module C:\Users\jenkins\AppData\Local\Temp\2\jenkins-maven-box-maven-surefire-maven2surefire-jvm-communication-1@2\surefire-providers\surefire-provider-api of C:\Users\jenkins\AppData\Local\Temp\2\jenkins-maven-box-maven-surefire-maven2surefire-jvm-communication-1@2\surefire-providers\pom.xml does not exist @ 
[2019-07-06T15:52:11.487Z]  @ 
[2019-07-06T15:52:11.487Z] [ERROR] The build could not read 1 project -> [Help 1]
[2019-07-06T15:52:11.487Z] org.apache.maven.project.ProjectBuildingException: Some problems were encountered while processing the POMs:
[2019-07-06T15:52:11.487Z] [ERROR] Child module C:\Users\jenkins\AppData\Local\Temp\2\jenkins-maven-box-maven-surefire-maven2surefire-jvm-communication-1@2\surefire-providers\surefire-provider-api of C:\Users\jenkins\AppData\Local\Temp\2\jenkins-maven-box-maven-surefire-maven2surefire-jvm-communication-1@2\surefire-providers\pom.xml does not exist @ 
[2019-07-06T15:52:11.487Z] 
[2019-07-06T15:52:11.487Z]     at org.apache.maven.project.DefaultProjectBuilder.build (DefaultProjectBuilder.java:383)
[2019-07-06T15:52:11.487Z]     at org.apache.maven.graph.DefaultGraphBuilder.collectProjects (DefaultGraphBuilder.java:414)
[2019-07-06T15:52:11.487Z]     at org.apache.maven.graph.DefaultGraphBuilder.getProjectsForMavenReactor (DefaultGraphBuilder.java:405)
[2019-07-06T15:52:11.487Z]     at org.apache.maven.graph.DefaultGraphBuilder.build (DefaultGraphBuilder.java:82)
[2019-07-06T15:52:11.487Z]     at org.apache.maven.DefaultMaven.buildGraph (DefaultMaven.java:507)
[2019-07-06T15:52:11.487Z]     at org.apache.maven.DefaultMaven.doExecute (DefaultMaven.java:219)
[2019-07-06T15:52:11.487Z]     at org.apache.maven.DefaultMaven.doExecute (DefaultMaven.java:192)
[2019-07-06T15:52:11.487Z]     at org.apache.maven.DefaultMaven.execute (DefaultMaven.java:105)
[2019-07-06T15:52:11.487Z]     at org.apache.maven.cli.MavenCli.execute (MavenCli.java:956)
[2019-07-06T15:52:11.487Z]     at org.apache.maven.cli.MavenCli.doMain (MavenCli.java:288)
[2019-07-06T15:52:11.487Z]     at org.apache.maven.cli.MavenCli.main (MavenCli.java:192)
[2019-07-06T15:52:11.487Z]     at sun.reflect.NativeMethodAccessorImpl.invoke0 (Native Method)
[2019-07-06T15:52:11.487Z]     at sun.reflect.NativeMethodAccessorImpl.invoke (NativeMethodAccessorImpl.java:62)
[2019-07-06T15:52:11.487Z]     at sun.reflect.DelegatingMethodAccessorImpl.invoke (DelegatingMethodAccessorImpl.java:43)
[2019-07-06T15:52:11.487Z]     at java.lang.reflect.Method.invoke (Method.java:498)
[2019-07-06T15:52:11.487Z]     at org.codehaus.plexus.classworlds.launcher.Launcher.launchEnhanced (Launcher.java:289)
[2019-07-06T15:52:11.487Z]     at org.codehaus.plexus.classworlds.launcher.Launcher.launch (Launcher.java:229)
[2019-07-06T15:52:11.487Z]     at org.codehaus.plexus.classworlds.launcher.Launcher.mainWithExitCode (Launcher.java:415)
[2019-07-06T15:52:11.487Z]     at org.codehaus.plexus.classworlds.launcher.Launcher.main (Launcher.java:356)
[2019-07-06T15:52:11.487Z] [ERROR]   
[2019-07-06T15:52:11.487Z] [ERROR]   The project org.apache.maven.surefire:surefire-providers:3.0.0-SNAPSHOT (C:\Users\jenkins\AppData\Local\Temp\2\jenkins-maven-box-maven-surefire-maven2surefire-jvm-communication-1@2\surefire-providers\pom.xml) has 1 error
[2019-07-06T15:52:11.487Z] [ERROR]     Child module C:\Users\jenkins\AppData\Local\Temp\2\jenkins-maven-box-maven-surefire-maven2surefire-jvm-communication-1@2\surefire-providers\surefire-provider-api of C:\Users\jenkins\AppData\Local\Temp\2\jenkins-maven-box-maven-surefire-maven2surefire-jvm-communication-1@2\surefire-providers\pom.xml does not exist
[2019-07-06T15:52:11.487Z] [ERROR] 
[2019-07-06T15:52:11.487Z] [ERROR] Re-run Maven using the -X switch to enable full debug logging.
[2019-07-06T15:52:11.487Z] [ERROR] 
[2019-07-06T15:52:11.487Z] [ERROR] For more information about the errors and possible solutions, please read the following articles:
[2019-07-06T15:52:11.487Z] [ERROR] [Help 1] http://cwiki.apache.org/confluence/display/MAVEN/ProjectBuildingException
[Pipeline] fileExists
[Pipeline] archiveArtifacts
[Pipeline] }
[2019-07-06T15:52:11.530Z] Archiving artifacts
[Pipeline] // withEnv
[Pipeline] }
[Pipeline] // stage
[Pipeline] fileExists
[Pipeline] cleanWs
[2019-07-06T15:52:11.597Z]     at org.apache.maven.DefaultMaven.execute (DefaultMaven.java:105)
[2019-07-06T15:52:11.597Z]     at org.apache.maven.cli.MavenCli.execute (MavenCli.java:956)
[2019-07-06T15:52:11.597Z]     at org.apache.maven.cli.MavenCli.doMain (MavenCli.java:288)
[2019-07-06T15:52:11.597Z]     at org.apache.maven.cli.MavenCli.main (MavenCli.java:192)
[2019-07-06T15:52:11.597Z]     at sun.reflect.NativeMethodAccessorImpl.invoke0 (Native Method)
[2019-07-06T15:52:11.597Z]     at sun.reflect.NativeMethodAccessorImpl.invoke (NativeMethodAccessorImpl.java:62)
[2019-07-06T15:52:11.597Z]     at sun.reflect.DelegatingMethodAccessorImpl.invoke (DelegatingMethodAccessorImpl.java:43)
[2019-07-06T15:52:11.597Z]     at java.lang.reflect.Method.invoke (Method.java:498)
[2019-07-06T15:52:11.597Z]     at org.codehaus.plexus.classworlds.launcher.Launcher.launchEnhanced (Launcher.java:289)
[2019-07-06T15:52:11.597Z]     at org.codehaus.plexus.classworlds.launcher.Launcher.launch (Launcher.java:229)
[2019-07-06T15:52:11.597Z]     at org.codehaus.plexus.classworlds.launcher.Launcher.mainWithExitCode (Launcher.java:415)
[2019-07-06T15:52:11.597Z]     at org.codehaus.plexus.classworlds.launcher.Launcher.main (Launcher.java:356)
[2019-07-06T15:52:11.597Z] [ERROR]   
[2019-07-06T15:52:11.597Z] [ERROR]   The project org.apache.maven.surefire:surefire-providers:3.0.0-SNAPSHOT (C:\Users\jenkins\AppData\Local\Temp\2\jenkins-maven-box-maven-surefire-maven2surefire-jvm-communication-1\surefire-providers\pom.xml) has 1 error
[2019-07-06T15:52:11.597Z] [ERROR]     Child module C:\Users\jenkins\AppData\Local\Temp\2\jenkins-maven-box-maven-surefire-maven2surefire-jvm-communication-1\surefire-providers\surefire-provider-api of C:\Users\jenkins\AppData\Local\Temp\2\jenkins-maven-box-maven-surefire-maven2surefire-jvm-communication-1\surefire-providers\pom.xml does not exist
[2019-07-06T15:52:11.597Z] [ERROR] 
[2019-07-06T15:52:11.597Z] [ERROR] Re-run Maven using the -X switch to enable full debug logging.
[2019-07-06T15:52:11.597Z] [ERROR] 
[2019-07-06T15:52:11.597Z] [ERROR] For more information about the errors and possible solutions, please read the following articles:
[2019-07-06T15:52:11.597Z] [ERROR] [Help 1] http://cwiki.apache.org/confluence/display/MAVEN/ProjectBuildingException
[2019-07-06T15:52:11.609Z] [WS-CLEANUP] Deleting project workspace...
[2019-07-06T15:52:11.609Z] [WS-CLEANUP] Deferred wipeout is used...
[Pipeline] fileExists
[2019-07-06T15:52:11.632Z] [WS-CLEANUP] done
[Pipeline] archiveArtifacts
[Pipeline] }
[Pipeline] }
[2019-07-06T15:52:11.652Z] Archiving artifacts
[Pipeline] // ws
[Pipeline] // withEnv
[Pipeline] }
[Pipeline] cleanWs
[Pipeline] }
[2019-07-06T15:52:11.726Z] [WS-CLEANUP] Deleting project workspace...
[2019-07-06T15:52:11.726Z] [WS-CLEANUP] Deferred wipeout is used...
[Pipeline] // timestamps
[Pipeline] // stage
[2019-07-06T15:52:11.747Z] [WS-CLEANUP] done
[Pipeline] fileExists
[Pipeline] }
[Pipeline] // node
[Pipeline] }
[Pipeline] fileExists
[Pipeline] }
[Pipeline] // ws
[Pipeline] archiveArtifacts
[Pipeline] }
[2019-07-06T15:52:11.868Z] Archiving artifacts
[Pipeline] // timestamps
[Pipeline] }
[Pipeline] // node
[Pipeline] }
[Pipeline] cleanWs
[2019-07-06T15:52:11.952Z] [WS-CLEANUP] Deleting project workspace...
[2019-07-06T15:52:11.952Z] [WS-CLEANUP] Deferred wipeout is used...
[2019-07-06T15:52:11.983Z] [WS-CLEANUP] done
[Pipeline] }
[Pipeline] // ws
[Pipeline] }
[Pipeline] // timestamps
[Pipeline] }
[Pipeline] // node
[Pipeline] }
[Pipeline] // parallel
[Pipeline] echo
Build result: FAILURE
[Pipeline] jiraIssueSelector
[Pipeline] emailext

Build succeeded in Jenkins: Maven TLP » maven-surefire » maven2surefire-jvm-communication #2

Posted by Apache Jenkins Server <je...@builds.apache.org>.
See https://builds.apache.org/job/maven-box/job/maven-surefire/job/maven2surefire-jvm-communication/2/

Changes:

* Add JDK 14 (latest)

All tests passed