You are viewing a plain text version of this content. The canonical link for it is here.
Posted to dev@sling.apache.org by Apache Jenkins Server <je...@builds.apache.org> on 2022/05/12 11:40:06 UTC

[Jenkins] Sling » Modules » sling-org-apache-sling-starter » master #255 is BROKEN

Please see https://ci-builds.apache.org/job/Sling/job/modules/job/sling-org-apache-sling-starter/job/master/255/ for details.

No further emails will be sent until the status of the build is changed.
Build log follows below:

[...truncated 2296 lines...]
[INFO] Tests run: 1, Failures: 0, Errors: 0, Skipped: 0, Time elapsed: 0.005 s - in org.apache.sling.launchpad.webapp.integrationtest.servlets.post.PostResponseCreatorTest
[INFO] Running org.apache.sling.launchpad.webapp.integrationtest.SlingResourceTypeRenderingTest
[INFO] Tests run: 9, Failures: 0, Errors: 0, Skipped: 0, Time elapsed: 1.11 s - in org.apache.sling.launchpad.webapp.integrationtest.SlingResourceTypeRenderingTest
[INFO] Running org.apache.sling.launchpad.webapp.integrationtest.ResourceSuperTypeTest
[INFO] Tests run: 2, Failures: 0, Errors: 0, Skipped: 0, Time elapsed: 0.506 s - in org.apache.sling.launchpad.webapp.integrationtest.ResourceSuperTypeTest
[INFO] Running org.apache.sling.launchpad.webapp.integrationtest.ImmediateScriptActivationTest
[INFO] Tests run: 2, Failures: 0, Errors: 0, Skipped: 0, Time elapsed: 1.763 s - in org.apache.sling.launchpad.webapp.integrationtest.ImmediateScriptActivationTest
[INFO] Running org.apache.sling.launchpad.webapp.integrationtest.issues.SLING2082Test
[INFO] Tests run: 2, Failures: 0, Errors: 0, Skipped: 0, Time elapsed: 0.01 s - in org.apache.sling.launchpad.webapp.integrationtest.issues.SLING2082Test
[INFO] Running org.apache.sling.launchpad.webapp.integrationtest.RedirectTest
[INFO] Tests run: 6, Failures: 0, Errors: 0, Skipped: 0, Time elapsed: 0.153 s - in org.apache.sling.launchpad.webapp.integrationtest.RedirectTest
[INFO] Running org.apache.sling.launchpad.webapp.integrationtest.servlets.post.PostServletDeleteParentTest
[INFO] Tests run: 6, Failures: 0, Errors: 0, Skipped: 0, Time elapsed: 0.271 s - in org.apache.sling.launchpad.webapp.integrationtest.servlets.post.PostServletDeleteParentTest
[INFO] Running org.apache.sling.launchpad.webapp.integrationtest.ContentLoaderMiscPropertyTest
[INFO] Tests run: 1, Failures: 0, Errors: 0, Skipped: 0, Time elapsed: 0.002 s - in org.apache.sling.launchpad.webapp.integrationtest.ContentLoaderMiscPropertyTest
[INFO] Running org.apache.sling.launchpad.webapp.integrationtest.runmodes.InactiveRunModeTest
[INFO] Tests run: 2, Failures: 0, Errors: 0, Skipped: 0, Time elapsed: 0.024 s - in org.apache.sling.launchpad.webapp.integrationtest.runmodes.InactiveRunModeTest
[INFO] Running org.apache.sling.launchpad.webapp.integrationtest.DavExDisabledAnonAccessTest
[DEBUG] [ServiceReference 734 from bundle 112 : org.apache.sling.jcr.davex:1.3.10 ref=[javax.servlet.Servlet] properties={objectClass=[javax.servlet.Servlet], osgi.http.whiteboard.context.select=(osgi.http.whiteboard.context.name=DavExAuthHttpContext), osgi.http.whiteboard.servlet.pattern=/server/*, service.bundleid=112, service.description=Sling JcrRemoting Servlet, service.id=734, service.scope=singleton, service.vendor=The Apache Software Foundation, servlet.init.createAbsoluteURI=true, servlet.init.csrf-protection=disabled, servlet.init.protectedhandlers-config=org.apache.jackrabbit.server.remoting.davex.AclRemoveHandler, servlet.init.resource-path-prefix=/server, sling.auth.requirements=-/server}] Ignoring unmatching Servlet service
[DEBUG] [ServiceReference 734 from bundle 112 : org.apache.sling.jcr.davex:1.3.10 ref=[javax.servlet.Servlet] properties={objectClass=[javax.servlet.Servlet], osgi.http.whiteboard.context.select=(osgi.http.whiteboard.context.name=DavExAuthHttpContext), osgi.http.whiteboard.servlet.pattern=/server/*, service.bundleid=112, service.description=Sling JcrRemoting Servlet, service.id=734, service.scope=singleton, service.vendor=The Apache Software Foundation, servlet.init.createAbsoluteURI=true, servlet.init.csrf-protection=disabled, servlet.init.protectedhandlers-config=org.apache.jackrabbit.server.remoting.davex.AclRemoveHandler, servlet.init.resource-path-prefix=/server, sling.auth.requirements=-/server}] Ignoring unmatching Servlet service
[DEBUG] [ServiceReference 734 from bundle 112 : org.apache.sling.jcr.davex:1.3.10 ref=[javax.servlet.Servlet] properties={objectClass=[javax.servlet.Servlet], osgi.http.whiteboard.context.select=(osgi.http.whiteboard.context.name=DavExAuthHttpContext), osgi.http.whiteboard.servlet.pattern=/server/*, service.bundleid=112, service.description=Sling JcrRemoting Servlet, service.id=734, service.scope=singleton, service.vendor=The Apache Software Foundation, servlet.init.createAbsoluteURI=true, servlet.init.csrf-protection=disabled, servlet.init.protectedhandlers-config=org.apache.jackrabbit.server.remoting.davex.AclRemoveHandler, servlet.init.resource-path-prefix=/server, sling.auth.requirements=-/server}] Ignoring unmatching Servlet service
[DEBUG] [ServiceReference 734 from bundle 112 : org.apache.sling.jcr.davex:1.3.10 ref=[javax.servlet.Servlet] properties={objectClass=[javax.servlet.Servlet], osgi.http.whiteboard.context.select=(osgi.http.whiteboard.context.name=DavExAuthHttpContext), osgi.http.whiteboard.servlet.pattern=/server/*, service.bundleid=112, service.description=Sling JcrRemoting Servlet, service.id=734, service.scope=singleton, service.vendor=The Apache Software Foundation, servlet.init.createAbsoluteURI=true, servlet.init.csrf-protection=disabled, servlet.init.protectedhandlers-config=org.apache.jackrabbit.server.remoting.davex.AclRemoveHandler, servlet.init.resource-path-prefix=/server, sling.auth.requirements=-/server}] Ignoring unmatching Servlet service
[INFO] Tests run: 2, Failures: 0, Errors: 0, Skipped: 0, Time elapsed: 0.693 s - in org.apache.sling.launchpad.webapp.integrationtest.DavExDisabledAnonAccessTest
[INFO] Running org.apache.sling.launchpad.webapp.integrationtest.servlets.post.ReferenceTypeHintTest
[INFO] Tests run: 2, Failures: 0, Errors: 0, Skipped: 0, Time elapsed: 0.513 s - in org.apache.sling.launchpad.webapp.integrationtest.servlets.post.ReferenceTypeHintTest
[INFO] Running org.apache.sling.launchpad.webapp.integrationtest.servlets.post.SlingDateValuesTest
[INFO] Tests run: 2, Failures: 0, Errors: 0, Skipped: 0, Time elapsed: 2.272 s - in org.apache.sling.launchpad.webapp.integrationtest.servlets.post.SlingDateValuesTest
[INFO] Running org.apache.sling.launchpad.webapp.integrationtest.login.AnonymousAccessTest
[INFO] Tests run: 4, Failures: 0, Errors: 0, Skipped: 0, Time elapsed: 0.169 s - in org.apache.sling.launchpad.webapp.integrationtest.login.AnonymousAccessTest
[INFO] Running org.apache.sling.launchpad.webapp.integrationtest.teleporter.TeleportedResourcesSingleTest
[INFO] Tests run: 3, Failures: 0, Errors: 0, Skipped: 0, Time elapsed: 0.55 s - in org.apache.sling.launchpad.webapp.integrationtest.teleporter.TeleportedResourcesSingleTest
[INFO] Running org.apache.sling.launchpad.webapp.integrationtest.installer.InstallManyBundlesTest
[INFO] Tests run: 2, Failures: 0, Errors: 0, Skipped: 0, Time elapsed: 14.981 s - in org.apache.sling.launchpad.webapp.integrationtest.installer.InstallManyBundlesTest
[INFO] Running org.apache.sling.launchpad.webapp.integrationtest.servlets.resolution.RequestUriOptingServletTest
[INFO] Tests run: 4, Failures: 0, Errors: 0, Skipped: 0, Time elapsed: 0.433 s - in org.apache.sling.launchpad.webapp.integrationtest.servlets.resolution.RequestUriOptingServletTest
[INFO] Running org.apache.sling.launchpad.webapp.integrationtest.servlets.post.SlingAutoPropertiesTest
[INFO] Tests run: 3, Failures: 0, Errors: 0, Skipped: 0, Time elapsed: 1.194 s - in org.apache.sling.launchpad.webapp.integrationtest.servlets.post.SlingAutoPropertiesTest
[INFO] Running org.apache.sling.launchpad.webapp.integrationtest.teleporter.TeleportedResourcesFolderTest
[INFO] Tests run: 3, Failures: 0, Errors: 0, Skipped: 0, Time elapsed: 1.085 s - in org.apache.sling.launchpad.webapp.integrationtest.teleporter.TeleportedResourcesFolderTest
[INFO] Running org.apache.sling.launchpad.webapp.integrationtest.teleporter.MultipleRulesTeleporterTest
[INFO] Tests run: 2, Failures: 0, Errors: 0, Skipped: 0, Time elapsed: 0.456 s - in org.apache.sling.launchpad.webapp.integrationtest.teleporter.MultipleRulesTeleporterTest
[INFO] Running org.apache.sling.launchpad.webapp.integrationtest.indexing.FullTextIndexingTest
[ERROR] Tests run: 3, Failures: 2, Errors: 0, Skipped: 0, Time elapsed: 44.077 s <<< FAILURE! - in org.apache.sling.launchpad.webapp.integrationtest.indexing.FullTextIndexingTest
[ERROR] org.apache.sling.launchpad.webapp.integrationtest.indexing.FullTextIndexingTest.testUploadedPdfIsIndexed[1 - another.pdf]  Time elapsed: 15.175 s  <<< FAILURE!
java.lang.AssertionError: RetryLoop failed, condition is false after 15 seconds: A document containing 'some text that we will search for' is found under /var/test-FullTextIndexingTest
	at org.junit.Assert.fail(Assert.java:89)
	at org.apache.sling.testing.tools.retry.RetryLoop.<init>(RetryLoop.java:65)
	at org.apache.sling.launchpad.webapp.integrationtest.indexing.FullTextIndexingTest.testUploadedPdfIsIndexed(FullTextIndexingTest.java:97)
	at java.base/jdk.internal.reflect.NativeMethodAccessorImpl.invoke0(Native Method)
	at java.base/jdk.internal.reflect.NativeMethodAccessorImpl.invoke(NativeMethodAccessorImpl.java:62)
	at java.base/jdk.internal.reflect.DelegatingMethodAccessorImpl.invoke(DelegatingMethodAccessorImpl.java:43)
	at java.base/java.lang.reflect.Method.invoke(Method.java:566)
	at org.junit.runners.model.FrameworkMethod$1.runReflectiveCall(FrameworkMethod.java:59)
	at org.junit.internal.runners.model.ReflectiveCallable.run(ReflectiveCallable.java:12)
	at org.junit.runners.model.FrameworkMethod.invokeExplosively(FrameworkMethod.java:56)
	at org.junit.internal.runners.statements.InvokeMethod.evaluate(InvokeMethod.java:17)
	at org.junit.internal.runners.statements.RunBefores.evaluate(RunBefores.java:26)
	at org.junit.internal.runners.statements.RunAfters.evaluate(RunAfters.java:27)
	at org.junit.runners.ParentRunner$3.evaluate(ParentRunner.java:306)
	at org.junit.runners.BlockJUnit4ClassRunner$1.evaluate(BlockJUnit4ClassRunner.java:100)
	at org.junit.runners.ParentRunner.runLeaf(ParentRunner.java:366)
	at org.junit.runners.BlockJUnit4ClassRunner.runChild(BlockJUnit4ClassRunner.java:103)
	at org.junit.runners.BlockJUnit4ClassRunner.runChild(BlockJUnit4ClassRunner.java:63)
	at org.junit.runners.ParentRunner$4.run(ParentRunner.java:331)
	at org.junit.runners.ParentRunner$1.schedule(ParentRunner.java:79)
	at org.junit.runners.ParentRunner.runChildren(ParentRunner.java:329)
	at org.junit.runners.ParentRunner.access$100(ParentRunner.java:66)
	at org.junit.runners.ParentRunner$2.evaluate(ParentRunner.java:293)
	at org.junit.runners.ParentRunner.run(ParentRunner.java:413)
	at org.junit.runners.Suite.runChild(Suite.java:128)
	at org.junit.runners.Suite.runChild(Suite.java:27)
	at org.junit.runners.ParentRunner$4.run(ParentRunner.java:331)
	at org.junit.runners.ParentRunner$1.schedule(ParentRunner.java:79)
	at org.junit.runners.ParentRunner.runChildren(ParentRunner.java:329)
	at org.junit.runners.ParentRunner.access$100(ParentRunner.java:66)
	at org.junit.runners.ParentRunner$2.evaluate(ParentRunner.java:293)
	at org.junit.runners.ParentRunner$3.evaluate(ParentRunner.java:306)
	at org.junit.runners.ParentRunner.run(ParentRunner.java:413)
	at org.apache.maven.surefire.junit4.JUnit4Provider.execute(JUnit4Provider.java:364)
	at org.apache.maven.surefire.junit4.JUnit4Provider.executeWithRerun(JUnit4Provider.java:272)
	at org.apache.maven.surefire.junit4.JUnit4Provider.executeTestSet(JUnit4Provider.java:237)
	at org.apache.maven.surefire.junit4.JUnit4Provider.invoke(JUnit4Provider.java:158)
	at org.apache.maven.surefire.booter.ForkedBooter.runSuitesInProcess(ForkedBooter.java:428)
	at org.apache.maven.surefire.booter.ForkedBooter.execute(ForkedBooter.java:162)
	at org.apache.maven.surefire.booter.ForkedBooter.run(ForkedBooter.java:562)
	at org.apache.maven.surefire.booter.ForkedBooter.main(ForkedBooter.java:548)

[ERROR] org.apache.sling.launchpad.webapp.integrationtest.indexing.FullTextIndexingTest.testUploadedPdfIsIndexed[2 - french.pdf]  Time elapsed: 15.438 s  <<< FAILURE!
java.lang.AssertionError: RetryLoop failed, condition is false after 15 seconds: A document containing 'un autre PDF pour le test fulltext' is found under /libs/test-FullTextIndexingTest
	at org.junit.Assert.fail(Assert.java:89)
	at org.apache.sling.testing.tools.retry.RetryLoop.<init>(RetryLoop.java:65)
	at org.apache.sling.launchpad.webapp.integrationtest.indexing.FullTextIndexingTest.testUploadedPdfIsIndexed(FullTextIndexingTest.java:97)
	at java.base/jdk.internal.reflect.NativeMethodAccessorImpl.invoke0(Native Method)
	at java.base/jdk.internal.reflect.NativeMethodAccessorImpl.invoke(NativeMethodAccessorImpl.java:62)
	at java.base/jdk.internal.reflect.DelegatingMethodAccessorImpl.invoke(DelegatingMethodAccessorImpl.java:43)
	at java.base/java.lang.reflect.Method.invoke(Method.java:566)
	at org.junit.runners.model.FrameworkMethod$1.runReflectiveCall(FrameworkMethod.java:59)
	at org.junit.internal.runners.model.ReflectiveCallable.run(ReflectiveCallable.java:12)
	at org.junit.runners.model.FrameworkMethod.invokeExplosively(FrameworkMethod.java:56)
	at org.junit.internal.runners.statements.InvokeMethod.evaluate(InvokeMethod.java:17)
	at org.junit.internal.runners.statements.RunBefores.evaluate(RunBefores.java:26)
	at org.junit.internal.runners.statements.RunAfters.evaluate(RunAfters.java:27)
	at org.junit.runners.ParentRunner$3.evaluate(ParentRunner.java:306)
	at org.junit.runners.BlockJUnit4ClassRunner$1.evaluate(BlockJUnit4ClassRunner.java:100)
	at org.junit.runners.ParentRunner.runLeaf(ParentRunner.java:366)
	at org.junit.runners.BlockJUnit4ClassRunner.runChild(BlockJUnit4ClassRunner.java:103)
	at org.junit.runners.BlockJUnit4ClassRunner.runChild(BlockJUnit4ClassRunner.java:63)
	at org.junit.runners.ParentRunner$4.run(ParentRunner.java:331)
	at org.junit.runners.ParentRunner$1.schedule(ParentRunner.java:79)
	at org.junit.runners.ParentRunner.runChildren(ParentRunner.java:329)
	at org.junit.runners.ParentRunner.access$100(ParentRunner.java:66)
	at org.junit.runners.ParentRunner$2.evaluate(ParentRunner.java:293)
	at org.junit.runners.ParentRunner.run(ParentRunner.java:413)
	at org.junit.runners.Suite.runChild(Suite.java:128)
	at org.junit.runners.Suite.runChild(Suite.java:27)
	at org.junit.runners.ParentRunner$4.run(ParentRunner.java:331)
	at org.junit.runners.ParentRunner$1.schedule(ParentRunner.java:79)
	at org.junit.runners.ParentRunner.runChildren(ParentRunner.java:329)
	at org.junit.runners.ParentRunner.access$100(ParentRunner.java:66)
	at org.junit.runners.ParentRunner$2.evaluate(ParentRunner.java:293)
	at org.junit.runners.ParentRunner$3.evaluate(ParentRunner.java:306)
	at org.junit.runners.ParentRunner.run(ParentRunner.java:413)
	at org.apache.maven.surefire.junit4.JUnit4Provider.execute(JUnit4Provider.java:364)
	at org.apache.maven.surefire.junit4.JUnit4Provider.executeWithRerun(JUnit4Provider.java:272)
	at org.apache.maven.surefire.junit4.JUnit4Provider.executeTestSet(JUnit4Provider.java:237)
	at org.apache.maven.surefire.junit4.JUnit4Provider.invoke(JUnit4Provider.java:158)
	at org.apache.maven.surefire.booter.ForkedBooter.runSuitesInProcess(ForkedBooter.java:428)
	at org.apache.maven.surefire.booter.ForkedBooter.execute(ForkedBooter.java:162)
	at org.apache.maven.surefire.booter.ForkedBooter.run(ForkedBooter.java:562)
	at org.apache.maven.surefire.booter.ForkedBooter.main(ForkedBooter.java:548)

[INFO] Running org.apache.sling.launchpad.webapp.integrationtest.servlets.resolution.PathsServletTest
[INFO] Tests run: 2, Failures: 0, Errors: 0, Skipped: 0, Time elapsed: 0.244 s - in org.apache.sling.launchpad.webapp.integrationtest.servlets.resolution.PathsServletTest
[INFO] Running org.apache.sling.launchpad.webapp.integrationtest.servlets.post.PostServletNopTest
[INFO] Tests run: 6, Failures: 0, Errors: 0, Skipped: 0, Time elapsed: 0.036 s - in org.apache.sling.launchpad.webapp.integrationtest.servlets.post.PostServletNopTest
[INFO] Running org.apache.sling.launchpad.webapp.integrationtest.GetWithSuffixTest
[INFO] Tests run: 4, Failures: 0, Errors: 0, Skipped: 0, Time elapsed: 0.759 s - in org.apache.sling.launchpad.webapp.integrationtest.GetWithSuffixTest
[INFO] Running org.apache.sling.launchpad.webapp.integrationtest.FiltersTest
[INFO] Tests run: 1, Failures: 0, Errors: 0, Skipped: 0, Time elapsed: 0.001 s - in org.apache.sling.launchpad.webapp.integrationtest.FiltersTest
[INFO] Running org.apache.sling.launchpad.webapp.integrationtest.login.RedirectOnLoginErrorTest
[INFO] Tests run: 2, Failures: 0, Errors: 0, Skipped: 0, Time elapsed: 0 s - in org.apache.sling.launchpad.webapp.integrationtest.login.RedirectOnLoginErrorTest
[INFO] Running org.apache.sling.launchpad.webapp.integrationtest.issues.SLING2617Test
[INFO] Tests run: 1, Failures: 0, Errors: 0, Skipped: 0, Time elapsed: 0.362 s - in org.apache.sling.launchpad.webapp.integrationtest.issues.SLING2617Test
[INFO] Running org.apache.sling.launchpad.webapp.integrationtest.ExportedPackagesTest
[INFO] Tests run: 3, Failures: 0, Errors: 0, Skipped: 0, Time elapsed: 0.014 s - in org.apache.sling.launchpad.webapp.integrationtest.ExportedPackagesTest
[INFO] Running org.apache.sling.launchpad.webapp.integrationtest.WebdavOptionsTest
[INFO] Tests run: 2, Failures: 0, Errors: 0, Skipped: 0, Time elapsed: 0.017 s - in org.apache.sling.launchpad.webapp.integrationtest.WebdavOptionsTest
[INFO] Running org.apache.sling.launchpad.webapp.integrationtest.login.AuthRequestLoginTest
[INFO] Tests run: 1, Failures: 0, Errors: 0, Skipped: 0, Time elapsed: 0.025 s - in org.apache.sling.launchpad.webapp.integrationtest.login.AuthRequestLoginTest
[INFO] Running org.apache.sling.launchpad.webapp.integrationtest.issues.SLING2085Test
[INFO] Tests run: 1, Failures: 0, Errors: 0, Skipped: 0, Time elapsed: 0.019 s - in org.apache.sling.launchpad.webapp.integrationtest.issues.SLING2085Test
[INFO] Running org.apache.sling.launchpad.webapp.integrationtest.ScriptBuiltinObjectsTest
[INFO] Tests run: 1, Failures: 0, Errors: 0, Skipped: 0, Time elapsed: 0.308 s - in org.apache.sling.launchpad.webapp.integrationtest.ScriptBuiltinObjectsTest
[INFO] Running org.apache.sling.launchpad.webapp.integrationtest.servlets.R6WhiteboardServletTest
[INFO] Tests run: 1, Failures: 0, Errors: 0, Skipped: 0, Time elapsed: 0 s - in org.apache.sling.launchpad.webapp.integrationtest.servlets.R6WhiteboardServletTest
[INFO] Running org.apache.sling.launchpad.webapp.integrationtest.servlets.post.SlingDefaultValuesTest
[INFO] Tests run: 5, Failures: 0, Errors: 0, Skipped: 0, Time elapsed: 0.303 s - in org.apache.sling.launchpad.webapp.integrationtest.servlets.post.SlingDefaultValuesTest
[INFO] Running org.apache.sling.launchpad.webapp.integrationtest.servlets.post.PostServletOutputContentTypeTest
[INFO] Tests run: 6, Failures: 0, Errors: 0, Skipped: 0, Time elapsed: 0.083 s - in org.apache.sling.launchpad.webapp.integrationtest.servlets.post.PostServletOutputContentTypeTest
[INFO] Running org.apache.sling.launchpad.webapp.integrationtest.teleporter.TeleporterOptionsTest
[INFO] Tests run: 1, Failures: 0, Errors: 0, Skipped: 0, Time elapsed: 0 s - in org.apache.sling.launchpad.webapp.integrationtest.teleporter.TeleporterOptionsTest
[INFO] Running org.apache.sling.launchpad.webapp.integrationtest.RangeStreamingTest
[INFO] Tests run: 4, Failures: 0, Errors: 0, Skipped: 0, Time elapsed: 0.607 s - in org.apache.sling.launchpad.webapp.integrationtest.RangeStreamingTest
[INFO] Running org.apache.sling.launchpad.webapp.integrationtest.StaticContentTest
[INFO] Tests run: 2, Failures: 0, Errors: 0, Skipped: 0, Time elapsed: 0.009 s - in org.apache.sling.launchpad.webapp.integrationtest.StaticContentTest
[INFO] Running org.apache.sling.launchpad.webapp.integrationtest.servlets.post.PostServletAtDeleteTest
[INFO] Tests run: 2, Failures: 0, Errors: 0, Skipped: 0, Time elapsed: 0.148 s - in org.apache.sling.launchpad.webapp.integrationtest.servlets.post.PostServletAtDeleteTest
[INFO] Running org.apache.sling.launchpad.webapp.integrationtest.ResourceDecoratorTest
[INFO] Tests run: 1, Failures: 0, Errors: 0, Skipped: 0, Time elapsed: 0.053 s - in org.apache.sling.launchpad.webapp.integrationtest.ResourceDecoratorTest
[INFO] Running org.apache.sling.launchpad.webapp.integrationtest.SyntheticResourceTest
[INFO] Tests run: 1, Failures: 0, Errors: 0, Skipped: 0, Time elapsed: 0.086 s - in org.apache.sling.launchpad.webapp.integrationtest.SyntheticResourceTest
[INFO] 
[INFO] Results:
[INFO] 
[ERROR] Failures: 
[ERROR]   FullTextIndexingTest.testUploadedPdfIsIndexed:97 RetryLoop failed, condition is false after 15 seconds: A document containing 'some text that we will search for' is found under /var/test-FullTextIndexingTest
[ERROR]   FullTextIndexingTest.testUploadedPdfIsIndexed:97 RetryLoop failed, condition is false after 15 seconds: A document containing 'un autre PDF pour le test fulltext' is found under /libs/test-FullTextIndexingTest
[INFO] 
[ERROR] Tests run: 572, Failures: 2, Errors: 0, Skipped: 1
[INFO] 
[INFO] 
[INFO] --- feature-launcher-maven-plugin:0.1.2:stop (default) @ org.apache.sling.starter ---
[INFO] Stopping launch with id sling-12-oak-tar
[DEBUG] [ServiceReference 734 from bundle 112 : org.apache.sling.jcr.davex:1.3.10 ref=[javax.servlet.Servlet] properties={objectClass=[javax.servlet.Servlet], osgi.http.whiteboard.context.select=(osgi.http.whiteboard.context.name=DavExAuthHttpContext), osgi.http.whiteboard.servlet.pattern=/server/*, service.bundleid=112, service.description=Sling JcrRemoting Servlet, service.id=734, service.scope=singleton, service.vendor=The Apache Software Foundation, servlet.init.createAbsoluteURI=true, servlet.init.csrf-protection=disabled, servlet.init.protectedhandlers-config=org.apache.jackrabbit.server.remoting.davex.AclRemoveHandler, servlet.init.resource-path-prefix=/server, sling.auth.requirements=-/server}] Ignoring unmatching Servlet service
[DEBUG] [ServiceReference 453 from bundle 128 : org.apache.sling.engine:2.9.0 ref=[javax.servlet.Filter] properties={component.id=162, component.name=org.apache.sling.engine.impl.log.RequestLoggerFilter, objectClass=[javax.servlet.Filter], osgi.ds.satisfying.condition.target=(osgi.condition.id=true), osgi.http.whiteboard.context.select=(osgi.http.whiteboard.context.name=org.apache.sling), osgi.http.whiteboard.filter.pattern=[/], service.bundleid=128, service.description=Request Logger Filter, service.id=453, service.ranking=32768, service.scope=bundle, service.vendor=The Apache Software Foundation}] Ignoring unmatching Filter service
[DEBUG] [ServiceReference 454 from bundle 128 : org.apache.sling.engine:2.9.0 ref=[javax.servlet.Filter] properties={component.id=163, component.name=org.apache.sling.engine.parameters, file.max=-1, file.threshold=256000, objectClass=[javax.servlet.Filter], osgi.ds.satisfying.condition.target=(osgi.condition.id=true), osgi.http.whiteboard.context.select=(osgi.http.whiteboard.context.name=org.apache.sling), osgi.http.whiteboard.filter.pattern=[/], request.max=-1, service.bundleid=128, service.description=Filter for request parameter support, service.id=454, service.ranking=2147483647, service.scope=bundle, service.vendor=The Apache Software Foundation, sling.default.max.parameters=10000, sling.default.parameter.checkForAdditionalContainerParameters=false, sling.default.parameter.encoding=ISO-8859-1}] Ignoring unmatching Filter service
[DEBUG] [ServiceReference 444 from bundle 128 : org.apache.sling.engine:2.9.0 ref=[javax.servlet.Servlet] properties={objectClass=[javax.servlet.Servlet], osgi.http.whiteboard.context.select=(osgi.http.whiteboard.context.name=org.apache.sling), osgi.http.whiteboard.servlet.name=ApacheSling/2.9, osgi.http.whiteboard.servlet.pattern=/, service.bundleid=128, service.description=Apache Sling Engine Main Servlet, service.id=444, service.scope=singleton, service.vendor=The Apache Software Foundation}] Ignoring unmatching Servlet service
[INFO] Apachde Felix Http Whiteboard Service stopped
[INFO] Stopped Jetty.
[INFO] Stopping launch with id sling-12-oak-mongo
[DEBUG] [ServiceReference 1153 from bundle 112 : org.apache.sling.jcr.davex:1.3.10 ref=[javax.servlet.Servlet] properties={objectClass=[javax.servlet.Servlet], osgi.http.whiteboard.context.select=(osgi.http.whiteboard.context.name=DavExAuthHttpContext), osgi.http.whiteboard.servlet.pattern=/server/*, service.bundleid=112, service.description=Sling JcrRemoting Servlet, service.id=1153, service.scope=singleton, service.vendor=The Apache Software Foundation, servlet.init.createAbsoluteURI=true, servlet.init.csrf-protection=disabled, servlet.init.protectedhandlers-config=org.apache.jackrabbit.server.remoting.davex.AclRemoveHandler, servlet.init.resource-path-prefix=/server, sling.auth.requirements=-/server}] Ignoring unmatching Servlet service
[DEBUG] [ServiceReference 471 from bundle 129 : org.apache.sling.engine:2.9.0 ref=[javax.servlet.Filter] properties={component.id=160, component.name=org.apache.sling.engine.impl.log.RequestLoggerFilter, objectClass=[javax.servlet.Filter], osgi.ds.satisfying.condition.target=(osgi.condition.id=true), osgi.http.whiteboard.context.select=(osgi.http.whiteboard.context.name=org.apache.sling), osgi.http.whiteboard.filter.pattern=[/], service.bundleid=129, service.description=Request Logger Filter, service.id=471, service.ranking=32768, service.scope=bundle, service.vendor=The Apache Software Foundation}] Ignoring unmatching Filter service
[DEBUG] [ServiceReference 456 from bundle 129 : org.apache.sling.engine:2.9.0 ref=[javax.servlet.Servlet] properties={objectClass=[javax.servlet.Servlet], osgi.http.whiteboard.context.select=(osgi.http.whiteboard.context.name=org.apache.sling), osgi.http.whiteboard.servlet.name=ApacheSling/2.9, osgi.http.whiteboard.servlet.pattern=/, service.bundleid=129, service.description=Apache Sling Engine Main Servlet, service.id=456, service.scope=singleton, service.vendor=The Apache Software Foundation}] Ignoring unmatching Servlet service
[DEBUG] [ServiceReference 472 from bundle 129 : org.apache.sling.engine:2.9.0 ref=[javax.servlet.Filter] properties={component.id=161, component.name=org.apache.sling.engine.parameters, file.max=-1, file.threshold=256000, objectClass=[javax.servlet.Filter], osgi.ds.satisfying.condition.target=(osgi.condition.id=true), osgi.http.whiteboard.context.select=(osgi.http.whiteboard.context.name=org.apache.sling), osgi.http.whiteboard.filter.pattern=[/], request.max=-1, service.bundleid=129, service.description=Filter for request parameter support, service.id=472, service.ranking=2147483647, service.scope=bundle, service.vendor=The Apache Software Foundation, sling.default.max.parameters=10000, sling.default.parameter.checkForAdditionalContainerParameters=false, sling.default.parameter.encoding=ISO-8859-1}] Ignoring unmatching Filter service
[INFO] Apachde Felix Http Whiteboard Service stopped
[INFO] Stopped Jetty.
[INFO] 
[INFO] --- tools-maven-plugin:1.4:verify-legal-files (verify-legal-files) @ org.apache.sling.starter ---
[INFO] Checking legal files in: org.apache.sling.starter-13-SNAPSHOT.jar
[INFO] Checking legal files in: org.apache.sling.starter-13-SNAPSHOT-oak_tar_far.far
[INFO] Checking legal files in: org.apache.sling.starter-13-SNAPSHOT-oak_mongo_far.far
[INFO] Checking legal files in: org.apache.sling.starter-13-SNAPSHOT-sources.jar
[INFO] 
[INFO] --- apache-rat-plugin:0.13:check (rat-check) @ org.apache.sling.starter ---
[INFO] Enabled default license matchers.
[INFO] Will parse SCM ignores for exclusions...
[INFO] Parsing exclusions from /home/jenkins/workspace/_org-apache-sling-starter_master/.gitignore
[INFO] Finished adding exclusions from SCM ignore files.
[INFO] 79 implicit excludes (use -debug for more details).
[INFO] 15 explicit excludes (use -debug for more details).
[INFO] 21 resources included (use -debug for more details)
[INFO] Rat check: Summary over all files. Unapproved: 0, unknown: 0, generated: 0, approved: 20 licenses.
[INFO] 
[INFO] --- docker-maven-plugin:0.39.0:stop (stop-mongo) @ org.apache.sling.starter ---
[INFO] DOCKER> [apache/sling:snapshot]: Stop and removed container 2da593ce0a84 after 0 ms
[INFO] DOCKER> [mongo:4.4.6] "mongo": Stop and removed container a315a13787e2 after 0 ms
[INFO] 
[INFO] --- maven-failsafe-plugin:3.0.0-M5:verify (default) @ org.apache.sling.starter ---
[INFO] ------------------------------------------------------------------------
[INFO] BUILD FAILURE
[INFO] ------------------------------------------------------------------------
[INFO] Total time:  07:06 min
[INFO] Finished at: 2022-05-12T11:38:10Z
[INFO] ------------------------------------------------------------------------
[INFO] [jenkins-event-spy] Generated /home/jenkins/workspace/_org-apache-sling-starter_master@tmp/withMavenff5d92aa/maven-spy-20220512-113103-5071139391147996353845.log
[ERROR] Failed to execute goal org.apache.maven.plugins:maven-failsafe-plugin:3.0.0-M5:verify (default) on project org.apache.sling.starter: There are test failures.
[ERROR] 
[ERROR] Please refer to /home/jenkins/workspace/_org-apache-sling-starter_master/target/failsafe-reports for the individual test results.
[ERROR] Please refer to dump files (if any exist) [date].dump, [date]-jvmRun[N].dump and [date].dumpstream.
[ERROR] -> [Help 1]
[ERROR] 
[ERROR] To see the full stack trace of the errors, re-run Maven with the -e switch.
[ERROR] Re-run Maven using the -X switch to enable full debug logging.
[ERROR] 
[ERROR] For more information about the errors and possible solutions, please read the following articles:
[ERROR] [Help 1] http://cwiki.apache.org/confluence/display/MAVEN/MojoFailureException
[Pipeline] }
[DevOpticsMavenPublisher] dependencies consumed: 0, artifacts produced: 0
[withMaven] Publishers: Pipeline Graph Publisher: 1 ms, CloudBees DevOptics Gate Artifact Publisher: 111977 ms
[Pipeline] // withMaven
[Pipeline] }
[Pipeline] // stage
[Pipeline] }
[Pipeline] // timeout
[Pipeline] stage
[Pipeline] { (Notifications)
[Pipeline] echo
Status change is BROKEN, notifications will be sent.
[Pipeline] emailext

[Jenkins] Sling » Modules » sling-org-apache-sling-starter » master #256 is FIXED

Posted by Apache Jenkins Server <je...@builds.apache.org>.
Please see https://ci-builds.apache.org/job/Sling/job/modules/job/sling-org-apache-sling-starter/job/master/256/ for details.

No further emails will be sent until the status of the build is changed.