You are viewing a plain text version of this content. The canonical link for it is here.
Posted to builds@solr.apache.org by Policeman Jenkins Server <je...@thetaphi.de> on 2022/04/05 22:56:04 UTC

[JENKINS] Solr-main-Linux (64bit/jdk-16.0.2) - Build # 3916 - Still Unstable!

Build: https://jenkins.thetaphi.de/job/Solr-main-Linux/3916/
Java: 64bit/jdk-16.0.2 -XX:-UseCompressedOops -XX:+UseParallelGC

1 tests failed.
FAILED:  org.apache.solr.search.facet.TestCloudJSONFacetSKGEquiv.testRandom

Error Message:
java.lang.AssertionError: rows=0&q=(field_6_multi_ss:29+OR+field_2_multi_sdsS:20+OR+field_3_multi_ss:22+OR+field_9_multi_ss:19+OR+field_1_multi_sds:34)&fore=(field_10_multi_sds:38+OR+field_3_multi_ss:12+OR+field_13_multi_sds:56+OR+field_3_multi_ss:51+OR+field_4_multi_sds:33)&back=(field_4_multi_sds:11+OR+field_2_multi_sdsS:22+OR+field_10_multi_sds:18+OR+field_4_multi_sds:32+OR+field_7_multi_sds:11+OR+field_7_multi_sds:9+OR+field_9_multi_ss:56)&json.facet={"facet_1":{"method":"${method_val:smart}","limit":-1,"overrequest":9,"prefix":"2","sort":"index+asc","refine":true,"type":"terms","field":"field_0_multi_ss","facet":{"skg":{"type":"func","func":"relatedness($fore,$back)","${sweep_key:xxx}":"${sweep_val:yyy}"},"facet_2":{"method":"${method_val:smart}","limit":52,"overrequest":1333445684,"sort":"count+desc","refine":false,"type":"terms","field":"field_10_solo_sd","facet":{"skg":{"type":"func","func":"relatedness($fore,$back)","${sweep_key:xxx}":"${sweep_val:yyy}"}}},"facet_3":{"method":"${method_val:smart}","limit":26,"overrequest":0,"allBuckets":false,"type":"terms","field":"field_10_solo_sd","facet":{"skg":{"type":"func","func":"relatedness($fore,$back)","${sweep_key:xxx}":"${sweep_val:yyy}"}}}}}}&_stateVer_=org.apache.solr.search.facet.TestCloudJSONFacetSKGEquiv_collection:7 ===> Mismatch: .facet_1.buckets.length:11!=10 using method_val=enum&sweep_key=sweep_collection&sweep_val=true

Stack Trace:
java.lang.AssertionError: rows=0&q=(field_6_multi_ss:29+OR+field_2_multi_sdsS:20+OR+field_3_multi_ss:22+OR+field_9_multi_ss:19+OR+field_1_multi_sds:34)&fore=(field_10_multi_sds:38+OR+field_3_multi_ss:12+OR+field_13_multi_sds:56+OR+field_3_multi_ss:51+OR+field_4_multi_sds:33)&back=(field_4_multi_sds:11+OR+field_2_multi_sdsS:22+OR+field_10_multi_sds:18+OR+field_4_multi_sds:32+OR+field_7_multi_sds:11+OR+field_7_multi_sds:9+OR+field_9_multi_ss:56)&json.facet={"facet_1":{"method":"${method_val:smart}","limit":-1,"overrequest":9,"prefix":"2","sort":"index+asc","refine":true,"type":"terms","field":"field_0_multi_ss","facet":{"skg":{"type":"func","func":"relatedness($fore,$back)","${sweep_key:xxx}":"${sweep_val:yyy}"},"facet_2":{"method":"${method_val:smart}","limit":52,"overrequest":1333445684,"sort":"count+desc","refine":false,"type":"terms","field":"field_10_solo_sd","facet":{"skg":{"type":"func","func":"relatedness($fore,$back)","${sweep_key:xxx}":"${sweep_val:yyy}"}}},"facet_3":{"method":"${method_val:smart}","limit":26,"overrequest":0,"allBuckets":false,"type":"terms","field":"field_10_solo_sd","facet":{"skg":{"type":"func","func":"relatedness($fore,$back)","${sweep_key:xxx}":"${sweep_val:yyy}"}}}}}}&_stateVer_=org.apache.solr.search.facet.TestCloudJSONFacetSKGEquiv_collection:7 ===> Mismatch: .facet_1.buckets.length:11!=10 using method_val=enum&sweep_key=sweep_collection&sweep_val=true
	at __randomizedtesting.SeedInfo.seed([1530F835E98F7267:677CDD3A58EFC414]:0)
	at org.apache.solr.search.facet.TestCloudJSONFacetSKGEquiv.assertFacetSKGsAreConsistent(TestCloudJSONFacetSKGEquiv.java:833)
	at org.apache.solr.search.facet.TestCloudJSONFacetSKGEquiv.testRandom(TestCloudJSONFacetSKGEquiv.java:730)
	at java.base/jdk.internal.reflect.NativeMethodAccessorImpl.invoke0(Native Method)
	at java.base/jdk.internal.reflect.NativeMethodAccessorImpl.invoke(NativeMethodAccessorImpl.java:78)
	at java.base/jdk.internal.reflect.DelegatingMethodAccessorImpl.invoke(DelegatingMethodAccessorImpl.java:43)
	at java.base/java.lang.reflect.Method.invoke(Method.java:567)
	at com.carrotsearch.randomizedtesting.RandomizedRunner.invoke(RandomizedRunner.java:1758)
	at com.carrotsearch.randomizedtesting.RandomizedRunner$8.evaluate(RandomizedRunner.java:946)
	at com.carrotsearch.randomizedtesting.RandomizedRunner$9.evaluate(RandomizedRunner.java:982)
	at com.carrotsearch.randomizedtesting.RandomizedRunner$10.evaluate(RandomizedRunner.java:996)
	at com.carrotsearch.randomizedtesting.rules.SystemPropertiesRestoreRule$1.evaluate(SystemPropertiesRestoreRule.java:57)
	at org.junit.rules.RunRules.evaluate(RunRules.java:20)
	at org.apache.lucene.util.TestRuleSetupTeardownChained$1.evaluate(TestRuleSetupTeardownChained.java:44)
	at org.apache.lucene.util.AbstractBeforeAfterRule$1.evaluate(AbstractBeforeAfterRule.java:43)
	at org.apache.lucene.util.TestRuleThreadAndTestName$1.evaluate(TestRuleThreadAndTestName.java:45)
	at org.apache.lucene.util.TestRuleIgnoreAfterMaxFailures$1.evaluate(TestRuleIgnoreAfterMaxFailures.java:60)
	at org.apache.lucene.util.TestRuleMarkFailure$1.evaluate(TestRuleMarkFailure.java:44)
	at org.junit.rules.RunRules.evaluate(RunRules.java:20)
	at com.carrotsearch.randomizedtesting.rules.StatementAdapter.evaluate(StatementAdapter.java:36)
	at com.carrotsearch.randomizedtesting.ThreadLeakControl$StatementRunner.run(ThreadLeakControl.java:375)
	at com.carrotsearch.randomizedtesting.ThreadLeakControl.forkTimeoutingTask(ThreadLeakControl.java:824)
	at com.carrotsearch.randomizedtesting.ThreadLeakControl$3.evaluate(ThreadLeakControl.java:475)
	at com.carrotsearch.randomizedtesting.RandomizedRunner.runSingleTest(RandomizedRunner.java:955)
	at com.carrotsearch.randomizedtesting.RandomizedRunner$5.evaluate(RandomizedRunner.java:840)
	at com.carrotsearch.randomizedtesting.RandomizedRunner$6.evaluate(RandomizedRunner.java:891)
	at com.carrotsearch.randomizedtesting.RandomizedRunner$7.evaluate(RandomizedRunner.java:902)
	at com.carrotsearch.randomizedtesting.rules.StatementAdapter.evaluate(StatementAdapter.java:36)
	at org.apache.lucene.util.AbstractBeforeAfterRule$1.evaluate(AbstractBeforeAfterRule.java:43)
	at org.apache.lucene.util.AbstractBeforeAfterRule$1.evaluate(AbstractBeforeAfterRule.java:43)
	at com.carrotsearch.randomizedtesting.rules.SystemPropertiesRestoreRule$1.evaluate(SystemPropertiesRestoreRule.java:57)
	at org.junit.rules.RunRules.evaluate(RunRules.java:20)
	at org.apache.lucene.util.AbstractBeforeAfterRule$1.evaluate(AbstractBeforeAfterRule.java:43)
	at com.carrotsearch.randomizedtesting.rules.StatementAdapter.evaluate(StatementAdapter.java:36)
	at org.apache.lucene.util.TestRuleStoreClassName$1.evaluate(TestRuleStoreClassName.java:38)
	at com.carrotsearch.randomizedtesting.rules.NoShadowingOrOverridesOnMethodsRule$1.evaluate(NoShadowingOrOverridesOnMethodsRule.java:40)
	at com.carrotsearch.randomizedtesting.rules.NoShadowingOrOverridesOnMethodsRule$1.evaluate(NoShadowingOrOverridesOnMethodsRule.java:40)
	at com.carrotsearch.randomizedtesting.rules.StatementAdapter.evaluate(StatementAdapter.java:36)
	at com.carrotsearch.randomizedtesting.rules.StatementAdapter.evaluate(StatementAdapter.java:36)
	at org.apache.lucene.util.TestRuleAssertionsRequired$1.evaluate(TestRuleAssertionsRequired.java:53)
	at org.apache.lucene.util.AbstractBeforeAfterRule$1.evaluate(AbstractBeforeAfterRule.java:43)
	at org.apache.lucene.util.TestRuleMarkFailure$1.evaluate(TestRuleMarkFailure.java:44)
	at org.apache.lucene.util.TestRuleIgnoreAfterMaxFailures$1.evaluate(TestRuleIgnoreAfterMaxFailures.java:60)
	at org.apache.lucene.util.TestRuleIgnoreTestSuites$1.evaluate(TestRuleIgnoreTestSuites.java:47)
	at org.junit.rules.RunRules.evaluate(RunRules.java:20)
	at com.carrotsearch.randomizedtesting.rules.StatementAdapter.evaluate(StatementAdapter.java:36)
	at com.carrotsearch.randomizedtesting.ThreadLeakControl$StatementRunner.run(ThreadLeakControl.java:375)
	at com.carrotsearch.randomizedtesting.ThreadLeakControl.lambda$forkTimeoutingTask$0(ThreadLeakControl.java:831)
	at java.base/java.lang.Thread.run(Thread.java:831)
Caused by: java.lang.AssertionError: Mismatch: .facet_1.buckets.length:11!=10 using method_val=enum&sweep_key=sweep_collection&sweep_val=true
	at org.junit.Assert.fail(Assert.java:89)
	at org.apache.solr.search.facet.TestCloudJSONFacetSKGEquiv.assertFacetSKGsAreConsistent(TestCloudJSONFacetSKGEquiv.java:828)
	... 47 more

[JENKINS] Solr-main-Linux (64bit/jdk-16.0.2) - Build # 3918 - Still Unstable!

Posted by Policeman Jenkins Server <je...@thetaphi.de>.
Build: https://jenkins.thetaphi.de/job/Solr-main-Linux/3918/
Java: 64bit/jdk-16.0.2 -XX:+UseCompressedOops -XX:+UseSerialGC

1 tests failed.
FAILED:  org.apache.solr.search.TestFiltering.testRandomFiltering

Error Message:
java.lang.AssertionError: FAILURE: indexSize=116 iiter=5 qiter=28 request=[q, {!cache=false cost=27 tag=t} val_i:1 val_i:2 val_i:6 val_i:7 val_i:8 val_i:9 val_i:17 val_i:18 val_i:19 val_i:21 val_i:24 val_i:25 val_i:26 val_i:27 val_i:28 val_i:29 val_i:31 val_i:32 val_i:33 val_i:34 val_i:35 val_i:36 val_i:37 val_i:38 val_i:44 val_i:48 val_i:50 val_i:53 val_i:55 val_i:56 val_i:58 val_i:60 val_i:62 val_i:63 val_i:64 val_i:65 val_i:67 val_i:71 val_i:74 val_i:76 val_i:78 val_i:80 val_i:83 val_i:85 val_i:86 val_i:87 val_i:88 val_i:89 val_i:92 val_i:94 val_i:96 val_i:97 val_i:98 val_i:100 val_i:101 val_i:102 val_i:104 val_i:105 val_i:107 val_i:108 val_i:109 val_i:112, fq, {! cost=10 tag=t}-_query_:"val_i:[00010 TO 00116}", fq, {!frange v=val_i l=107 u=186 cache=true tag=t}, fq, {!cache=true tag=t} -val_i:1 -val_i:3 -val_i:6 -val_i:8 -val_i:16 -val_i:19 -val_i:20 -val_i:23 -val_i:24 -val_i:25 -val_i:27 -val_i:28 -val_i:30 -val_i:31 -val_i:32 -val_i:33 -val_i:37 -val_i:39 -val_i:41 -val_i:44 -val_i:46 -val_i:47 -val_i:48 -val_i:50 -val_i:52 -val_i:54 -val_i:55 -val_i:56 -val_i:57 -val_i:58 -val_i:60 -val_i:61 -val_i:62 -val_i:63 -val_i:64 -val_i:69 -val_i:71 -val_i:74 -val_i:78 -val_i:79 -val_i:83 -val_i:85 -val_i:86 -val_i:91 -val_i:93 -val_i:94 -val_i:95 -val_i:96 -val_i:97 -val_i:99 -val_i:101 -val_i:102 -val_i:109 -val_i:110 -val_i:111 -val_i:112 -val_i:113, fq, {! tag=t}val_s:[00050 TO 00084] AND val_s:{00049 TO 00085}, facet, true, facet.query, *:*, facet.query, {!key=multiSelect ex=t}*:*, facet.query, {!key=facetQuery  cache=false}-_query_:"val_i:{00054 TO 00115]", group, true, group.main, true, group.field, id, group.cache.percent, 100]

Stack Trace:
java.lang.AssertionError: FAILURE: indexSize=116 iiter=5 qiter=28 request=[q, {!cache=false cost=27 tag=t} val_i:1 val_i:2 val_i:6 val_i:7 val_i:8 val_i:9 val_i:17 val_i:18 val_i:19 val_i:21 val_i:24 val_i:25 val_i:26 val_i:27 val_i:28 val_i:29 val_i:31 val_i:32 val_i:33 val_i:34 val_i:35 val_i:36 val_i:37 val_i:38 val_i:44 val_i:48 val_i:50 val_i:53 val_i:55 val_i:56 val_i:58 val_i:60 val_i:62 val_i:63 val_i:64 val_i:65 val_i:67 val_i:71 val_i:74 val_i:76 val_i:78 val_i:80 val_i:83 val_i:85 val_i:86 val_i:87 val_i:88 val_i:89 val_i:92 val_i:94 val_i:96 val_i:97 val_i:98 val_i:100 val_i:101 val_i:102 val_i:104 val_i:105 val_i:107 val_i:108 val_i:109 val_i:112, fq, {! cost=10 tag=t}-_query_:"val_i:[00010 TO 00116}", fq, {!frange v=val_i l=107 u=186 cache=true tag=t}, fq, {!cache=true tag=t} -val_i:1 -val_i:3 -val_i:6 -val_i:8 -val_i:16 -val_i:19 -val_i:20 -val_i:23 -val_i:24 -val_i:25 -val_i:27 -val_i:28 -val_i:30 -val_i:31 -val_i:32 -val_i:33 -val_i:37 -val_i:39 -val_i:41 -val_i:44 -val_i:46 -val_i:47 -val_i:48 -val_i:50 -val_i:52 -val_i:54 -val_i:55 -val_i:56 -val_i:57 -val_i:58 -val_i:60 -val_i:61 -val_i:62 -val_i:63 -val_i:64 -val_i:69 -val_i:71 -val_i:74 -val_i:78 -val_i:79 -val_i:83 -val_i:85 -val_i:86 -val_i:91 -val_i:93 -val_i:94 -val_i:95 -val_i:96 -val_i:97 -val_i:99 -val_i:101 -val_i:102 -val_i:109 -val_i:110 -val_i:111 -val_i:112 -val_i:113, fq, {! tag=t}val_s:[00050 TO 00084] AND val_s:{00049 TO 00085}, facet, true, facet.query, *:*, facet.query, {!key=multiSelect ex=t}*:*, facet.query, {!key=facetQuery  cache=false}-_query_:"val_i:{00054 TO 00115]", group, true, group.main, true, group.field, id, group.cache.percent, 100]
	at __randomizedtesting.SeedInfo.seed([AED49A502DDC8B2A:B1B73995C8FBCB23]:0)
	at org.junit.Assert.fail(Assert.java:89)
	at org.apache.solr.search.TestFiltering.testRandomFiltering(TestFiltering.java:578)
	at java.base/jdk.internal.reflect.NativeMethodAccessorImpl.invoke0(Native Method)
	at java.base/jdk.internal.reflect.NativeMethodAccessorImpl.invoke(NativeMethodAccessorImpl.java:78)
	at java.base/jdk.internal.reflect.DelegatingMethodAccessorImpl.invoke(DelegatingMethodAccessorImpl.java:43)
	at java.base/java.lang.reflect.Method.invoke(Method.java:567)
	at com.carrotsearch.randomizedtesting.RandomizedRunner.invoke(RandomizedRunner.java:1758)
	at com.carrotsearch.randomizedtesting.RandomizedRunner$8.evaluate(RandomizedRunner.java:946)
	at com.carrotsearch.randomizedtesting.RandomizedRunner$9.evaluate(RandomizedRunner.java:982)
	at com.carrotsearch.randomizedtesting.RandomizedRunner$10.evaluate(RandomizedRunner.java:996)
	at com.carrotsearch.randomizedtesting.rules.SystemPropertiesRestoreRule$1.evaluate(SystemPropertiesRestoreRule.java:57)
	at org.junit.rules.RunRules.evaluate(RunRules.java:20)
	at org.apache.lucene.util.TestRuleSetupTeardownChained$1.evaluate(TestRuleSetupTeardownChained.java:44)
	at org.apache.lucene.util.AbstractBeforeAfterRule$1.evaluate(AbstractBeforeAfterRule.java:43)
	at org.apache.lucene.util.TestRuleThreadAndTestName$1.evaluate(TestRuleThreadAndTestName.java:45)
	at org.apache.lucene.util.TestRuleIgnoreAfterMaxFailures$1.evaluate(TestRuleIgnoreAfterMaxFailures.java:60)
	at org.apache.lucene.util.TestRuleMarkFailure$1.evaluate(TestRuleMarkFailure.java:44)
	at org.junit.rules.RunRules.evaluate(RunRules.java:20)
	at com.carrotsearch.randomizedtesting.rules.StatementAdapter.evaluate(StatementAdapter.java:36)
	at com.carrotsearch.randomizedtesting.ThreadLeakControl$StatementRunner.run(ThreadLeakControl.java:375)
	at com.carrotsearch.randomizedtesting.ThreadLeakControl.forkTimeoutingTask(ThreadLeakControl.java:824)
	at com.carrotsearch.randomizedtesting.ThreadLeakControl$3.evaluate(ThreadLeakControl.java:475)
	at com.carrotsearch.randomizedtesting.RandomizedRunner.runSingleTest(RandomizedRunner.java:955)
	at com.carrotsearch.randomizedtesting.RandomizedRunner$5.evaluate(RandomizedRunner.java:840)
	at com.carrotsearch.randomizedtesting.RandomizedRunner$6.evaluate(RandomizedRunner.java:891)
	at com.carrotsearch.randomizedtesting.RandomizedRunner$7.evaluate(RandomizedRunner.java:902)
	at com.carrotsearch.randomizedtesting.rules.StatementAdapter.evaluate(StatementAdapter.java:36)
	at org.apache.lucene.util.AbstractBeforeAfterRule$1.evaluate(AbstractBeforeAfterRule.java:43)
	at org.apache.lucene.util.AbstractBeforeAfterRule$1.evaluate(AbstractBeforeAfterRule.java:43)
	at com.carrotsearch.randomizedtesting.rules.SystemPropertiesRestoreRule$1.evaluate(SystemPropertiesRestoreRule.java:57)
	at org.junit.rules.RunRules.evaluate(RunRules.java:20)
	at org.apache.lucene.util.AbstractBeforeAfterRule$1.evaluate(AbstractBeforeAfterRule.java:43)
	at com.carrotsearch.randomizedtesting.rules.StatementAdapter.evaluate(StatementAdapter.java:36)
	at org.apache.lucene.util.TestRuleStoreClassName$1.evaluate(TestRuleStoreClassName.java:38)
	at com.carrotsearch.randomizedtesting.rules.NoShadowingOrOverridesOnMethodsRule$1.evaluate(NoShadowingOrOverridesOnMethodsRule.java:40)
	at com.carrotsearch.randomizedtesting.rules.NoShadowingOrOverridesOnMethodsRule$1.evaluate(NoShadowingOrOverridesOnMethodsRule.java:40)
	at com.carrotsearch.randomizedtesting.rules.StatementAdapter.evaluate(StatementAdapter.java:36)
	at com.carrotsearch.randomizedtesting.rules.StatementAdapter.evaluate(StatementAdapter.java:36)
	at org.apache.lucene.util.TestRuleAssertionsRequired$1.evaluate(TestRuleAssertionsRequired.java:53)
	at org.apache.lucene.util.AbstractBeforeAfterRule$1.evaluate(AbstractBeforeAfterRule.java:43)
	at org.apache.lucene.util.TestRuleMarkFailure$1.evaluate(TestRuleMarkFailure.java:44)
	at org.apache.lucene.util.TestRuleIgnoreAfterMaxFailures$1.evaluate(TestRuleIgnoreAfterMaxFailures.java:60)
	at org.apache.lucene.util.TestRuleIgnoreTestSuites$1.evaluate(TestRuleIgnoreTestSuites.java:47)
	at org.junit.rules.RunRules.evaluate(RunRules.java:20)
	at com.carrotsearch.randomizedtesting.rules.StatementAdapter.evaluate(StatementAdapter.java:36)
	at com.carrotsearch.randomizedtesting.ThreadLeakControl$StatementRunner.run(ThreadLeakControl.java:375)
	at com.carrotsearch.randomizedtesting.ThreadLeakControl.lambda$forkTimeoutingTask$0(ThreadLeakControl.java:831)
	at java.base/java.lang.Thread.run(Thread.java:831)

[JENKINS] Solr-main-Linux (64bit/jdk-18) - Build # 3917 - Still Unstable!

Posted by Policeman Jenkins Server <je...@thetaphi.de>.
Build: https://jenkins.thetaphi.de/job/Solr-main-Linux/3917/
Java: 64bit/jdk-18 -XX:-UseCompressedOops -XX:+UseParallelGC

1 tests failed.
FAILED:  org.apache.solr.search.facet.TestCloudJSONFacetSKGEquiv.testRandom

Error Message:
java.lang.AssertionError: rows=0&q=(field_12_multi_ss:24+OR+field_5_multi_sdsS:50+OR+field_8_multi_sdsS:46+OR+field_6_multi_ss:32+OR+field_4_multi_sds:10+OR+field_5_multi_sdsS:27+OR+field_11_multi_sdsS:17+OR+field_5_multi_sdsS:22)&fore=(field_9_multi_ss:21+OR+field_10_multi_sds:16+OR+field_11_multi_sdsS:19+OR+field_4_multi_sds:53+OR+field_0_multi_ss:25+OR+field_8_multi_sdsS:57+OR+field_2_multi_sdsS:35+OR+field_13_multi_sds:28)&back=(field_7_multi_sds:30+OR+field_0_multi_ss:30+OR+field_0_multi_ss:11+OR+field_8_multi_sdsS:40+OR+field_8_multi_sdsS:33+OR+field_5_multi_sdsS:33)&json.facet={"facet_1":{"method":"${method_val:smart}","limit":44,"overrequest":-1,"perSeg":false,"sort":"skg+desc","prelim_sort":"count+desc","allBuckets":true,"refine":false,"type":"terms","field":"field_1_multi_ids","facet":{"skg":{"type":"func","func":"relatedness($fore,$back)","${sweep_key:xxx}":"${sweep_val:yyy}"},"facet_2":{"method":"${method_val:smart}","limit":-1,"overrequest":0,"sort":"count+asc","allBuckets":true,"type":"terms","field":"field_11_solo_idS","facet":{"skg":{"type":"func","func":"relatedness($fore,$back)","${sweep_key:xxx}":"${sweep_val:yyy}"},"skg0":{"min_popularity":"0.001","type":"func","func":"relatedness($fore,$back)","${sweep_key:xxx}":"${sweep_val:yyy}"},"skg1":{"min_popularity":"0.001","type":"func","func":"relatedness({!v%3D'(field_12_multi_ss:44+OR+field_3_multi_ss:50)'},{!v%3D'(field_5_multi_sdsS:50)'})","${sweep_key:xxx}":"${sweep_val:yyy}"}}},"facet_3":{"method":"${method_val:smart}","limit":12,"overrequest":22,"perSeg":true,"sort":"count+asc","refine":true,"type":"terms","field":"field_8_multi_idsS","facet":{"skg":{"type":"func","func":"relatedness($fore,$back)","${sweep_key:xxx}":"${sweep_val:yyy}"},"skg0":{"type":"func","func":"relatedness($fore,$back)","${sweep_key:xxx}":"${sweep_val:yyy}"},"skg1":{"min_popularity":"0.001","type":"func","func":"relatedness({!v%3D'(field_6_multi_ss:15+OR+field_1_multi_sds:47+OR+field_0_multi_ss:8)'},{!v%3D'(field_5_multi_sdsS:41+OR+field_1_multi_sds:37+OR+field_0_multi_ss:49+OR+field_14_multi_sdsS:48+OR+field_13_multi_sds:62+OR+field_5_multi_sdsS:20+OR+field_1_multi_sds:17+OR+field_10_multi_sds:35)'})","${sweep_key:xxx}":"${sweep_val:yyy}"},"sum":"sum(field_4_multi_ids)"}},"skg0":{"min_popularity":"0.001","type":"func","func":"relatedness($fore,$back)","${sweep_key:xxx}":"${sweep_val:yyy}"},"skg1":{"type":"func","func":"relatedness($fore,$back)","${sweep_key:xxx}":"${sweep_val:yyy}"}}}} ===> null facet results?

Stack Trace:
java.lang.AssertionError: rows=0&q=(field_12_multi_ss:24+OR+field_5_multi_sdsS:50+OR+field_8_multi_sdsS:46+OR+field_6_multi_ss:32+OR+field_4_multi_sds:10+OR+field_5_multi_sdsS:27+OR+field_11_multi_sdsS:17+OR+field_5_multi_sdsS:22)&fore=(field_9_multi_ss:21+OR+field_10_multi_sds:16+OR+field_11_multi_sdsS:19+OR+field_4_multi_sds:53+OR+field_0_multi_ss:25+OR+field_8_multi_sdsS:57+OR+field_2_multi_sdsS:35+OR+field_13_multi_sds:28)&back=(field_7_multi_sds:30+OR+field_0_multi_ss:30+OR+field_0_multi_ss:11+OR+field_8_multi_sdsS:40+OR+field_8_multi_sdsS:33+OR+field_5_multi_sdsS:33)&json.facet={"facet_1":{"method":"${method_val:smart}","limit":44,"overrequest":-1,"perSeg":false,"sort":"skg+desc","prelim_sort":"count+desc","allBuckets":true,"refine":false,"type":"terms","field":"field_1_multi_ids","facet":{"skg":{"type":"func","func":"relatedness($fore,$back)","${sweep_key:xxx}":"${sweep_val:yyy}"},"facet_2":{"method":"${method_val:smart}","limit":-1,"overrequest":0,"sort":"count+asc","allBuckets":true,"type":"terms","field":"field_11_solo_idS","facet":{"skg":{"type":"func","func":"relatedness($fore,$back)","${sweep_key:xxx}":"${sweep_val:yyy}"},"skg0":{"min_popularity":"0.001","type":"func","func":"relatedness($fore,$back)","${sweep_key:xxx}":"${sweep_val:yyy}"},"skg1":{"min_popularity":"0.001","type":"func","func":"relatedness({!v%3D'(field_12_multi_ss:44+OR+field_3_multi_ss:50)'},{!v%3D'(field_5_multi_sdsS:50)'})","${sweep_key:xxx}":"${sweep_val:yyy}"}}},"facet_3":{"method":"${method_val:smart}","limit":12,"overrequest":22,"perSeg":true,"sort":"count+asc","refine":true,"type":"terms","field":"field_8_multi_idsS","facet":{"skg":{"type":"func","func":"relatedness($fore,$back)","${sweep_key:xxx}":"${sweep_val:yyy}"},"skg0":{"type":"func","func":"relatedness($fore,$back)","${sweep_key:xxx}":"${sweep_val:yyy}"},"skg1":{"min_popularity":"0.001","type":"func","func":"relatedness({!v%3D'(field_6_multi_ss:15+OR+field_1_multi_sds:47+OR+field_0_multi_ss:8)'},{!v%3D'(field_5_multi_sdsS:41+OR+field_1_multi_sds:37+OR+field_0_multi_ss:49+OR+field_14_multi_sdsS:48+OR+field_13_multi_sds:62+OR+field_5_multi_sdsS:20+OR+field_1_multi_sds:17+OR+field_10_multi_sds:35)'})","${sweep_key:xxx}":"${sweep_val:yyy}"},"sum":"sum(field_4_multi_ids)"}},"skg0":{"min_popularity":"0.001","type":"func","func":"relatedness($fore,$back)","${sweep_key:xxx}":"${sweep_val:yyy}"},"skg1":{"type":"func","func":"relatedness($fore,$back)","${sweep_key:xxx}":"${sweep_val:yyy}"}}}} ===> null facet results?
	at __randomizedtesting.SeedInfo.seed([6BDBFBF78B9E77D8:1997DEF83AFEC1AB]:0)
	at org.apache.solr.search.facet.TestCloudJSONFacetSKGEquiv.assertFacetSKGsAreConsistent(TestCloudJSONFacetSKGEquiv.java:833)
	at org.apache.solr.search.facet.TestCloudJSONFacetSKGEquiv.testRandom(TestCloudJSONFacetSKGEquiv.java:730)
	at java.base/jdk.internal.reflect.DirectMethodHandleAccessor.invoke(DirectMethodHandleAccessor.java:104)
	at java.base/java.lang.reflect.Method.invoke(Method.java:577)
	at com.carrotsearch.randomizedtesting.RandomizedRunner.invoke(RandomizedRunner.java:1758)
	at com.carrotsearch.randomizedtesting.RandomizedRunner$8.evaluate(RandomizedRunner.java:946)
	at com.carrotsearch.randomizedtesting.RandomizedRunner$9.evaluate(RandomizedRunner.java:982)
	at com.carrotsearch.randomizedtesting.RandomizedRunner$10.evaluate(RandomizedRunner.java:996)
	at com.carrotsearch.randomizedtesting.rules.SystemPropertiesRestoreRule$1.evaluate(SystemPropertiesRestoreRule.java:57)
	at org.junit.rules.RunRules.evaluate(RunRules.java:20)
	at org.apache.lucene.util.TestRuleSetupTeardownChained$1.evaluate(TestRuleSetupTeardownChained.java:44)
	at org.apache.lucene.util.AbstractBeforeAfterRule$1.evaluate(AbstractBeforeAfterRule.java:43)
	at org.apache.lucene.util.TestRuleThreadAndTestName$1.evaluate(TestRuleThreadAndTestName.java:45)
	at org.apache.lucene.util.TestRuleIgnoreAfterMaxFailures$1.evaluate(TestRuleIgnoreAfterMaxFailures.java:60)
	at org.apache.lucene.util.TestRuleMarkFailure$1.evaluate(TestRuleMarkFailure.java:44)
	at org.junit.rules.RunRules.evaluate(RunRules.java:20)
	at com.carrotsearch.randomizedtesting.rules.StatementAdapter.evaluate(StatementAdapter.java:36)
	at com.carrotsearch.randomizedtesting.ThreadLeakControl$StatementRunner.run(ThreadLeakControl.java:375)
	at com.carrotsearch.randomizedtesting.ThreadLeakControl.forkTimeoutingTask(ThreadLeakControl.java:824)
	at com.carrotsearch.randomizedtesting.ThreadLeakControl$3.evaluate(ThreadLeakControl.java:475)
	at com.carrotsearch.randomizedtesting.RandomizedRunner.runSingleTest(RandomizedRunner.java:955)
	at com.carrotsearch.randomizedtesting.RandomizedRunner$5.evaluate(RandomizedRunner.java:840)
	at com.carrotsearch.randomizedtesting.RandomizedRunner$6.evaluate(RandomizedRunner.java:891)
	at com.carrotsearch.randomizedtesting.RandomizedRunner$7.evaluate(RandomizedRunner.java:902)
	at com.carrotsearch.randomizedtesting.rules.StatementAdapter.evaluate(StatementAdapter.java:36)
	at org.apache.lucene.util.AbstractBeforeAfterRule$1.evaluate(AbstractBeforeAfterRule.java:43)
	at org.apache.lucene.util.AbstractBeforeAfterRule$1.evaluate(AbstractBeforeAfterRule.java:43)
	at com.carrotsearch.randomizedtesting.rules.SystemPropertiesRestoreRule$1.evaluate(SystemPropertiesRestoreRule.java:57)
	at org.junit.rules.RunRules.evaluate(RunRules.java:20)
	at org.apache.lucene.util.AbstractBeforeAfterRule$1.evaluate(AbstractBeforeAfterRule.java:43)
	at com.carrotsearch.randomizedtesting.rules.StatementAdapter.evaluate(StatementAdapter.java:36)
	at org.apache.lucene.util.TestRuleStoreClassName$1.evaluate(TestRuleStoreClassName.java:38)
	at com.carrotsearch.randomizedtesting.rules.NoShadowingOrOverridesOnMethodsRule$1.evaluate(NoShadowingOrOverridesOnMethodsRule.java:40)
	at com.carrotsearch.randomizedtesting.rules.NoShadowingOrOverridesOnMethodsRule$1.evaluate(NoShadowingOrOverridesOnMethodsRule.java:40)
	at com.carrotsearch.randomizedtesting.rules.StatementAdapter.evaluate(StatementAdapter.java:36)
	at com.carrotsearch.randomizedtesting.rules.StatementAdapter.evaluate(StatementAdapter.java:36)
	at org.apache.lucene.util.TestRuleAssertionsRequired$1.evaluate(TestRuleAssertionsRequired.java:53)
	at org.apache.lucene.util.AbstractBeforeAfterRule$1.evaluate(AbstractBeforeAfterRule.java:43)
	at org.apache.lucene.util.TestRuleMarkFailure$1.evaluate(TestRuleMarkFailure.java:44)
	at org.apache.lucene.util.TestRuleIgnoreAfterMaxFailures$1.evaluate(TestRuleIgnoreAfterMaxFailures.java:60)
	at org.apache.lucene.util.TestRuleIgnoreTestSuites$1.evaluate(TestRuleIgnoreTestSuites.java:47)
	at org.junit.rules.RunRules.evaluate(RunRules.java:20)
	at com.carrotsearch.randomizedtesting.rules.StatementAdapter.evaluate(StatementAdapter.java:36)
	at com.carrotsearch.randomizedtesting.ThreadLeakControl$StatementRunner.run(ThreadLeakControl.java:375)
	at com.carrotsearch.randomizedtesting.ThreadLeakControl.lambda$forkTimeoutingTask$0(ThreadLeakControl.java:831)
	at java.base/java.lang.Thread.run(Thread.java:833)
Caused by: java.lang.AssertionError: null facet results?
	at org.junit.Assert.fail(Assert.java:89)
	at org.junit.Assert.assertTrue(Assert.java:42)
	at org.junit.Assert.assertNotNull(Assert.java:713)
	at org.apache.solr.search.facet.TestCloudJSONFacetSKGEquiv.getFacetResponse(TestCloudJSONFacetSKGEquiv.java:850)
	at org.apache.solr.search.facet.TestCloudJSONFacetSKGEquiv.assertFacetSKGsAreConsistent(TestCloudJSONFacetSKGEquiv.java:810)
	... 45 more