You are viewing a plain text version of this content. The canonical link for it is here.
Posted to builds@beam.apache.org by Apache Jenkins Server <je...@builds.apache.org> on 2019/04/11 12:00:26 UTC

Build failed in Jenkins: beam_PostCommit_Java11_ValidatesRunner_Direct #279

See <https://builds.apache.org/job/beam_PostCommit_Java11_ValidatesRunner_Direct/279/display/redirect>

------------------------------------------
Started by timer
[EnvInject] - Loading node environment variables.
Building remotely on apache-beam-jenkins-12 (beam) in workspace <https://builds.apache.org/job/beam_PostCommit_Java11_ValidatesRunner_Direct/ws/>
No credentials specified
 > git rev-parse --is-inside-work-tree # timeout=10
Fetching changes from the remote Git repository
 > git config remote.origin.url https://github.com/apache/beam.git # timeout=10
Fetching upstream changes from https://github.com/apache/beam.git
 > git --version # timeout=10
 > git fetch --tags --progress https://github.com/apache/beam.git +refs/heads/*:refs/remotes/origin/* +refs/pull/${ghprbPullId}/*:refs/remotes/origin/pr/${ghprbPullId}/*
 > git rev-parse origin/master^{commit} # timeout=10
Checking out Revision 120394be6ca979892bce98bdea6ca01439b22476 (origin/master)
 > git config core.sparsecheckout # timeout=10
 > git checkout -f 120394be6ca979892bce98bdea6ca01439b22476
Commit message: "Merge pull request #8193 from akedin/bq-schema-order"
 > git rev-list --no-walk 120394be6ca979892bce98bdea6ca01439b22476 # timeout=10
Cleaning workspace
 > git rev-parse --verify HEAD # timeout=10
Resetting working tree
 > git reset --hard # timeout=10
 > git clean -fdx # timeout=10
No emails were triggered.
[EnvInject] - Executing scripts and injecting environment variables after the SCM step.
[EnvInject] - Injecting as environment variables the properties content 
SPARK_LOCAL_IP=127.0.0.1

[EnvInject] - Variables injected successfully.
[Gradle] - Launching build.
[src] $ <https://builds.apache.org/job/beam_PostCommit_Java11_ValidatesRunner_Direct/ws/src/gradlew> -Dorg.gradle.java.home=/home/jenkins/tools/java/latest1.8 :beam-runners-direct-java:shadowJar :beam-runners-direct-java:shadowTestJar
Starting a Gradle Daemon, 1 stopped Daemon could not be reused, use --status for details

FAILURE: Build failed with an exception.

* What went wrong:
The newly created daemon process has a different context than expected.
It won't be possible to reconnect to this daemon. Context mismatch: 
Java home is different.
Wanted: DefaultDaemonContext[uid=null,javaHome=/home/jenkins/tools/java/latest1.8,daemonRegistryDir=/home/jenkins/.gradle/daemon,pid=5804,idleTimeout=null,priority=NORMAL,daemonOpts=-Xss10240k,-Dfile.encoding=UTF-8,-Duser.country=US,-Duser.language=en,-Duser.variant]
Actual: DefaultDaemonContext[uid=cc7acec9-b9ed-4a89-a60a-8a5ebb83b3a9,javaHome=/usr/lib/jvm/java-8-openjdk-amd64,daemonRegistryDir=/home/jenkins/.gradle/daemon,pid=5956,idleTimeout=10800000,priority=NORMAL,daemonOpts=-Xss10240k,-Dfile.encoding=UTF-8,-Duser.country=US,-Duser.language=en,-Duser.variant]


* Try:
Run with --stacktrace option to get the stack trace. Run with --info or --debug option to get more log output. Run with --scan to get full insights.

* Get more help at https://help.gradle.org
Build step 'Invoke Gradle script' changed build result to FAILURE
Build step 'Invoke Gradle script' marked build as failure

---------------------------------------------------------------------
To unsubscribe, e-mail: builds-unsubscribe@beam.apache.org
For additional commands, e-mail: builds-help@beam.apache.org


Jenkins build is back to normal : beam_PostCommit_Java11_ValidatesRunner_Direct #282

Posted by Apache Jenkins Server <je...@builds.apache.org>.
See <https://builds.apache.org/job/beam_PostCommit_Java11_ValidatesRunner_Direct/282/display/redirect?page=changes>


---------------------------------------------------------------------
To unsubscribe, e-mail: builds-unsubscribe@beam.apache.org
For additional commands, e-mail: builds-help@beam.apache.org


Build failed in Jenkins: beam_PostCommit_Java11_ValidatesRunner_Direct #281

Posted by Apache Jenkins Server <je...@builds.apache.org>.
See <https://builds.apache.org/job/beam_PostCommit_Java11_ValidatesRunner_Direct/281/display/redirect?page=changes>

Changes:

[kcweaver] [BEAM-6935] Spark portable runner: implement side inputs

------------------------------------------
Started by GitHub push by iemejia
[EnvInject] - Loading node environment variables.
Building remotely on apache-beam-jenkins-2 (beam) in workspace <https://builds.apache.org/job/beam_PostCommit_Java11_ValidatesRunner_Direct/ws/>
No credentials specified
 > git rev-parse --is-inside-work-tree # timeout=10
Fetching changes from the remote Git repository
 > git config remote.origin.url https://github.com/apache/beam.git # timeout=10
Fetching upstream changes from https://github.com/apache/beam.git
 > git --version # timeout=10
 > git fetch --tags --progress https://github.com/apache/beam.git +refs/heads/*:refs/remotes/origin/* +refs/pull/${ghprbPullId}/*:refs/remotes/origin/pr/${ghprbPullId}/*
 > git rev-parse origin/master^{commit} # timeout=10
Checking out Revision 16b58ad03da929d29e0710ce79df7a562d83bbc5 (origin/master)
 > git config core.sparsecheckout # timeout=10
 > git checkout -f 16b58ad03da929d29e0710ce79df7a562d83bbc5
Commit message: "Merge pull request #8220: [BEAM-6935] Spark portable runner: implement side inputs"
 > git rev-list --no-walk 702df1ba888e7988cde83f57107822bcc41fe244 # timeout=10
Cleaning workspace
 > git rev-parse --verify HEAD # timeout=10
Resetting working tree
 > git reset --hard # timeout=10
 > git clean -fdx # timeout=10
No emails were triggered.
[EnvInject] - Executing scripts and injecting environment variables after the SCM step.
[EnvInject] - Injecting as environment variables the properties content 
SPARK_LOCAL_IP=127.0.0.1

[EnvInject] - Variables injected successfully.
[Gradle] - Launching build.
[src] $ <https://builds.apache.org/job/beam_PostCommit_Java11_ValidatesRunner_Direct/ws/src/gradlew> -Dorg.gradle.java.home=/home/jenkins/tools/java/latest1.8 :beam-runners-direct-java:shadowJar :beam-runners-direct-java:shadowTestJar
Starting a Gradle Daemon, 1 busy Daemon could not be reused, use --status for details

FAILURE: Build failed with an exception.

* What went wrong:
The newly created daemon process has a different context than expected.
It won't be possible to reconnect to this daemon. Context mismatch: 
Java home is different.
Wanted: DefaultDaemonContext[uid=null,javaHome=/home/jenkins/tools/java/latest1.8,daemonRegistryDir=/home/jenkins/.gradle/daemon,pid=24485,idleTimeout=null,priority=NORMAL,daemonOpts=-Xss10240k,-Dfile.encoding=UTF-8,-Duser.country=US,-Duser.language=en,-Duser.variant]
Actual: DefaultDaemonContext[uid=f2db1b6f-f681-4718-9c7a-ca7c0b0afad8,javaHome=/usr/lib/jvm/java-8-openjdk-amd64,daemonRegistryDir=/home/jenkins/.gradle/daemon,pid=24614,idleTimeout=10800000,priority=NORMAL,daemonOpts=-Xss10240k,-Dfile.encoding=UTF-8,-Duser.country=US,-Duser.language=en,-Duser.variant]


* Try:
Run with --stacktrace option to get the stack trace. Run with --info or --debug option to get more log output. Run with --scan to get full insights.

* Get more help at https://help.gradle.org
Build step 'Invoke Gradle script' changed build result to FAILURE
Build step 'Invoke Gradle script' marked build as failure

---------------------------------------------------------------------
To unsubscribe, e-mail: builds-unsubscribe@beam.apache.org
For additional commands, e-mail: builds-help@beam.apache.org


Build failed in Jenkins: beam_PostCommit_Java11_ValidatesRunner_Direct #280

Posted by Apache Jenkins Server <je...@builds.apache.org>.
See <https://builds.apache.org/job/beam_PostCommit_Java11_ValidatesRunner_Direct/280/display/redirect?page=changes>

Changes:

[jbonofre] [BEAM-7041] Let the user control if he wants to wrap the provided

------------------------------------------
Started by GitHub push by aromanenko-dev
[EnvInject] - Loading node environment variables.
Building remotely on apache-beam-jenkins-1 (beam) in workspace <https://builds.apache.org/job/beam_PostCommit_Java11_ValidatesRunner_Direct/ws/>
No credentials specified
Cloning the remote Git repository
Cloning repository https://github.com/apache/beam.git
 > git init <https://builds.apache.org/job/beam_PostCommit_Java11_ValidatesRunner_Direct/ws/src> # timeout=10
Fetching upstream changes from https://github.com/apache/beam.git
 > git --version # timeout=10
 > git fetch --tags --progress https://github.com/apache/beam.git +refs/heads/*:refs/remotes/origin/*
 > git config remote.origin.url https://github.com/apache/beam.git # timeout=10
 > git config --add remote.origin.fetch +refs/heads/*:refs/remotes/origin/* # timeout=10
 > git config remote.origin.url https://github.com/apache/beam.git # timeout=10
Fetching upstream changes from https://github.com/apache/beam.git
 > git fetch --tags --progress https://github.com/apache/beam.git +refs/heads/*:refs/remotes/origin/* +refs/pull/${ghprbPullId}/*:refs/remotes/origin/pr/${ghprbPullId}/*
 > git rev-parse origin/master^{commit} # timeout=10
Checking out Revision 702df1ba888e7988cde83f57107822bcc41fe244 (origin/master)
 > git config core.sparsecheckout # timeout=10
 > git checkout -f 702df1ba888e7988cde83f57107822bcc41fe244
Commit message: "Merge pull request #8257: [BEAM-7041] Let the user control if he wants to wrap the provided DataSource as a poolable one or not"
 > git rev-list --no-walk 120394be6ca979892bce98bdea6ca01439b22476 # timeout=10
Cleaning workspace
 > git rev-parse --verify HEAD # timeout=10
Resetting working tree
 > git reset --hard # timeout=10
 > git clean -fdx # timeout=10
No emails were triggered.
[EnvInject] - Executing scripts and injecting environment variables after the SCM step.
[EnvInject] - Injecting as environment variables the properties content 
SPARK_LOCAL_IP=127.0.0.1

[EnvInject] - Variables injected successfully.
[Gradle] - Launching build.
[src] $ <https://builds.apache.org/job/beam_PostCommit_Java11_ValidatesRunner_Direct/ws/src/gradlew> -Dorg.gradle.java.home=/home/jenkins/tools/java/latest1.8 :beam-runners-direct-java:shadowJar :beam-runners-direct-java:shadowTestJar
Starting a Gradle Daemon (subsequent builds will be faster)

FAILURE: Build failed with an exception.

* What went wrong:
The newly created daemon process has a different context than expected.
It won't be possible to reconnect to this daemon. Context mismatch: 
Java home is different.
Wanted: DefaultDaemonContext[uid=null,javaHome=/home/jenkins/tools/java/latest1.8,daemonRegistryDir=/home/jenkins/.gradle/daemon,pid=32632,idleTimeout=null,priority=NORMAL,daemonOpts=-Xss10240k,-Dfile.encoding=UTF-8,-Duser.country=US,-Duser.language=en,-Duser.variant]
Actual: DefaultDaemonContext[uid=9eb94658-6b5c-4c4e-8992-50901d88744c,javaHome=/usr/lib/jvm/java-8-openjdk-amd64,daemonRegistryDir=/home/jenkins/.gradle/daemon,pid=324,idleTimeout=10800000,priority=NORMAL,daemonOpts=-Xss10240k,-Dfile.encoding=UTF-8,-Duser.country=US,-Duser.language=en,-Duser.variant]


* Try:
Run with --stacktrace option to get the stack trace. Run with --info or --debug option to get more log output. Run with --scan to get full insights.

* Get more help at https://help.gradle.org
Build step 'Invoke Gradle script' changed build result to FAILURE
Build step 'Invoke Gradle script' marked build as failure

---------------------------------------------------------------------
To unsubscribe, e-mail: builds-unsubscribe@beam.apache.org
For additional commands, e-mail: builds-help@beam.apache.org