You are viewing a plain text version of this content. The canonical link for it is here.
Posted to dev@lucene.apache.org by Apache Jenkins Server <je...@builds.apache.org> on 2016/08/01 08:51:41 UTC

[JENKINS] Lucene-Solr-Tests-6.x - Build # 362 - Unstable

Build: https://builds.apache.org/job/Lucene-Solr-Tests-6.x/362/

1 tests failed.
FAILED:  org.apache.solr.cloud.ForceLeaderTest.testReplicasInLIRNoLeader

Error Message:
org.apache.solr.client.solrj.SolrServerException: No live SolrServers available to handle this request:[http://127.0.0.1:41723/forceleader_test_collection_shard1_replica2]

Stack Trace:
org.apache.solr.client.solrj.SolrServerException: org.apache.solr.client.solrj.SolrServerException: No live SolrServers available to handle this request:[http://127.0.0.1:41723/forceleader_test_collection_shard1_replica2]
	at __randomizedtesting.SeedInfo.seed([C7C6A232BD38FDDE:215196F284BA04BF]:0)
	at org.apache.solr.client.solrj.impl.CloudSolrClient.directUpdate(CloudSolrClient.java:774)
	at org.apache.solr.client.solrj.impl.CloudSolrClient.sendRequest(CloudSolrClient.java:1172)
	at org.apache.solr.client.solrj.impl.CloudSolrClient.requestWithRetryOnStaleState(CloudSolrClient.java:1061)
	at org.apache.solr.client.solrj.impl.CloudSolrClient.request(CloudSolrClient.java:997)
	at org.apache.solr.cloud.AbstractFullDistribZkTestBase.sendDocsWithRetry(AbstractFullDistribZkTestBase.java:753)
	at org.apache.solr.cloud.AbstractFullDistribZkTestBase.sendDocsWithRetry(AbstractFullDistribZkTestBase.java:741)
	at org.apache.solr.cloud.ForceLeaderTest.sendDoc(ForceLeaderTest.java:424)
	at org.apache.solr.cloud.ForceLeaderTest.assertSendDocFails(ForceLeaderTest.java:315)
	at org.apache.solr.cloud.ForceLeaderTest.testReplicasInLIRNoLeader(ForceLeaderTest.java:110)
	at sun.reflect.NativeMethodAccessorImpl.invoke0(Native Method)
	at sun.reflect.NativeMethodAccessorImpl.invoke(NativeMethodAccessorImpl.java:62)
	at sun.reflect.DelegatingMethodAccessorImpl.invoke(DelegatingMethodAccessorImpl.java:43)
	at java.lang.reflect.Method.invoke(Method.java:498)
	at com.carrotsearch.randomizedtesting.RandomizedRunner.invoke(RandomizedRunner.java:1764)
	at com.carrotsearch.randomizedtesting.RandomizedRunner$8.evaluate(RandomizedRunner.java:871)
	at com.carrotsearch.randomizedtesting.RandomizedRunner$9.evaluate(RandomizedRunner.java:907)
	at com.carrotsearch.randomizedtesting.RandomizedRunner$10.evaluate(RandomizedRunner.java:921)
	at org.apache.solr.BaseDistributedSearchTestCase$ShardsRepeatRule$ShardsFixedStatement.callStatement(BaseDistributedSearchTestCase.java:992)
	at org.apache.solr.BaseDistributedSearchTestCase$ShardsRepeatRule$ShardsStatement.evaluate(BaseDistributedSearchTestCase.java:967)
	at com.carrotsearch.randomizedtesting.rules.SystemPropertiesRestoreRule$1.evaluate(SystemPropertiesRestoreRule.java:57)
	at org.apache.lucene.util.TestRuleSetupTeardownChained$1.evaluate(TestRuleSetupTeardownChained.java:49)
	at org.apache.lucene.util.AbstractBeforeAfterRule$1.evaluate(AbstractBeforeAfterRule.java:45)
	at org.apache.lucene.util.TestRuleThreadAndTestName$1.evaluate(TestRuleThreadAndTestName.java:48)
	at org.apache.lucene.util.TestRuleIgnoreAfterMaxFailures$1.evaluate(TestRuleIgnoreAfterMaxFailures.java:64)
	at org.apache.lucene.util.TestRuleMarkFailure$1.evaluate(TestRuleMarkFailure.java:47)
	at com.carrotsearch.randomizedtesting.rules.StatementAdapter.evaluate(StatementAdapter.java:36)
	at com.carrotsearch.randomizedtesting.ThreadLeakControl$StatementRunner.run(ThreadLeakControl.java:367)
	at com.carrotsearch.randomizedtesting.ThreadLeakControl.forkTimeoutingTask(ThreadLeakControl.java:809)
	at com.carrotsearch.randomizedtesting.ThreadLeakControl$3.evaluate(ThreadLeakControl.java:460)
	at com.carrotsearch.randomizedtesting.RandomizedRunner.runSingleTest(RandomizedRunner.java:880)
	at com.carrotsearch.randomizedtesting.RandomizedRunner$5.evaluate(RandomizedRunner.java:781)
	at com.carrotsearch.randomizedtesting.RandomizedRunner$6.evaluate(RandomizedRunner.java:816)
	at com.carrotsearch.randomizedtesting.RandomizedRunner$7.evaluate(RandomizedRunner.java:827)
	at com.carrotsearch.randomizedtesting.rules.StatementAdapter.evaluate(StatementAdapter.java:36)
	at com.carrotsearch.randomizedtesting.rules.SystemPropertiesRestoreRule$1.evaluate(SystemPropertiesRestoreRule.java:57)
	at org.apache.lucene.util.AbstractBeforeAfterRule$1.evaluate(AbstractBeforeAfterRule.java:45)
	at com.carrotsearch.randomizedtesting.rules.StatementAdapter.evaluate(StatementAdapter.java:36)
	at org.apache.lucene.util.TestRuleStoreClassName$1.evaluate(TestRuleStoreClassName.java:41)
	at com.carrotsearch.randomizedtesting.rules.NoShadowingOrOverridesOnMethodsRule$1.evaluate(NoShadowingOrOverridesOnMethodsRule.java:40)
	at com.carrotsearch.randomizedtesting.rules.NoShadowingOrOverridesOnMethodsRule$1.evaluate(NoShadowingOrOverridesOnMethodsRule.java:40)
	at com.carrotsearch.randomizedtesting.rules.StatementAdapter.evaluate(StatementAdapter.java:36)
	at com.carrotsearch.randomizedtesting.rules.StatementAdapter.evaluate(StatementAdapter.java:36)
	at com.carrotsearch.randomizedtesting.rules.StatementAdapter.evaluate(StatementAdapter.java:36)
	at org.apache.lucene.util.TestRuleAssertionsRequired$1.evaluate(TestRuleAssertionsRequired.java:53)
	at org.apache.lucene.util.TestRuleMarkFailure$1.evaluate(TestRuleMarkFailure.java:47)
	at org.apache.lucene.util.TestRuleIgnoreAfterMaxFailures$1.evaluate(TestRuleIgnoreAfterMaxFailures.java:64)
	at org.apache.lucene.util.TestRuleIgnoreTestSuites$1.evaluate(TestRuleIgnoreTestSuites.java:54)
	at com.carrotsearch.randomizedtesting.rules.StatementAdapter.evaluate(StatementAdapter.java:36)
	at com.carrotsearch.randomizedtesting.ThreadLeakControl$StatementRunner.run(ThreadLeakControl.java:367)
	at java.lang.Thread.run(Thread.java:745)
Caused by: org.apache.solr.client.solrj.SolrServerException: No live SolrServers available to handle this request:[http://127.0.0.1:41723/forceleader_test_collection_shard1_replica2]
	at org.apache.solr.client.solrj.impl.LBHttpSolrClient.request(LBHttpSolrClient.java:383)
	at org.apache.solr.client.solrj.impl.CloudSolrClient.directUpdate(CloudSolrClient.java:768)
	... 49 more
Caused by: org.apache.solr.client.solrj.SolrServerException: Server refused connection at: http://127.0.0.1:41723/forceleader_test_collection_shard1_replica2
	at org.apache.solr.client.solrj.impl.HttpSolrClient.executeMethod(HttpSolrClient.java:597)
	at org.apache.solr.client.solrj.impl.HttpSolrClient.request(HttpSolrClient.java:259)
	at org.apache.solr.client.solrj.impl.HttpSolrClient.request(HttpSolrClient.java:248)
	at org.apache.solr.client.solrj.impl.LBHttpSolrClient.doRequest(LBHttpSolrClient.java:403)
	at org.apache.solr.client.solrj.impl.LBHttpSolrClient.request(LBHttpSolrClient.java:372)
	... 50 more
Caused by: java.net.ConnectException: Connection refused
	at java.net.PlainSocketImpl.socketConnect(Native Method)
	at java.net.AbstractPlainSocketImpl.doConnect(AbstractPlainSocketImpl.java:350)
	at java.net.AbstractPlainSocketImpl.connectToAddress(AbstractPlainSocketImpl.java:206)
	at java.net.AbstractPlainSocketImpl.connect(AbstractPlainSocketImpl.java:188)
	at java.net.SocksSocketImpl.connect(SocksSocketImpl.java:392)
	at java.net.Socket.connect(Socket.java:589)
	at org.apache.http.conn.scheme.PlainSocketFactory.connectSocket(PlainSocketFactory.java:117)
	at org.apache.http.impl.conn.DefaultClientConnectionOperator.openConnection(DefaultClientConnectionOperator.java:177)
	at org.apache.http.impl.conn.ManagedClientConnectionImpl.open(ManagedClientConnectionImpl.java:304)
	at org.apache.http.impl.client.DefaultRequestDirector.tryConnect(DefaultRequestDirector.java:611)
	at org.apache.http.impl.client.DefaultRequestDirector.execute(DefaultRequestDirector.java:446)
	at org.apache.http.impl.client.AbstractHttpClient.doExecute(AbstractHttpClient.java:882)
	at org.apache.http.impl.client.CloseableHttpClient.execute(CloseableHttpClient.java:82)
	at org.apache.http.impl.client.CloseableHttpClient.execute(CloseableHttpClient.java:107)
	at org.apache.http.impl.client.CloseableHttpClient.execute(CloseableHttpClient.java:55)
	at org.apache.solr.client.solrj.impl.HttpSolrClient.executeMethod(HttpSolrClient.java:495)
	... 54 more




Build Log:
Started by timer

Started by timer

Started by timer

Started by timer

Started by timer

Started by timer

[EnvInject] - Loading node environment variables.

Building remotely on lucene in workspace /home/jenkins/jenkins-slave/workspace/Lucene-Solr-Tests-6.x

 > git rev-parse --is-inside-work-tree # timeout=10

Fetching changes from the remote Git repository

 > git config remote.origin.url git://git.apache.org/lucene-solr.git # timeout=10

Cleaning workspace

 > git rev-parse --verify HEAD # timeout=10

Resetting working tree

 > git reset --hard # timeout=10

 > git clean -fdx # timeout=10

Fetching upstream changes from git://git.apache.org/lucene-solr.git

 > git --version # timeout=10

 > git -c core.askpass=true fetch --tags --progress git://git.apache.org/lucene-solr.git +refs/heads/*:refs/remotes/origin/*

 > git rev-parse refs/remotes/origin/branch_6x^{commit} # timeout=10

 > git rev-parse refs/remotes/origin/origin/branch_6x^{commit} # timeout=10

Checking out Revision 0dc1cf5ddda83240ed05df86d414a1f7a0e8d44e (refs/remotes/origin/branch_6x)

 > git config core.sparsecheckout # timeout=10

 > git checkout -f 0dc1cf5ddda83240ed05df86d414a1f7a0e8d44e

 > git rev-list 0dc1cf5ddda83240ed05df86d414a1f7a0e8d44e # timeout=10

No emails were triggered.

[Lucene-Solr-Tests-6.x] $ /home/jenkins/jenkins-slave/tools/hudson.tasks.Ant_AntInstallation/ant-1.8.2/bin/ant jenkins-hourly

Buildfile: /x1/jenkins/jenkins-slave/workspace/Lucene-Solr-Tests-6.x/build.xml


jenkins-hourly:


-print-java-info:

[java-info] java version "1.8.0_74"

[java-info] Java(TM) SE Runtime Environment (1.8.0_74-b02, Oracle Corporation)

[java-info] Java HotSpot(TM) 64-Bit Server VM (25.74-b02, Oracle Corporation)

[java-info] Test args: []


clean:


clean:


clean:


ivy-availability-check:


ivy-fail:


ivy-configure:

[ivy:configure] :: Apache Ivy 2.3.0 - 20130110142753 :: http://ant.apache.org/ivy/ ::

[ivy:configure] :: loading settings :: file = /x1/jenkins/jenkins-slave/workspace/Lucene-Solr-Tests-6.x/lucene/top-level-ivy-settings.xml


resolve-groovy:

[ivy:cachepath] :: resolving dependencies :: org.codehaus.groovy#groovy-all-caller;working

[ivy:cachepath] 	confs: [default]

[ivy:cachepath] 	found org.codehaus.groovy#groovy-all;2.4.6 in public

[ivy:cachepath] :: resolution report :: resolve 89ms :: artifacts dl 1ms

	---------------------------------------------------------------------

	|                  |            modules            ||   artifacts   |

	|       conf       | number| search|dwnlded|evicted|| number|dwnlded|

	---------------------------------------------------------------------

	|      default     |   1   |   0   |   0   |   0   ||   1   |   0   |

	---------------------------------------------------------------------


-test-with-heapdumps-enabled:

     [echo] Java HotSpot(TM) 64-Bit Server VM: Enabling heap dumps on OutOfMemoryError to dir '/x1/jenkins/jenkins-slave/workspace/Lucene-Solr-Tests-6.x/heapdumps'.

    [mkdir] Created dir: /x1/jenkins/jenkins-slave/workspace/Lucene-Solr-Tests-6.x/heapdumps


ivy-availability-check:


ivy-fail:


ivy-configure:

[ivy:configure] :: loading settings :: file = /x1/jenkins/jenkins-slave/workspace/Lucene-Solr-Tests-6.x/lucene/top-level-ivy-settings.xml


resolve-groovy:


test:


ivy-availability-check:


ivy-fail:


ivy-configure:

[ivy:configure] :: loading settings :: file = /x1/jenkins/jenkins-slave/workspace/Lucene-Solr-Tests-6.x/lucene/top-level-ivy-settings.xml


-clover.load:


resolve-groovy:


-init-totals:


test-core:


-clover.disable:


ivy-availability-check:


ivy-fail:


ivy-configure:

[ivy:configure] :: loading settings :: file = /x1/jenkins/jenkins-slave/workspace/Lucene-Solr-Tests-6.x/lucene/top-level-ivy-settings.xml


-clover.load:


-clover.classpath:


-clover.setup:


clover:


-check-git-state:


-git-cleanroot:


-copy-git-state:

     [copy] Copying 1 file to /x1/jenkins/jenkins-slave/workspace/Lucene-Solr-Tests-6.x/lucene/build


git-autoclean:


resolve:


init:


compile-core:

    [mkdir] Created dir: /x1/jenkins/jenkins-slave/workspace/Lucene-Solr-Tests-6.x/lucene/build/core/classes/java

    [javac] Compiling 782 source files to /x1/jenkins/jenkins-slave/workspace/Lucene-Solr-Tests-6.x/lucene/build/core/classes/java

    [javac] Note: Some input files use or override a deprecated API.

    [javac] Note: Recompile with -Xlint:deprecation for details.

    [javac] Creating empty /x1/jenkins/jenkins-slave/workspace/Lucene-Solr-Tests-6.x/lucene/build/core/classes/java/org/apache/lucene/document/package-info.class

    [javac] Creating empty /x1/jenkins/jenkins-slave/workspace/Lucene-Solr-Tests-6.x/lucene/build/core/classes/java/org/apache/lucene/package-info.class

    [javac] Creating empty /x1/jenkins/jenkins-slave/workspace/Lucene-Solr-Tests-6.x/lucene/build/core/classes/java/org/apache/lucene/util/bkd/package-info.class

    [javac] Creating empty /x1/jenkins/jenkins-slave/workspace/Lucene-Solr-Tests-6.x/lucene/build/core/classes/java/org/apache/lucene/codecs/compressing/package-info.class

    [javac] Creating empty /x1/jenkins/jenkins-slave/workspace/Lucene-Solr-Tests-6.x/lucene/build/core/classes/java/org/apache/lucene/codecs/lucene60/package-info.class

    [javac] Creating empty /x1/jenkins/jenkins-slave/workspace/Lucene-Solr-Tests-6.x/lucene/build/core/classes/java/org/apache/lucene/codecs/package-info.class

    [javac] Creating empty /x1/jenkins/jenkins-slave/workspace/Lucene-Solr-Tests-6.x/lucene/build/core/classes/java/org/apache/lucene/util/package-info.class

    [javac] Creating empty /x1/jenkins/jenkins-slave/workspace/Lucene-Solr-Tests-6.x/lucene/build/core/classes/java/org/apache/lucene/index/package-info.class

    [javac] Creating empty /x1/jenkins/jenkins-slave/workspace/Lucene-Solr-Tests-6.x/lucene/build/core/classes/java/org/apache/lucene/util/fst/package-info.class

    [javac] Creating empty /x1/jenkins/jenkins-slave/workspace/Lucene-Solr-Tests-6.x/lucene/build/core/classes/java/org/apache/lucene/analysis/tokenattributes/package-info.class

    [javac] Creating empty /x1/jenkins/jenkins-slave/workspace/Lucene-Solr-Tests-6.x/lucene/build/core/classes/java/org/apache/lucene/search/package-info.class

    [javac] Creating empty /x1/jenkins/jenkins-slave/workspace/Lucene-Solr-Tests-6.x/lucene/build/core/classes/java/org/apache/lucene/codecs/lucene62/package-info.class

    [javac] Creating empty /x1/jenkins/jenkins-slave/workspace/Lucene-Solr-Tests-6.x/lucene/build/core/classes/java/org/apache/lucene/util/packed/package-info.class

    [javac] Creating empty /x1/jenkins/jenkins-slave/workspace/Lucene-Solr-Tests-6.x/lucene/build/core/classes/java/org/apache/lucene/util/mutable/package-info.class

    [javac] Creating empty /x1/jenkins/jenkins-slave/workspace/Lucene-Solr-Tests-6.x/lucene/build/core/classes/java/org/apache/lucene/codecs/perfield/package-info.class

    [javac] Creating empty /x1/jenkins/jenkins-slave/workspace/Lucene-Solr-Tests-6.x/lucene/build/core/classes/java/org/apache/lucene/analysis/package-info.class

    [javac] Creating empty /x1/jenkins/jenkins-slave/workspace/Lucene-Solr-Tests-6.x/lucene/build/core/classes/java/org/apache/lucene/analysis/standard/package-info.class

    [javac] Creating empty /x1/jenkins/jenkins-slave/workspace/Lucene-Solr-Tests-6.x/lucene/build/core/classes/java/org/apache/lucene/store/package-info.class

    [javac] Creating empty /x1/jenkins/jenkins-slave/workspace/Lucene-Solr-Tests-6.x/lucene/build/core/classes/java/org/apache/lucene/codecs/blocktree/package-info.class

    [javac] Creating empty /x1/jenkins/jenkins-slave/workspace/Lucene-Solr-Tests-6.x/lucene/build/core/classes/java/org/apache/lucene/search/spans/package-info.class

    [javac] Creating empty /x1/jenkins/jenkins-slave/workspace/Lucene-Solr-Tests-6.x/lucene/build/core/classes/java/org/apache/lucene/codecs/lucene54/package-info.class

    [javac] Creating empty /x1/jenkins/jenkins-slave/workspace/Lucene-Solr-Tests-6.x/lucene/build/core/classes/java/org/apache/lucene/search/similarities/package-info.class

    [javac] Creating empty /x1/jenkins/jenkins-slave/workspace/Lucene-Solr-Tests-6.x/lucene/build/core/classes/java/org/apache/lucene/util/automaton/package-info.class

    [javac] Creating empty /x1/jenkins/jenkins-slave/workspace/Lucene-Solr-Tests-6.x/lucene/build/core/classes/java/org/apache/lucene/codecs/lucene53/package-info.class

    [javac] Creating empty /x1/jenkins/jenkins-slave/workspace/Lucene-Solr-Tests-6.x/lucene/build/core/classes/java/org/apache/lucene/codecs/lucene50/package-info.class

    [javac] Creating empty /x1/jenkins/jenkins-slave/workspace/Lucene-Solr-Tests-6.x/lucene/build/core/classes/java/org/apache/lucene/geo/package-info.class

     [copy] Copying 3 files to /x1/jenkins/jenkins-slave/workspace/Lucene-Solr-Tests-6.x/lucene/build/core/classes/java


compile-test-framework:


-check-git-state:


-git-cleanroot:


-copy-git-state:


git-autoclean:


ivy-availability-check:


ivy-fail:


ivy-configure:

[ivy:configure] :: loading settings :: file = /x1/jenkins/jenkins-slave/workspace/Lucene-Solr-Tests-6.x/lucene/top-level-ivy-settings.xml


resolve:


init:


compile-lucene-core:


-check-git-state:


-git-cleanroot:


-copy-git-state:


git-autoclean:


ivy-availability-check:


ivy-fail:


ivy-configure:

[ivy:configure] :: loading settings :: file = /x1/jenkins/jenkins-slave/workspace/Lucene-Solr-Tests-6.x/lucene/top-level-ivy-settings.xml


resolve:


init:


-clover.disable:


-clover.load:


-clover.classpath:


-clover.setup:


clover:


compile-core:


compile-codecs:


-check-git-state:


-git-cleanroot:


-copy-git-state:


git-autoclean:


ivy-availability-check:


ivy-fail:


ivy-configure:

[ivy:configure] :: loading settings :: file = /x1/jenkins/jenkins-slave/workspace/Lucene-Solr-Tests-6.x/lucene/top-level-ivy-settings.xml


resolve:


common.init:


compile-lucene-core:


init:


-clover.disable:


-clover.load:


-clover.classpath:


-clover.setup:


clover:


compile-core:

    [mkdir] Created dir: /x1/jenkins/jenkins-slave/workspace/Lucene-Solr-Tests-6.x/lucene/build/codecs/classes/java

    [javac] Compiling 66 source files to /x1/jenkins/jenkins-slave/workspace/Lucene-Solr-Tests-6.x/lucene/build/codecs/classes/java

    [javac] Creating empty /x1/jenkins/jenkins-slave/workspace/Lucene-Solr-Tests-6.x/lucene/build/codecs/classes/java/org/apache/lucene/codecs/bloom/package-info.class

    [javac] Creating empty /x1/jenkins/jenkins-slave/workspace/Lucene-Solr-Tests-6.x/lucene/build/codecs/classes/java/org/apache/lucene/codecs/memory/package-info.class

    [javac] Creating empty /x1/jenkins/jenkins-slave/workspace/Lucene-Solr-Tests-6.x/lucene/build/codecs/classes/java/org/apache/lucene/codecs/simpletext/package-info.class

    [javac] Creating empty /x1/jenkins/jenkins-slave/workspace/Lucene-Solr-Tests-6.x/lucene/build/codecs/classes/java/org/apache/lucene/codecs/blockterms/package-info.class

    [javac] Creating empty /x1/jenkins/jenkins-slave/workspace/Lucene-Solr-Tests-6.x/lucene/build/codecs/classes/java/org/apache/lucene/codecs/blocktreeords/package-info.class

     [copy] Copying 3 files to /x1/jenkins/jenkins-slave/workspace/Lucene-Solr-Tests-6.x/lucene/build/codecs/classes/java


-clover.disable:


-clover.load:


-clover.classpath:


-clover.setup:


clover:


common.compile-core:

    [mkdir] Created dir: /x1/jenkins/jenkins-slave/workspace/Lucene-Solr-Tests-6.x/lucene/build/test-framework/classes/java

    [javac] Compiling 185 source files to /x1/jenkins/jenkins-slave/workspace/Lucene-Solr-Tests-6.x/lucene/build/test-framework/classes/java

    [javac] Note: Some input files use or override a deprecated API.

    [javac] Note: Recompile with -Xlint:deprecation for details.

    [javac] Creating empty /x1/jenkins/jenkins-slave/workspace/Lucene-Solr-Tests-6.x/lucene/build/test-framework/classes/java/org/apache/lucene/codecs/asserting/package-info.class

    [javac] Creating empty /x1/jenkins/jenkins-slave/workspace/Lucene-Solr-Tests-6.x/lucene/build/test-framework/classes/java/org/apache/lucene/codecs/ramonly/package-info.class

    [javac] Creating empty /x1/jenkins/jenkins-slave/workspace/Lucene-Solr-Tests-6.x/lucene/build/test-framework/classes/java/org/apache/lucene/mockfile/package-info.class

    [javac] Creating empty /x1/jenkins/jenkins-slave/workspace/Lucene-Solr-Tests-6.x/lucene/build/test-framework/classes/java/org/apache/lucene/codecs/cheapbastard/package-info.class

    [javac] Creating empty /x1/jenkins/jenkins-slave/workspace/Lucene-Solr-Tests-6.x/lucene/build/test-framework/classes/java/org/apache/lucene/codecs/mockrandom/package-info.class

    [javac] Creating empty /x1/jenkins/jenkins-slave/workspace/Lucene-Solr-Tests-6.x/lucene/build/test-framework/classes/java/org/apache/lucene/codecs/cranky/package-info.class

    [javac] Creating empty /x1/jenkins/jenkins-slave/workspace/Lucene-Solr-Tests-6.x/lucene/build/test-framework/classes/java/org/apache/lucene/codecs/compressing/dummy/package-info.class

     [copy] Copying 4 files to /x1/jenkins/jenkins-slave/workspace/Lucene-Solr-Tests-6.x/lucene/build/test-framework/classes/java


compile-core:


compile-test:

    [mkdir] Created dir: /x1/jenkins/jenkins-slave/workspace/Lucene-Solr-Tests-6.x/lucene/build/core/classes/test

    [javac] Compiling 445 source files to /x1/jenkins/jenkins-slave/workspace/Lucene-Solr-Tests-6.x/lucene/build/core/classes/test

    [javac] Note: Some input files use or override a deprecated API.

    [javac] Note: Recompile with -Xlint:deprecation for details.

     [copy] Copying 3 files to /x1/jenkins/jenkins-slave/workspace/Lucene-Solr-Tests-6.x/lucene/build/core/classes/test


install-junit4-taskdef:


validate:


resolve-groovy:


-init-totals:


-test:

    [mkdir] Created dir: /x1/jenkins/jenkins-slave/workspace/Lucene-Solr-Tests-6.x/lucene/build/core/test

[loadresource] Do not set property tests.explicitclass as its length is 0.

    [mkdir] Created dir: /x1/jenkins/jenkins-slave/workspace/Lucene-Solr-Tests-6.x/lucene/build/core/test/temp

    [mkdir] Created dir: /x1/jenkins/jenkins-slave/workspace/Lucene-Solr-Tests-6.x/.caches/test-stats/core

   [junit4] <JUnit4> says नमस्ते! Master seed: 3590E36E82CADC8F

   [junit4] Executing 438 suites with 3 JVMs.

   [junit4] 

   [junit4] Started J0 PID(6431@localhost).

   [junit4] Started J2 PID(6437@localhost).

   [junit4] Started J1 PID(6438@localhost).

   [junit4] Suite: org.apache.lucene.search.TestConjunctions

   [junit4] Completed [1/438] on J2 in 1.20s, 1 test

   [junit4] 

   [junit4] Suite: org.apache.lucene.search.TestMultiPhraseQuery

   [junit4] Completed [2/438] on J0 in 1.56s, 17 tests, 1 skipped

   [junit4] 

   [junit4] Suite: org.apache.lucene.search.TestElevationComparator

   [junit4] Completed [3/438] on J2 in 0.38s, 1 test

   [junit4] 

   [junit4] Suite: org.apache.lucene.search.TestPrefixRandom

   [junit4] Completed [4/438] on J1 in 2.22s, 1 test

   [junit4] 

   [junit4] Suite: org.apache.lucene.search.TestPhraseQuery

   [junit4] Completed [5/438] on J0 in 4.21s, 21 tests

   [junit4] 

   [junit4] Suite: org.apache.lucene.search.TestDocValuesRewriteMethod

   [junit4] Completed [6/438] on J2 in 4.70s, 2 tests

   [junit4] 

   [junit4] Suite: org.apache.lucene.search.TestRegexpRandom2

   [junit4] Completed [7/438] on J1 in 4.94s, 1 test

   [junit4] 

   [junit4] Suite: org.apache.lucene.search.TestRegexpRandom

   [junit4] Completed [8/438] on J1 in 0.89s, 1 test

   [junit4] 

   [junit4] Suite: org.apache.lucene.index.TestMaxPosition

   [junit4] Completed [9/438] on J1 in 0.13s, 2 tests

   [junit4] 

   [junit4] Suite: org.apache.lucene.index.TestIndexWriterMaxDocs

   [junit4] IGNOR/A 0.01s J2 | TestIndexWriterMaxDocs.testExactlyAtTrueLimit

   [junit4]    > Assumption #1: 'monster' test group is disabled (@Monster(value=takes over two hours))

   [junit4] Completed [10/438] on J2 in 5.46s, 21 tests, 1 skipped

   [junit4] 

   [junit4] Suite: org.apache.lucene.util.TestIOUtils

   [junit4] Completed [11/438] on J2 in 0.36s, 18 tests

   [junit4] 

   [junit4] Suite: org.apache.lucene.util.TestPagedBytes

   [junit4] Completed [12/438] on J1 in 7.65s, 4 tests, 1 skipped

   [junit4] 

   [junit4] Suite: org.apache.lucene.search.TestDocValuesScoring

   [junit4] Completed [13/438] on J1 in 0.53s, 1 test

   [junit4] 

   [junit4] Suite: org.apache.lucene.search.spans.TestFilterSpans

   [junit4] Completed [14/438] on J1 in 0.07s, 1 test

   [junit4] 

   [junit4] Suite: org.apache.lucene.index.TestTieredMergePolicy

   [junit4] Completed [15/438] on J2 in 6.57s, 6 tests

   [junit4] 

   [junit4] Suite: org.apache.lucene.search.TestSortedNumericSortField

   [junit4] Completed [16/438] on J2 in 0.30s, 9 tests

   [junit4] 

   [junit4] Suite: org.apache.lucene.util.packed.TestDirectPacked

   [junit4] Completed [17/438] on J1 in 2.71s, 4 tests

   [junit4] 

   [junit4] Suite: org.apache.lucene.search.TestFuzzyQuery

   [junit4] Completed [18/438] on J1 in 0.71s, 10 tests

   [junit4] 

   [junit4] Suite: org.apache.lucene.index.TestDocumentsWriterDeleteQueue

   [junit4] Completed [19/438] on J1 in 0.36s, 5 tests

   [junit4] 

   [junit4] Suite: org.apache.lucene.util.fst.TestBytesStore

   [junit4] Completed [20/438] on J2 in 1.28s, 1 test

   [junit4] 

   [junit4] Suite: org.apache.lucene.index.TestParallelTermEnum

   [junit4] Completed [21/438] on J1 in 0.11s, 1 test

   [junit4] 

   [junit4] Suite: org.apache.lucene.index.TestUniqueTermCount

   [junit4] Completed [22/438] on J2 in 0.37s, 1 test

   [junit4] 

   [junit4] Suite: org.apache.lucene.search.TestNumericRangeQuery64

   [junit4] Completed [23/438] on J0 in 15.90s, 29 tests

   [junit4] 

   [junit4] Suite: org.apache.lucene.index.TestManyFields

   [junit4] Completed [24/438] on J0 in 1.76s, 3 tests

   [junit4] 

   [junit4] Suite: org.apache.lucene.util.TestIntroSorter

   [junit4] Completed [25/438] on J0 in 0.21s, 9 tests

   [junit4] 

   [junit4] Suite: org.apache.lucene.search.TestDateSort

   [junit4] Completed [26/438] on J0 in 0.14s, 1 test

   [junit4] 

   [junit4] Suite: org.apache.lucene.index.TestConsistentFieldNumbers

   [junit4] Completed [27/438] on J2 in 3.47s, 4 tests

   [junit4] 

   [junit4] Suite: org.apache.lucene.index.TestLazyProxSkipping

   [junit4] IGNOR/A 0.00s J2 | TestLazyProxSkipping.testLazySkipping

   [junit4]    > Assumption #1: This test cannot run with Memory postings format

   [junit4] Completed [28/438] on J2 in 0.06s, 2 tests, 1 skipped

   [junit4] 

   [junit4] Suite: org.apache.lucene.document.TestField

   [junit4] Completed [29/438] on J2 in 0.15s, 27 tests

   [junit4] 

   [junit4] Suite: org.apache.lucene.search.similarities.TestSimilarity2

   [junit4] Completed [30/438] on J0 in 0.59s, 8 tests

   [junit4] 

   [junit4] Suite: org.apache.lucene.store.TestFilterDirectory

   [junit4] IGNOR/A 0.00s J2 | TestFilterDirectory.testFsyncDoesntCreateNewFiles

   [junit4]    > Assumption #1: test only works for FSDirectory subclasses

   [junit4] IGNOR/A 0.00s J2 | TestFilterDirectory.testPendingDeletions

   [junit4]    > Assumption #1: we can only install VirusCheckingFS on an FSDirectory

   [junit4] Completed [31/438] on J2 in 2.61s, 46 tests, 2 skipped

   [junit4] 

   [junit4] Suite: org.apache.lucene.search.TestSynonymQuery

   [junit4] Completed [32/438] on J2 in 0.06s, 4 tests

   [junit4] 

   [junit4] Suite: org.apache.lucene.index.TestMultiTermsEnum

   [junit4] Completed [33/438] on J2 in 0.08s, 1 test

   [junit4] 

   [junit4] Suite: org.apache.lucene.search.TestAutomatonQueryUnicode

   [junit4] Completed [34/438] on J2 in 0.10s, 1 test

   [junit4] 

   [junit4] Suite: org.apache.lucene.index.Test4GBStoredFields

   [junit4] IGNOR/A 0.00s J2 | Test4GBStoredFields.test

   [junit4]    > Assumption #1: 'nightly' test group is disabled (@Nightly())

   [junit4] Completed [35/438] on J2 in 0.01s, 1 test, 1 skipped

   [junit4] 

   [junit4] Suite: org.apache.lucene.codecs.compressing.TestFastDecompressionMode

   [junit4] Completed [36/438] on J2 in 3.59s, 11 tests

   [junit4] 

   [junit4] Suite: org.apache.lucene.codecs.perfield.TestPerFieldPostingsFormat

   [junit4] IGNOR/A 0.01s J1 | TestPerFieldPostingsFormat.testMergeStability

   [junit4]    > Assumption #1: The MockRandom PF randomizes content on the fly, so we can't check it

   [junit4] IGNOR/A 0.00s J1 | TestPerFieldPostingsFormat.testPostingsEnumReuse

   [junit4]    > Assumption #1: The MockRandom PF randomizes content on the fly, so we can't check it

   [junit4] Completed [37/438] on J1 in 11.96s, 24 tests, 2 skipped

   [junit4] 

   [junit4] Suite: org.apache.lucene.util.TestCharsRef

   [junit4] Completed [38/438] on J1 in 0.03s, 5 tests

   [junit4] 

   [junit4] Suite: org.apache.lucene.util.bkd.TestDocIdsWriter

   [junit4] Completed [39/438] on J0 in 7.79s, 2 tests

   [junit4] 

   [junit4] Suite: org.apache.lucene.store.TestTrackingDirectoryWrapper

   [junit4] IGNOR/A 0.00s J2 | TestTrackingDirectoryWrapper.testPendingDeletions

   [junit4]    > Assumption #1: we can only install VirusCheckingFS on an FSDirectory

   [junit4] IGNOR/A 0.00s J2 | TestTrackingDirectoryWrapper.testFsyncDoesntCreateNewFiles

   [junit4]    > Assumption #1: test only works for FSDirectory subclasses

   [junit4] Completed [40/438] on J2 in 1.89s, 49 tests, 2 skipped

   [junit4] 

   [junit4] Suite: org.apache.lucene.search.spans.TestSpanExplanations

   [junit4] Completed [41/438] on J1 in 0.95s, 30 tests

   [junit4] 

   [junit4] Suite: org.apache.lucene.index.TestIndexFileDeleter

   [junit4] Completed [42/438] on J2 in 1.27s, 10 tests

   [junit4] 

   [junit4] Suite: org.apache.lucene.search.TestSort

   [junit4] Completed [43/438] on J2 in 0.83s, 25 tests

   [junit4] 

   [junit4] Suite: org.apache.lucene.index.TestSegmentReader

   [junit4] Completed [44/438] on J1 in 1.94s, 7 tests

   [junit4] 

   [junit4] Suite: org.apache.lucene.codecs.lucene50.TestLucene50StoredFieldsFormat

   [junit4] IGNOR/A 0.00s J2 | TestLucene50StoredFieldsFormat.testBigDocuments

   [junit4]    > Assumption #1: 'nightly' test group is disabled (@Nightly())

   [junit4] Completed [45/438] on J2 in 5.64s, 17 tests, 1 skipped

   [junit4] 

   [junit4] Suite: org.apache.lucene.search.TestMinShouldMatch2

   [junit4] Completed [47/438] on J1 in 7.40s, 6 tests

   [junit4] 

   [junit4] Suite: org.apache.lucene.search.TestEarlyTerminatingSortingCollector

   [junit4] Completed [48/438] on J0 in 14.73s, 4 tests

   [junit4] 

   [junit4] Suite: org.apache.lucene.index.TestDocValuesIndexing

   [junit4] Completed [49/438] on J0 in 0.51s, 34 tests

   [junit4] 

   [junit4] Suite: org.apache.lucene.index.TestNoDeletionPolicy

   [junit4] Completed [50/438] on J0 in 0.09s, 4 tests

   [junit4] 

   [junit4] Suite: org.apache.lucene.document.TestFieldType

   [junit4] Completed [51/438] on J0 in 0.03s, 3 tests

   [junit4] 

   [junit4] Suite: org.apache.lucene.util.TestCollectionUtil

   [junit4] Completed [52/438] on J2 in 7.89s, 4 tests

   [junit4] 

   [junit4] Suite: org.apache.lucene.util.TestRecyclingByteBlockAllocator

   [junit4] Completed [53/438] on J2 in 0.15s, 3 tests

   [junit4] 

   [junit4] Suite: org.apache.lucene.store.TestSingleInstanceLockFactory

   [junit4] Completed [54/438] on J0 in 1.35s, 7 tests

   [junit4] 

   [junit4] Suite: org.apache.lucene.search.spans.TestSpanCollection

   [junit4] Completed [55/438] on J0 in 0.13s, 3 tests

   [junit4] 

   [junit4] Suite: org.apache.lucene.index.TestReaderClosed

   [junit4] Completed [56/438] on J0 in 0.04s, 2 tests

   [junit4] 

   [junit4] Suite: org.apache.lucene.search.TestFilterWeight

   [junit4] Completed [57/438] on J0 in 0.03s, 1 test

   [junit4] 

   [junit4] Suite: org.apache.lucene.index.Test2BTerms

   [junit4] IGNOR/A 0.01s J0 | Test2BTerms.test2BTerms

   [junit4]    > Assumption #1: 'monster' test group is disabled (@Monster(value=very slow, use 5g minimum heap))

   [junit4] Completed [58/438] on J0 in 0.02s, 1 test, 1 skipped

   [junit4] 

   [junit4] Suite: org.apache.lucene.codecs.TestCodecUtil

   [junit4] Completed [59/438] on J0 in 0.07s, 15 tests

   [junit4] 

   [junit4] Suite: org.apache.lucene.util.TestBytesRefHash

   [junit4] Completed [60/438] on J0 in 1.48s, 8 tests

   [junit4] 

   [junit4] Suite: org.apache.lucene.index.TestIndexWriterWithThreads

   [junit4] Completed [61/438] on J0 in 2.71s, 12 tests

   [junit4] 

   [junit4] Suite: org.apache.lucene.search.similarities.TestClassicSimilarity

   [junit4] Completed [62/438] on J0 in 0.20s, 11 tests

   [junit4] 

   [junit4] Suite: org.apache.lucene.util.TestOfflineSorter

   [junit4] IGNOR/A 0.00s J2 | TestOfflineSorter.testLargerRandom

   [junit4]    > Assumption #1: 'nightly' test group is disabled (@Nightly())

   [junit4] Completed [63/438] on J2 in 8.74s, 14 tests, 1 skipped

   [junit4] 

   [junit4] Suite: org.apache.lucene.search.TestBoostQuery

   [junit4] Completed [64/438] on J2 in 0.06s, 3 tests

   [junit4] 

   [junit4] Suite: org.apache.lucene.search.TestPhrasePrefixQuery

   [junit4] Completed [65/438] on J2 in 0.08s, 1 test

   [junit4] 

   [junit4] Suite: org.apache.lucene.index.TestNoMergeScheduler

   [junit4] Completed [66/438] on J2 in 0.03s, 3 tests

   [junit4] 

   [junit4] Suite: org.apache.lucene.index.TestPayloads

   [junit4] Completed [67/438] on J2 in 0.19s, 7 tests

   [junit4] 

   [junit4] Suite: org.apache.lucene.index.TestTermsEnum2

   [junit4] Completed [68/438] on J2 in 0.72s, 4 tests

   [junit4] 

   [junit4] Suite: org.apache.lucene.util.TestDocIdSetBuilder

   [junit4] Completed [69/438] on J2 in 2.00s, 7 tests

   [junit4] 

   [junit4] Suite: org.apache.lucene.index.TestCodecHoldsOpenFiles

   [junit4] Completed [70/438] on J2 in 0.08s, 1 test

   [junit4] 

   [junit4] Suite: org.apache.lucene.TestExternalCodecs

   [junit4] Completed [71/438] on J2 in 0.88s, 1 test

   [junit4] 

   [junit4] Suite: org.apache.lucene.codecs.lucene50.TestLucene50StoredFieldsFormatHighCompression

   [junit4] IGNOR/A 0.00s J0 | TestLucene50StoredFieldsFormatHighCompression.testBigDocuments

   [junit4]    > Assumption #1: 'nightly' test group is disabled (@Nightly())

   [junit4] Completed [72/438] on J0 in 8.24s, 19 tests, 1 skipped

   [junit4] 

   [junit4] Suite: org.apache.lucene.search.TestBooleanOr

   [junit4] Completed [73/438] on J2 in 1.98s, 7 tests

   [junit4] 

   [junit4] Suite: org.apache.lucene.search.TestDocBoost

   [junit4] Completed [74/438] on J2 in 0.06s, 1 test

   [junit4] 

   [junit4] Suite: org.apache.lucene.analysis.TestCharacterUtils

   [junit4] Completed [75/438] on J2 in 0.06s, 4 tests

   [junit4] 

   [junit4] Suite: org.apache.lucene.index.TestIndexWriterDeleteByQuery

   [junit4] Completed [76/438] on J2 in 0.06s, 1 test

   [junit4] 

   [junit4] Suite: org.apache.lucene.search.TestMultiValuedNumericRangeQuery

   [junit4] Completed [77/438] on J2 in 0.91s, 1 test

   [junit4] 

   [junit4] Suite: org.apache.lucene.util.TestMergedIterator

   [junit4] Completed [78/438] on J2 in 1.00s, 25 tests

   [junit4] 

   [junit4] Suite: org.apache.lucene.util.automaton.TestUTF32ToUTF8

   [junit4] Completed [79/438] on J0 in 3.98s, 6 tests

   [junit4] 

   [junit4] Suite: org.apache.lucene.util.TestCloseableThreadLocal

   [junit4] Completed [80/438] on J0 in 0.03s, 3 tests

   [junit4] 

   [junit4] Suite: org.apache.lucene.util.TestSPIClassIterator

   [junit4] Completed [81/438] on J0 in 0.04s, 1 test

   [junit4] 

   [junit4] Suite: org.apache.lucene.util.TestQueryBuilder

   [junit4] Completed [82/438] on J0 in 0.13s, 21 tests

   [junit4] 

   [junit4] Suite: org.apache.lucene.search.TestMultiPhraseEnum

   [junit4] Completed [83/438] on J0 in 0.28s, 2 tests

   [junit4] 

   [junit4] Suite: org.apache.lucene.search.TestSortedSetSelector

   [junit4] Completed [84/438] on J0 in 0.14s, 15 tests

   [junit4] 

   [junit4] Suite: org.apache.lucene.index.TestSegmentInfos

   [junit4] Completed [85/438] on J0 in 0.03s, 3 tests

   [junit4] 

   [junit4] Suite: org.apache.lucene.index.TestTermVectorsReader

   [junit4] Completed [86/438] on J0 in 0.39s, 13 tests

   [junit4] 

   [junit4] Suite: org.apache.lucene.store.TestSimpleFSLockFactory

   [junit4] Completed [87/438] on J2 in 5.37s, 7 tests

   [junit4] 

   [junit4] Suite: org.apache.lucene.index.TestTerms

   [junit4] Completed [88/438] on J2 in 0.14s, 8 tests

   [junit4] 

   [junit4] Suite: org.apache.lucene.index.TestExceedMaxTermLength

   [junit4] Completed [89/438] on J2 in 0.06s, 1 test

   [junit4] 

   [junit4] Suite: org.apache.lucene.index.TestSegmentTermEnum

   [junit4] Completed [90/438] on J2 in 0.08s, 2 tests

   [junit4] 

   [junit4] Suite: org.apache.lucene.TestDemo

   [junit4] Completed [91/438] on J2 in 0.05s, 1 test

   [junit4] 

   [junit4] Suite: org.apache.lucene.index.TestReaderWrapperDVTypeCheck

   [junit4] Completed [92/438] on J2 in 0.25s, 1 test

   [junit4] 

   [junit4] Suite: org.apache.lucene.search.TestReqExclBulkScorer

   [junit4] Completed [93/438] on J2 in 0.04s, 1 test

   [junit4] 

   [junit4] Suite: org.apache.lucene.search.similarities.TestBM25Similarity

   [junit4] Completed [94/438] on J2 in 0.05s, 3 tests

   [junit4] 

   [junit4] Suite: org.apache.lucene.util.TestIntroSelector

   [junit4] Completed [95/438] on J2 in 1.16s, 2 tests

   [junit4] 

   [junit4] Suite: org.apache.lucene.index.TestForceMergeForever

   [junit4] Completed [96/438] on J2 in 0.31s, 1 test

   [junit4] 

   [junit4] Suite: org.apache.lucene.index.Test2BPoints

   [junit4] IGNOR/A 0.00s J2 | Test2BPoints.test1D

   [junit4]    > Assumption #1: 'monster' test group is disabled (@Monster(value=takes at least 4 hours and consumes many GB of temp disk space))

   [junit4] IGNOR/A 0.00s J2 | Test2BPoints.test2D

   [junit4]    > Assumption #1: 'monster' test group is disabled (@Monster(value=takes at least 4 hours and consumes many GB of temp disk space))

   [junit4] Completed [97/438] on J2 in 0.01s, 2 tests, 2 skipped

   [junit4] 

   [junit4] Suite: org.apache.lucene.index.TestForTooMuchCloning

   [junit4] Completed [98/438] on J2 in 0.11s, 1 test

   [junit4] 

   [junit4] Suite: org.apache.lucene.search.TestConjunctionDISI

   [junit4] Completed [99/438] on J0 in 6.44s, 5 tests

   [junit4] 

   [junit4] Suite: org.apache.lucene.util.TestFixedBitDocIdSet

   [junit4] Completed [100/438] on J0 in 0.59s, 5 tests

   [junit4] 

   [junit4] Suite: org.apache.lucene.index.TestDirectoryReaderReopen

   [junit4] Completed [101/438] on J0 in 3.22s, 14 tests

   [junit4] 

   [junit4] Suite: org.apache.lucene.analysis.TestCharArrayMap

   [junit4] Completed [102/438] on J0 in 0.20s, 4 tests

   [junit4] 

   [junit4] Suite: org.apache.lucene.search.TestMatchNoDocsQuery

   [junit4] Completed [103/438] on J0 in 0.06s, 3 tests

   [junit4] 

   [junit4] Suite: org.apache.lucene.search.TestNGramPhraseQuery

   [junit4] Completed [104/438] on J0 in 0.03s, 1 test

   [junit4] 

   [junit4] Suite: org.apache.lucene.geo.TestPolygon2D

   [junit4] Completed [105/438] on J1 in 37.55s, 10 tests

   [junit4] 

   [junit4] Suite: org.apache.lucene.search.TestLRUQueryCache

   [junit4] Completed [106/438] on J2 in 8.01s, 18 tests

   [junit4] 

   [junit4] Suite: org.apache.lucene.codecs.compressing.TestHighCompressionMode

   [junit4] Completed [107/438] on J1 in 1.82s, 7 tests

   [junit4] 

   [junit4] Suite: org.apache.lucene.codecs.lucene62.TestLucene62SegmentInfoFormat

   [junit4] Completed [108/438] on J2 in 0.57s, 16 tests

   [junit4] 

   [junit4] Suite: org.apache.lucene.util.TestIntArrayDocIdSet

   [junit4] Completed [109/438] on J1 in 0.97s, 5 tests

   [junit4] 

   [junit4] Suite: org.apache.lucene.index.TestIndexWriterLockRelease

   [junit4] Completed [110/438] on J1 in 0.06s, 1 test

   [junit4] 

   [junit4] Suite: org.apache.lucene.search.spans.TestFieldMaskingSpanQuery

   [junit4] IGNOR/A 0.00s J1 | TestFieldMaskingSpanQuery.testSimple2

   [junit4]    > Assumption #1: Broken scoring: LUCENE-3723

   [junit4] IGNOR/A 0.00s J1 | TestFieldMaskingSpanQuery.testSpans2

   [junit4]    > Assumption #1: Broken scoring: LUCENE-3723

   [junit4] Completed [111/438] on J1 in 0.44s, 11 tests, 2 skipped

   [junit4] 

   [junit4] Suite: org.apache.lucene.search.TestCustomSearcherSort

   [junit4] Completed [112/438] on J2 in 2.41s, 2 tests

   [junit4] 

   [junit4] Suite: org.apache.lucene.index.TestIndexWriterMerging

   [junit4] Completed [113/438] on J2 in 7.30s, 6 tests

   [junit4] 

   [junit4] Suite: org.apache.lucene.store.TestBufferedIndexInput

   [junit4] Completed [114/438] on J2 in 0.74s, 4 tests

   [junit4] 

   [junit4] Suite: org.apache.lucene.index.TestLongPostings

   [junit4] Completed [115/438] on J2 in 3.76s, 2 tests

   [junit4] 

   [junit4] Suite: org.apache.lucene.index.TestUpgradeIndexMergePolicy

   [junit4] Completed [116/438] on J2 in 0.05s, 1 test

   [junit4] 

   [junit4] Suite: org.apache.lucene.util.TestIntsRef

   [junit4] Completed [117/438] on J2 in 0.07s, 2 tests

   [junit4] 

   [junit4] Suite: org.apache.lucene.store.TestByteArrayDataInput

   [junit4] Completed [118/438] on J2 in 0.03s, 1 test

   [junit4] 

   [junit4] Suite: org.apache.lucene.analysis.standard.TestStandardAnalyzer

   [junit4] Completed [119/438] on J0 in 23.73s, 34 tests

   [junit4] 

   [junit4] Suite: org.apache.lucene.index.TestIntBlockPool

   [junit4] Completed [120/438] on J0 in 0.70s, 2 tests

   [junit4] 

   [junit4] Suite: org.apache.lucene.codecs.lucene50.TestBlockPostingsFormat

   [junit4] Completed [121/438] on J2 in 9.94s, 26 tests

   [junit4] 

   [junit4] Suite: org.apache.lucene.search.TestFieldValueQuery

   [junit4] Completed [122/438] on J2 in 1.13s, 6 tests

   [junit4] 

   [junit4] Suite: org.apache.lucene.search.TestSearcherManager

   [junit4] Completed [123/438] on J0 in 6.28s, 10 tests

   [junit4] 

   [junit4] Suite: org.apache.lucene.index.TestIndexWriterThreadsToSegments

   [junit4] Completed [124/438] on J2 in 2.37s, 4 tests

   [junit4] 

   [junit4] Suite: org.apache.lucene.util.TestNotDocIdSet

   [junit4] Completed [125/438] on J0 in 1.95s, 6 tests

   [junit4] 

   [junit4] Suite: org.apache.lucene.util.TestBytesRefArray

   [junit4] Completed [126/438] on J0 in 0.10s, 2 tests

   [junit4] 

   [junit4] Suite: org.apache.lucene.search.TestComplexExplanationsOfNonMatches

   [junit4] Completed [127/438] on J0 in 0.31s, 21 tests

   [junit4] 

   [junit4] Suite: org.apache.lucene.store.TestNRTCachingDirectory

   [junit4] IGNOR/A 0.00s J2 | TestNRTCachingDirectory.testFsyncDoesntCreateNewFiles

   [junit4]    > Assumption #1: test only works for FSDirectory subclasses

   [junit4] IGNOR/A 0.00s J2 | TestNRTCachingDirectory.testPendingDeletions

   [junit4]    > Assumption #1: we can only install VirusCheckingFS on an FSDirectory

   [junit4] Completed [128/438] on J2 in 1.93s, 46 tests, 2 skipped

   [junit4] 

   [junit4] Suite: org.apache.lucene.index.TestDirectoryReader

   [junit4] Completed [129/438] on J2 in 1.20s, 24 tests

   [junit4] 

   [junit4] Suite: org.apache.lucene.codecs.lucene50.TestForUtil

   [junit4] Completed [130/438] on J2 in 0.09s, 1 test

   [junit4] 

   [junit4] Suite: org.apache.lucene.search.TestSimilarity

   [junit4] Completed [131/438] on J2 in 0.13s, 1 test

   [junit4] 

   [junit4] Suite: org.apache.lucene.util.TestRoaringDocIdSet

   [junit4] Completed [132/438] on J2 in 0.96s, 5 tests

   [junit4] 

   [junit4] Suite: org.apache.lucene.index.TestMultiFields

   [junit4] Completed [133/438] on J2 in 0.89s, 3 tests

   [junit4] 

   [junit4] Suite: org.apache.lucene.index.TestStressDeletes

   [junit4] Completed [134/438] on J2 in 0.84s, 1 test

   [junit4] 

   [junit4] Suite: org.apache.lucene.index.TestIndexWriter

   [junit4] Completed [135/438] on J0 in 8.13s, 71 tests

   [junit4] 

   [junit4] Suite: org.apache.lucene.search.TestAutomatonQuery

   [junit4] Completed [136/438] on J0 in 2.67s, 8 tests

   [junit4] 

   [junit4] Suite: org.apache.lucene.analysis.TestCachingTokenFilter

   [junit4] Completed [137/438] on J0 in 0.04s, 2 tests

   [junit4] 

   [junit4] Suite: org.apache.lucene.index.TestTragicIndexWriterDeadlock

   [junit4] Completed [138/438] on J0 in 0.11s, 1 test

   [junit4] 

   [junit4] Suite: org.apache.lucene.search.TestTermQuery

   [junit4] Completed [139/438] on J0 in 0.06s, 2 tests

   [junit4] 

   [junit4] Suite: org.apache.lucene.codecs.lucene50.TestLucene50TermVectorsFormat

   [junit4] Completed [140/438] on J1 in 39.58s, 17 tests

   [junit4] 

   [junit4] Suite: org.apache.lucene.search.spans.TestSpanSearchEquivalence

   [junit4] Completed [141/438] on J0 in 3.10s, 33 tests

   [junit4] 

   [junit4] Suite: org.apache.lucene.util.TestLegacyNumericUtils

   [junit4] Completed [142/438] on J0 in 1.51s, 12 tests

   [junit4] 

   [junit4] Suite: org.apache.lucene.index.TestIndexWriterOnVMError

   [junit4] IGNOR/A 0.00s J0 | TestIndexWriterOnVMError.testCheckpoint

   [junit4]    > Assumption #1: 'nightly' test group is disabled (@Nightly())

   [junit4] Completed [143/438] on J0 in 0.89s, 3 tests, 1 skipped

   [junit4] 

   [junit4] Suite: org.apache.lucene.index.Test2BPostingsBytes

   [junit4] IGNOR/A 0.00s J0 | Test2BPostingsBytes.test

   [junit4]    > Assumption #1: 'monster' test group is disabled (@Monster(value=takes ~20GB-30GB of space and 10 minutes))

   [junit4] Completed [144/438] on J0 in 0.02s, 1 test, 1 skipped

   [junit4] 

   [junit4] Suite: org.apache.lucene.index.TestIndexWriterOnJRECrash

   [junit4] IGNOR/A 0.00s J0 | TestIndexWriterOnJRECrash.testNRTThreads

   [junit4]    > Assumption #1: 'nightly' test group is disabled (@Nightly())

   [junit4] Completed [145/438] on J0 in 0.02s, 1 test, 1 skipped

   [junit4] 

   [junit4] Suite: org.apache.lucene.search.TestPrefixInBooleanQuery

   [junit4] Completed [146/438] on J0 in 0.80s, 4 tests

   [junit4] 

   [junit4] Suite: org.apache.lucene.document.TestDateTools

   [junit4] Completed [147/438] on J0 in 0.07s, 5 tests

   [junit4] 

   [junit4] Suite: org.apache.lucene.search.TestMultiTermQueryRewrites

   [junit4] Completed [148/438] on J0 in 0.15s, 3 tests

   [junit4] 

   [junit4] Suite: org.apache.lucene.index.TestMergeRateLimiter

   [junit4] Completed [149/438] on J0 in 0.12s, 1 test

   [junit4] 

   [junit4] Suite: org.apache.lucene.store.TestRAMDirectory

   [junit4] IGNOR/A 0.00s J0 | TestRAMDirectory.testPendingDeletions

   [junit4]    > Assumption #1: we can only install VirusCheckingFS on an FSDirectory

   [junit4] IGNOR/A 0.00s J0 | TestRAMDirectory.testFsyncDoesntCreateNewFiles

   [junit4]    > Assumption #1: test only works for FSDirectory subclasses

   [junit4] Completed [150/438] on J0 in 2.62s, 48 tests, 2 skipped

   [junit4] 

   [junit4] Suite: org.apache.lucene.index.TestParallelCompositeReader

   [junit4] Completed [151/438] on J0 in 0.45s, 15 tests

   [junit4] 

   [junit4] Suite: org.apache.lucene.search.TestFieldCacheRewriteMethod

   [junit4] Completed [152/438] on J0 in 2.84s, 2 tests

   [junit4] 

   [junit4] Suite: org.apache.lucene.util.fst.TestFSTs

   [junit4] IGNOR/A 0.00s J1 | TestFSTs.testBigSet

   [junit4]    > Assumption #1: 'nightly' test group is disabled (@Nightly())

   [junit4] Completed [153/438] on J1 in 12.57s, 20 tests, 1 skipped

   [junit4] 

   [junit4] Suite: org.apache.lucene.util.TestLSBRadixSorter

   [junit4] Completed [154/438] on J1 in 0.30s, 6 tests

   [junit4] 

   [junit4] Suite: org.apache.lucene.util.TestMSBRadixSorter

   [junit4] Completed [155/438] on J0 in 3.90s, 7 tests

   [junit4] 

   [junit4] Suite: org.apache.lucene.store.TestRateLimiter

   [junit4] Completed [156/438] on J0 in 0.77s, 2 tests

   [junit4] 

   [junit4] Suite: org.apache.lucene.codecs.lucene50.TestBlockPostingsFormat2

   [junit4] Completed [157/438] on J0 in 3.16s, 4 tests

   [junit4] 

   [junit4] Suite: org.apache.lucene.geo.TestGeoUtils

   [junit4] Completed [158/438] on J2 in 30.73s, 6 tests

   [junit4] 

   [junit4] Suite: org.apache.lucene.analysis.TestWordlistLoader

   [junit4] Completed [159/438] on J2 in 0.04s, 3 tests

   [junit4] 

   [junit4] Suite: org.apache.lucene.index.TestIndexWriterReader

   [junit4] IGNOR/A 0.00s J2 | TestIndexWriterReader.testDuringAddIndexes

   [junit4]    > Assumption #1: 'nightly' test group is disabled (@Nightly())

   [junit4] Completed [160/438] on J2 in 8.37s, 23 tests, 1 skipped

   [junit4] 

   [junit4] Suite: org.apache.lucene.search.TestPointQueries

   [junit4] IGNOR/A 0.00s J0 | TestPointQueries.testRandomLongsBig

   [junit4]    > Assumption #1: 'nightly' test group is disabled (@Nightly())

   [junit4] IGNOR/A 0.00s J0 | TestPointQueries.testRandomBinaryBig

   [junit4]    > Assumption #1: 'nightly' test group is disabled (@Nightly())

   [junit4] Completed [161/438] on J0 in 15.91s, 46 tests, 2 skipped

   [junit4] 

   [junit4] Suite: org.apache.lucene.index.TestNRTReaderWithThreads

   [junit4] Completed [162/438] on J0 in 2.83s, 1 test

   [junit4] 

   [junit4] Suite: org.apache.lucene.util.TestTimSorterWorstCase

   [junit4] Completed [163/438] on J1 in 27.18s, 1 test

   [junit4] 

   [junit4] Suite: org.apache.lucene.util.TestArrayUtil

   [junit4] Completed [164/438] on J0 in 3.93s, 14 tests

   [junit4] 

   [junit4] Suite: org.apache.lucene.util.TestSloppyMath

   [junit4] Completed [165/438] on J1 in 2.58s, 8 tests

   [junit4] 

   [junit4] Suite: org.apache.lucene.search.TestPositiveScoresOnlyCollector

   [junit4] Completed [166/438] on J1 in 0.05s, 1 test

   [junit4] 

   [junit4] Suite: org.apache.lucene.search.TestSortedSetSortField

   [junit4] Completed [167/438] on J1 in 0.18s, 7 tests

   [junit4] 

   [junit4] Suite: org.apache.lucene.index.TestSortedSetDocValues

   [junit4] Completed [168/438] on J1 in 0.04s, 1 test

   [junit4] 

   [junit4] Suite: org.apache.lucene.index.TestDocsAndPositions

   [junit4] Completed [169/438] on J0 in 0.67s, 6 tests

   [junit4] 

   [junit4] Suite: org.apache.lucene.util.packed.TestPackedInts

   [junit4] IGNOR/A 0.00s J2 | TestPackedInts.testBlockReaderOverflow

   [junit4]    > Assumption #1: 'nightly' test group is disabled (@Nightly())

   [junit4] Completed [170/438] on J2 in 11.16s, 28 tests, 3 skipped

   [junit4] 

   [junit4] Suite: org.apache.lucene.index.TestTransactions

   [junit4] Completed [171/438] on J1 in 1.59s, 1 test

   [junit4] 

   [junit4] Suite: org.apache.lucene.search.TestControlledRealTimeReopenThread

   [junit4] IGNOR/A 0.00s J1 | TestControlledRealTimeReopenThread.testCRTReopen

   [junit4]    > Assumption #1: 'awaitsfix' test group is disabled (@AwaitsFix(bugUrl=https://issues.apache.org/jira/browse/LUCENE-5737))

   [junit4] Completed [172/438] on J1 in 4.15s, 6 tests, 1 skipped

   [junit4] 

   [junit4] Suite: org.apache.lucene.util.TestMathUtil

   [junit4] Completed [173/438] on J1 in 0.16s, 5 tests

   [junit4] 

   [junit4] Suite: org.apache.lucene.search.TestNumericRangeQuery32

   [junit4] Completed [174/438] on J2 in 6.04s, 23 tests

   [junit4] 

   [junit4] Suite: org.apache.lucene.codecs.lucene50.TestLucene50CompoundFormat

   [junit4] Completed [175/438] on J0 in 8.34s, 26 tests

   [junit4] 

   [junit4] Suite: org.apache.lucene.search.TestTermRangeQuery

   [junit4] Completed [176/438] on J0 in 0.32s, 7 tests

   [junit4] 

   [junit4] Suite: org.apache.lucene.util.TestSentinelIntSet

   [junit4] Completed [177/438] on J0 in 0.11s, 2 tests

   [junit4] 

   [junit4] Suite: org.apache.lucene.index.TestPrefixCodedTerms

   [junit4] Completed [178/438] on J0 in 0.49s, 5 tests

   [junit4] 

   [junit4] Suite: org.apache.lucene.search.TestBooleanCoord

   [junit4] Completed [179/438] on J0 in 0.40s, 76 tests

   [junit4] 

   [junit4] Suite: org.apache.lucene.geo.TestPolygon

   [junit4] Completed [180/438] on J0 in 0.06s, 15 tests

   [junit4] 

   [junit4] Suite: org.apache.lucene.analysis.tokenattributes.TestCharTermAttributeImpl

   [junit4] Completed [181/438] on J0 in 1.93s, 12 tests

   [junit4] 

   [junit4] Suite: org.apache.lucene.index.TestAddIndexes

   [junit4] Completed [182/438] on J2 in 5.47s, 25 tests

   [junit4] 

   [junit4] Suite: org.apache.lucene.index.TestByteSlices

   [junit4] Completed [183/438] on J1 in 7.82s, 1 test

   [junit4] 

   [junit4] Suite: org.apache.lucene.TestMergeSchedulerExternal

   [junit4] Completed [184/438] on J1 in 0.89s, 2 tests

   [junit4] 

   [junit4] Suite: org.apache.lucene.search.TestPositionIncrement

   [junit4] Completed [185/438] on J1 in 0.10s, 2 tests

   [junit4] 

   [junit4] Suite: org.apache.lucene.search.TestRegexpQuery

   [junit4] Completed [186/438] on J1 in 0.30s, 7 tests

   [junit4] 

   [junit4] Suite: org.apache.lucene.analysis.TestStopFilter

   [junit4] Completed [187/438] on J1 in 0.06s, 4 tests

   [junit4] 

   [junit4] Suite: org.apache.lucene.store.TestMultiMMap

   [junit4] Completed [188/438] on J2 in 3.85s, 56 tests

   [junit4] 

   [junit4] Suite: org.apache.lucene.index.TestIndexWriterUnicode

   [junit4] Completed [189/438] on J1 in 5.03s, 5 tests

   [junit4] 

   [junit4] Suite: org.apache.lucene.search.TestShardSearching

   [junit4] Completed [190/438] on J0 in 8.86s, 1 test

   [junit4] 

   [junit4] Suite: org.apache.lucene.index.TestDeletionPolicy

   [junit4] Completed [191/438] on J2 in 3.68s, 6 tests

   [junit4] 

   [junit4] Suite: org.apache.lucene.search.TestSimpleSearchEquivalence

   [junit4] Completed [192/438] on J1 in 0.95s, 17 tests

   [junit4] 

   [junit4] Suite: org.apache.lucene.util.TestSetOnce

   [junit4] Completed [193/438] on J1 in 0.11s, 4 tests

   [junit4] 

   [junit4] Suite: org.apache.lucene.util.TestFixedLengthBytesRefArray

   [junit4] Completed [194/438] on J1 in 0.54s, 2 tests

   [junit4] 

   [junit4] Suite: org.apache.lucene.search.TestConstantScoreQuery

   [junit4] Completed [195/438] on J1 in 0.08s, 5 tests

   [junit4] 

   [junit4] Suite: org.apache.lucene.index.TestIndexCommit

   [junit4] Completed [196/438] on J1 in 0.05s, 1 test

   [junit4] 

   [junit4] Suite: org.apache.lucene.search.TestApproximationSearchEquivalence

   [junit4] Completed [197/438] on J1 in 1.04s, 10 tests

   [junit4] 

   [junit4] Suite: org.apache.lucene.TestAssertions

   [junit4] Completed [198/438] on J1 in 0.03s, 1 test

   [junit4] 

   [junit4] Suite: org.apache.lucene.index.TestTwoPhaseCommitTool

   [junit4] Completed [199/438] on J1 in 0.03s, 3 tests

   [junit4] 

   [junit4] Suite: org.apache.lucene.search.TestTopDocsCollector

   [junit4] Completed [200/438] on J1 in 0.14s, 8 tests

   [junit4] 

   [junit4] Suite: org.apache.lucene.index.TestFlushByRamOrCountsPolicy

   [junit4] Completed [201/438] on J2 in 2.60s, 5 tests

   [junit4] 

   [junit4] Suite: org.apache.lucene.search.spans.TestBasics

   [junit4] Completed [202/438] on J0 in 3.59s, 25 tests

   [junit4] 

   [junit4] Suite: org.apache.lucene.search.TestSloppyPhraseQuery

   [junit4] Completed [203/438] on J2 in 1.63s, 9 tests

   [junit4] 

   [junit4] Suite: org.apache.lucene.store.TestFileSwitchDirectory

   [junit4] IGNOR/A 0.00s J1 | TestFileSwitchDirectory.testPendingDeletions

   [junit4]    > Assumption #1: we can only install VirusCheckingFS on an FSDirectory

   [junit4] IGNOR/A 0.01s J1 | TestFileSwitchDirectory.testFsyncDoesntCreateNewFiles

   [junit4]    > Assumption #1: test only works for FSDirectory subclasses

   [junit4] Completed [204/438] on J1 in 3.35s, 45 tests, 2 skipped

   [junit4] 

   [junit4] Suite: org.apache.lucene.util.TestRadixSelector

   [junit4] Completed [205/438] on J1 in 0.70s, 1 test

   [junit4] 

   [junit4] Suite: org.apache.lucene.index.TestIndexWriterFromReader

   [junit4] Completed [206/438] on J1 in 0.40s, 12 tests

   [junit4] 

   [junit4] Suite: org.apache.lucene.document.TestDocument

   [junit4] Completed [207/438] on J1 in 0.11s, 12 tests

   [junit4] 

   [junit4] Suite: org.apache.lucene.index.TestIndexWriterMergePolicy

   [junit4] Completed [208/438] on J2 in 3.83s, 7 tests

   [junit4] 

   [junit4] Suite: org.apache.lucene.index.TestNRTThreads

   [junit4] Completed [209/438] on J2 in 4.77s, 1 test

   [junit4] 

   [junit4] Suite: org.apache.lucene.index.TestIndexWriterDelete

   [junit4] IGNOR/A 0.00s J0 | TestIndexWriterDelete.testApplyDeletesOnFlush

   [junit4]    > Assumption #1: 'nightly' test group is disabled (@Nightly())

   [junit4] Completed [210/438] on J0 in 10.62s, 27 tests, 1 skipped

   [junit4] 

   [junit4] Suite: org.apache.lucene.index.TestPersistentSnapshotDeletionPolicy

   [junit4] Completed [211/438] on J2 in 2.28s, 13 tests

   [junit4] 

   [junit4] Suite: org.apache.lucene.index.TestAtomicUpdate

   [junit4] Completed [212/438] on J0 in 4.98s, 1 test

   [junit4] 

   [junit4] Suite: org.apache.lucene.index.TestStressAdvance

   [junit4] Completed [213/438] on J2 in 5.19s, 1 test

   [junit4] 

   [junit4] Suite: org.apache.lucene.index.TestNorms

   [junit4] Completed [214/438] on J0 in 2.18s, 2 tests

   [junit4] 

   [junit4] Suite: org.apache.lucene.index.TestIndexWriterCommit

   [junit4] Completed [215/438] on J2 in 2.01s, 14 tests

   [junit4] 

   [junit4] Suite: org.apache.lucene.search.TestTimeLimitingCollector

   [junit4] Completed [216/438] on J0 in 5.62s, 7 tests

   [junit4] 

   [junit4] Suite: org.apache.lucene.search.TestSearchWithThreads

   [junit4] Completed [217/438] on J2 in 4.20s, 1 test

   [junit4] 

   [junit4] Suite: org.apache.lucene.search.TestSearchAfter

   [junit4] Completed [218/438] on J0 in 0.46s, 1 test

   [junit4] 

   [junit4] Suite: org.apache.lucene.index.TestIndexWriterExceptions

   [junit4] IGNOR/A 0.00s J1 | TestIndexWriterExceptions.testTooManyTokens

   [junit4]    > Assumption #1: 'nightly' test group is disabled (@Nightly())

   [junit4] Completed [219/438] on J1 in 24.57s, 36 tests, 1 skipped

   [junit4] 

   [junit4] Suite: org.apache.lucene.search.TestScoreCachingWrappingScorer

   [junit4] Completed [220/438] on J1 in 0.01s, 1 test

   [junit4] 

   [junit4] Suite: org.apache.lucene.index.TestConcurrentMergeScheduler

   [junit4] Completed [221/438] on J2 in 3.98s, 16 tests

   [junit4] 

   [junit4] Suite: org.apache.lucene.index.TestDocumentsWriterStallControl

   [junit4] Completed [222/438] on J0 in 4.78s, 3 tests

   [junit4] 

   [junit4] Suite: org.apache.lucene.index.TestNeverDelete

   [junit4] Completed [223/438] on J2 in 3.31s, 1 test

   [junit4] 

   [junit4] Suite: org.apache.lucene.index.TestStressIndexing

   [junit4] Completed [224/438] on J0 in 3.24s, 1 test

   [junit4] 

   [junit4] Suite: org.apache.lucene.index.TestRollingUpdates

   [junit4] Completed [225/438] on J0 in 1.46s, 2 tests

   [junit4] 

   [junit4] Suite: org.apache.lucene.util.automaton.TestMinimize

   [junit4] Completed [226/438] on J2 in 3.82s, 3 tests

   [junit4] 

   [junit4] Suite: org.apache.lucene.index.TestSnapshotDeletionPolicy

   [junit4] Completed [227/438] on J0 in 1.30s, 7 tests

   [junit4] 

   [junit4] Suite: org.apache.lucene.index.TestIndexWriterForceMerge

   [junit4] Completed [228/438] on J2 in 2.74s, 4 tests

   [junit4] 

   [junit4] Suite: org.apache.lucene.util.automaton.TestLevenshteinAutomata

   [junit4] Completed [229/438] on J0 in 2.71s, 4 tests

   [junit4] 

   [junit4] Suite: org.apache.lucene.util.TestWeakIdentityMap

   [junit4] Completed [230/438] on J0 in 8.87s, 2 tests

   [junit4] 

   [junit4] Suite: org.apache.lucene.search.TestSimpleExplanations

   [junit4] Completed [231/438] on J0 in 1.48s, 70 tests

   [junit4] 

   [junit4] Suite: org.apache.lucene.store.TestLockFactory

   [junit4] Completed [232/438] on J0 in 0.05s, 2 tests

   [junit4] 

   [junit4] Suite: org.apache.lucene.index.TestBagOfPositions

   [junit4] Completed [233/438] on J0 in 2.25s, 1 test

   [junit4] 

   [junit4] Suite: org.apache.lucene.index.TestOmitNorms

   [junit4] Completed [234/438] on J0 in 1.56s, 5 tests

   [junit4] 

   [junit4] Suite: org.apache.lucene.util.TestFixedBitSet

   [junit4] Completed [235/438] on J0 in 2.50s, 19 tests

   [junit4] 

   [junit4] Suite: org.apache.lucene.search.TestComplexExplanations

   [junit4] Completed [236/438] on J0 in 0.63s, 21 tests

   [junit4] 

   [junit4] Suite: org.apache.lucene.codecs.perfield.TestPerFieldDocValuesFormat

   [junit4] Completed [237/438] on J1 in 33.87s, 96 tests

   [junit4] 

   [junit4] Suite: org.apache.lucene.search.TestQueryRescorer

   [junit4] Completed [238/438] on J1 in 0.48s, 6 tests

   [junit4] 

   [junit4] Suite: org.apache.lucene.index.TestMixedDocValuesUpdates

   [junit4] IGNOR/A 0.00s J1 | TestMixedDocValuesUpdates.testTonsOfUpdates

   [junit4]    > Assumption #1: 'nightly' test group is disabled (@Nightly())

   [junit4] Completed [239/438] on J1 in 4.71s, 4 tests, 1 skipped

   [junit4] 

   [junit4] Suite: org.apache.lucene.util.TestAttributeSource

   [junit4] Completed [240/438] on J1 in 0.02s, 7 tests

   [junit4] 

   [junit4] Suite: org.apache.lucene.index.TestPostingsOffsets

   [junit4] Completed [241/438] on J1 in 0.77s, 13 tests

   [junit4] 

   [junit4] Suite: org.apache.lucene.search.TestIndexSearcher

   [junit4] Completed [242/438] on J1 in 0.15s, 5 tests

   [junit4] 

   [junit4] Suite: org.apache.lucene.util.TestRamUsageEstimator

   [junit4] IGNOR/A 0.00s J1 | TestRamUsageEstimator.testPrintValues

   [junit4]    > Assumption #1: Specify -Dtests.verbose=true to print constants of RamUsageEstimator.

   [junit4] Completed [243/438] on J1 in 0.03s, 5 tests, 1 skipped

   [junit4] 

   [junit4] Suite: org.apache.lucene.util.TestByteBlockPool

   [junit4] Completed [244/438] on J1 in 0.09s, 1 test

   [junit4] 

   [junit4] Suite: org.apache.lucene.codecs.lucene50.TestBlockPostingsFormat3

   [junit4] Completed [245/438] on J1 in 1.20s, 1 test

   [junit4] 

   [junit4] Suite: org.apache.lucene.search.TestSameScoresWithThreads

   [junit4] Completed [246/438] on J1 in 0.56s, 1 test

   [junit4] 

   [junit4] Suite: org.apache.lucene.index.TestNumericDocValuesUpdates

   [junit4] IGNOR/A 0.00s J1 | TestNumericDocValuesUpdates.testTonsOfUpdates

   [junit4]    > Assumption #1: 'nightly' test group is disabled (@Nightly())

   [junit4] Completed [247/438] on J1 in 3.84s, 31 tests, 1 skipped

   [junit4] 

   [junit4] Suite: org.apache.lucene.util.TestFilterIterator

   [junit4] Completed [248/438] on J1 in 0.03s, 8 tests

   [junit4] 

   [junit4] Suite: org.apache.lucene.index.TestIndexWriterNRTIsCurrent

   [junit4] Completed [249/438] on J0 in 17.07s, 1 test

   [junit4] 

   [junit4] Suite: org.apache.lucene.index.TestCrash

   [junit4] Completed [250/438] on J0 in 0.52s, 5 tests

   [junit4] 

   [junit4] Suite: org.apache.lucene.search.TestMultiThreadTermVectors

   [junit4] Completed [251/438] on J0 in 1.90s, 1 test

   [junit4] 

   [junit4] Suite: org.apache.lucene.index.TestSegmentTermDocs

   [junit4] Completed [252/438] on J0 in 0.32s, 4 tests

   [junit4] 

   [junit4] Suite: org.apache.lucene.index.TestMultiDocValues

   [junit4] Completed [253/438] on J0 in 0.44s, 8 tests

   [junit4] 

   [junit4] Suite: org.apache.lucene.analysis.TestToken

   [junit4] Completed [254/438] on J0 in 0.22s, 5 tests

   [junit4] 

   [junit4] Suite: org.apache.lucene.index.TestFieldsReader

   [junit4] Completed [255/438] on J0 in 0.52s, 2 tests

   [junit4] 

   [junit4] Suite: org.apache.lucene.search.similarities.TestSimilarityBase

   [junit4] Completed [256/438] on J0 in 1.99s, 32 tests

   [junit4] 

   [junit4] Suite: org.apache.lucene.store.TestHugeRamFile

   [junit4] Completed [257/438] on J0 in 2.19s, 1 test

   [junit4] 

   [junit4] Suite: org.apache.lucene.search.TestBooleanMinShouldMatch

   [junit4] Completed [258/438] on J0 in 2.17s, 17 tests

   [junit4] 

   [junit4] Suite: org.apache.lucene.index.TestDuelingCodecs

   [junit4] Completed [259/438] on J1 in 14.74s, 2 tests

   [junit4] 

   [junit4] Suite: org.apache.lucene.util.automaton.TestDeterminizeLexicon

   [junit4] Completed [260/438] on J0 in 2.45s, 1 test

   [junit4] 

   [junit4] Suite: org.apache.lucene.index.TestTermsEnum

   [junit4] Completed [261/438] on J2 in 50.49s, 11 tests

   [junit4] 

   [junit4] Suite: org.apache.lucene.codecs.lucene50.TestLucene50FieldInfoFormat

   [junit4] Completed [262/438] on J1 in 0.44s, 11 tests

   [junit4] 

   [junit4] Suite: org.apache.lucene.index.TestIndexWriterOnDiskFull

   [junit4] Completed [263/438] on J0 in 0.40s, 4 tests

   [junit4] 

   [junit4] Suite: org.apache.lucene.search.spans.TestSpans

   [junit4] Completed [264/438] on J2 in 0.94s, 26 tests

   [junit4] 

   [junit4] Suite: org.apache.lucene.search.TestTopDocsMerge

   [junit4] Completed [265/438] on J1 in 1.13s, 2 tests

   [junit4] 

   [junit4] Suite: org.apache.lucene.util.TestVersion

   [junit4] Completed [266/438] on J1 in 0.12s, 11 tests

   [junit4] 

   [junit4] Suite: org.apache.lucene.index.TestCustomNorms

   [junit4] Completed [267/438] on J0 in 1.12s, 1 test

   [junit4] 

   [junit4] Suite: org.apache.lucene.index.TestTransactionRollback

   [junit4] Completed [268/438] on J0 in 0.42s, 2 tests

   [junit4] 

   [junit4] Suite: org.apache.lucene.index.TestMixedCodecs

   [junit4] Completed [269/438] on J2 in 0.80s, 1 test

   [junit4] 

   [junit4] Suite: org.apache.lucene.index.TestFlex

   [junit4] Completed [270/438] on J0 in 0.08s, 2 tests

   [junit4] 

   [junit4] Suite: org.apache.lucene.index.TestSegmentMerger

   [junit4] Completed [271/438] on J1 in 0.99s, 3 tests

   [junit4] 

   [junit4] Suite: org.apache.lucene.util.automaton.TestDeterminism

   [junit4] Completed [272/438] on J0 in 0.79s, 2 tests

   [junit4] 

   [junit4] Suite: org.apache.lucene.index.TestStressIndexing2

   [junit4] Completed [273/438] on J2 in 1.47s, 3 tests

   [junit4] 

   [junit4] Suite: org.apache.lucene.index.TestTermVectorsWriter

   [junit4] Completed [274/438] on J2 in 0.40s, 15 tests

   [junit4] 

   [junit4] Suite: org.apache.lucene.index.TestCodecs

   [junit4] Completed [275/438] on J2 in 0.40s, 3 tests

   [junit4] 

   [junit4] Suite: org.apache.lucene.index.TestOmitPositions

   [junit4] Completed [276/438] on J2 in 0.26s, 4 tests

   [junit4] 

   [junit4] Suite: org.apache.lucene.index.TestParallelLeafReader

   [junit4] Completed [277/438] on J2 in 0.44s, 9 tests

   [junit4] 

   [junit4] Suite: org.apache.lucene.index.TestThreadedForceMerge

   [junit4] Completed [278/438] on J2 in 0.61s, 1 test

   [junit4] 

   [junit4] Suite: org.apache.lucene.index.TestBagOfPostings

   [junit4] Completed [279/438] on J0 in 3.31s, 1 test

   [junit4] 

   [junit4] Suite: org.apache.lucene.index.TestStressNRT

   [junit4] Completed [280/438] on J2 in 0.48s, 1 test

   [junit4] 

   [junit4] Suite: org.apache.lucene.index.TestIndexInput

   [junit4] Completed [281/438] on J0 in 1.09s, 2 tests

   [junit4] 

   [junit4] Suite: org.apache.lucene.search.TestDisjunctionMaxQuery

   [junit4] Completed [282/438] on J0 in 0.48s, 11 tests

   [junit4] 

   [junit4] Suite: org.apache.lucene.search.TestSloppyPhraseQuery2

   [junit4] Completed [283/438] on J2 in 1.50s, 9 tests

   [junit4] 

   [junit4] Suite: org.apache.lucene.index.TestOmitTf

   [junit4] Completed [284/438] on J0 in 0.63s, 6 tests

   [junit4] 

   [junit4] Suite: org.apache.lucene.search.spans.TestNearSpansOrdered

   [junit4] Completed [285/438] on J2 in 0.37s, 19 tests

   [junit4] 

   [junit4] Suite: org.apache.lucene.index.TestDocumentWriter

   [junit4] Completed [286/438] on J0 in 0.10s, 6 tests

   [junit4] 

   [junit4] Suite: org.apache.lucene.index.TestCrashCausesCorruptIndex

   [junit4] Completed [287/438] on J2 in 0.07s, 1 test

   [junit4] 

   [junit4] Suite: org.apache.lucene.search.TestMultiTermConstantScore

   [junit4] Completed [288/438] on J2 in 0.56s, 8 tests

   [junit4] 

   [junit4] Suite: org.apache.lucene.search.TestLiveFieldValues

   [junit4] Completed [289/438] on J2 in 0.35s, 1 test

   [junit4] 

   [junit4] Suite: org.apache.lucene.index.TestDoc

   [junit4] Completed [290/438] on J2 in 0.17s, 1 test

   [junit4] 

   [junit4] Suite: org.apache.lucene.search.TestWildcard

   [junit4] Completed [291/438] on J2 in 0.10s, 8 tests

   [junit4] 

   [junit4] Suite: org.apache.lucene.search.TestSimpleExplanationsOfNonMatches

   [junit4] Completed [292/438] on J2 in 0.36s, 70 tests

   [junit4] 

   [junit4] Suite: org.apache.lucene.index.TestPerSegmentDeletes

   [junit4] Completed [293/438] on J2 in 0.07s, 1 test

   [junit4] 

   [junit4] Suite: org.apache.lucene.search.TestBooleanQuery

   [junit4] Completed [294/438] on J2 in 0.27s, 22 tests

   [junit4] 

   [junit4] Suite: org.apache.lucene.search.TestScorerPerf

   [junit4] Completed [295/438] on J0 in 3.20s, 1 test

   [junit4] 

   [junit4] Suite: org.apache.lucene.search.TestSortRandom

   [junit4] Completed [296/438] on J0 in 0.68s, 2 tests

   [junit4] 

   [junit4] Suite: org.apache.lucene.util.TestUnicodeUtil

   [junit4] Completed [297/438] on J2 in 1.03s, 5 tests

   [junit4] 

   [junit4] Suite: org.apache.lucene.index.TestAllFilesHaveCodecHeader

   [junit4] Completed [298/438] on J0 in 0.18s, 1 test

   [junit4] 

   [junit4] Suite: org.apache.lucene.index.TestParallelReaderEmptyIndex

   [junit4] Completed [299/438] on J2 in 0.02s, 2 tests

   [junit4] 

   [junit4] Suite: org.apache.lucene.index.TestMaxTermFrequency

   [junit4] Completed [300/438] on J0 in 0.10s, 1 test

   [junit4] 

   [junit4] Suite: org.apache.lucene.search.TestTermScorer

   [junit4] Completed [301/438] on J2 in 0.06s, 4 tests

   [junit4] 

   [junit4] Suite: org.apache.lucene.search.TestTopFieldCollector

   [junit4] Completed [302/438] on J0 in 0.07s, 7 tests

   [junit4] 

   [junit4] Suite: org.apache.lucene.index.TestSumDocFreq

   [junit4] Completed [303/438] on J2 in 0.16s, 1 test

   [junit4] 

   [junit4] Suite: org.apache.lucene.search.TestWildcardRandom

   [junit4] Completed [304/438] on J2 in 0.12s, 1 test

   [junit4] 

   [junit4] Suite: org.apache.lucene.index.TestIndexableField

   [junit4] Completed [305/438] on J0 in 0.77s, 2 tests

   [junit4] 

   [junit4] Suite: org.apache.lucene.index.TestMultiLevelSkipList

   [junit4] Completed [306/438] on J0 in 0.40s, 1 test

   [junit4] 

   [junit4] Suite: org.apache.lucene.store.TestDirectory

   [junit4] Completed [307/438] on J2 in 1.08s, 3 tests

   [junit4] 

   [junit4] Suite: org.apache.lucene.index.TestCheckIndex

   [junit4] Completed [308/438] on J0 in 0.50s, 5 tests

   [junit4] 

   [junit4] Suite: org.apache.lucene.index.TestPayloadsOnVectors

   [junit4] Completed [309/438] on J2 in 0.07s, 3 tests

   [junit4] 

   [junit4] Suite: org.apache.lucene.search.TestBooleanQueryVisitSubscorers

   [junit4] Completed [310/438] on J2 in 0.30s, 5 tests

   [junit4] 

   [junit4] Suite: org.apache.lucene.search.spans.TestSpanMultiTermQueryWrapper

   [junit4] Completed [311/438] on J0 in 0.37s, 9 tests

   [junit4] 

   [junit4] Suite: org.apache.lucene.TestSearchForDuplicates

   [junit4] Completed [312/438] on J2 in 0.04s, 1 test

   [junit4] 

   [junit4] Suite: org.apache.lucene.index.TestSizeBoundedForceMerge

   [junit4] Completed [313/438] on J0 in 0.13s, 11 tests

   [junit4] 

   [junit4] Suite: org.apache.lucene.util.automaton.TestCompiledAutomaton

   [junit4] Completed [314/438] on J2 in 0.12s, 6 tests

   [junit4] 

   [junit4] Suite: org.apache.lucene.search.TestMatchAllDocsQuery

   [junit4] Completed [315/438] on J0 in 0.01s, 2 tests

   [junit4] 

   [junit4] Suite: org.apache.lucene.index.TestBinaryTerms

   [junit4] Completed [316/438] on J0 in 0.04s, 2 tests

   [junit4] 

   [junit4] Suite: org.apache.lucene.search.TestSubScorerFreqs

   [junit4] Completed [317/438] on J0 in 0.08s, 3 tests

   [junit4] 

   [junit4] Suite: org.apache.lucene.util.TestRecyclingIntBlockAllocator

   [junit4] Completed [318/438] on J0 in 0.35s, 3 tests

   [junit4] 

   [junit4] Suite: org.apache.lucene.index.TestIndexWriterConfig

   [junit4] Completed [319/438] on J0 in 0.10s, 8 tests

   [junit4] 

   [junit4] Suite: org.apache.lucene.search.spans.TestSpanExplanationsOfNonMatches

   [junit4] Completed [320/438] on J0 in 0.09s, 30 tests

   [junit4] 

   [junit4] Suite: org.apache.lucene.util.TestVirtualMethod

   [junit4] Completed [321/438] on J0 in 0.03s, 2 tests

   [junit4] 

   [junit4] Suite: org.apache.lucene.search.TestPrefixQuery

   [junit4] Completed [322/438] on J2 in 1.91s, 3 tests

   [junit4] 

   [junit4] Suite: org.apache.lucene.util.TestRollingBuffer

   [junit4] Completed [323/438] on J0 in 0.21s, 1 test

   [junit4] 

   [junit4] Suite: org.apache.lucene.util.TestSmallFloat

   [junit4] Completed [324/438] on J2 in 0.09s, 2 tests

   [junit4] 

   [junit4] Suite: org.apache.lucene.search.TestSimilarityProvider

   [junit4] Completed [325/438] on J0 in 0.02s, 1 test

   [junit4] 

   [junit4] Suite: org.apache.lucene.analysis.TestNumericTokenStream

   [junit4] Completed [326/438] on J2 in 0.02s, 6 tests

   [junit4] 

   [junit4] Suite: org.apache.lucene.index.TestFilterLeafReader

   [junit4] Completed [327/438] on J0 in 0.02s, 3 tests

   [junit4] 

   [junit4] Suite: org.apache.lucene.TestSearch

   [junit4] Completed [328/438] on J2 in 0.02s, 2 tests

   [junit4] 

   [junit4] Suite: org.apache.lucene.util.TestPriorityQueue

   [junit4] Completed [329/438] on J0 in 0.22s, 9 tests

   [junit4] 

   [junit4] Suite: org.apache.lucene.index.Test2BPostings

   [junit4] IGNOR/A 0.00s J2 | Test2BPostings.test

   [junit4]    > Assumption #1: 'nightly' test group is disabled (@Nightly())

   [junit4] Completed [330/438] on J2 in 0.00s, 1 test, 1 skipped

   [junit4] 

   [junit4] Suite: org.apache.lucene.index.TestSameTokenSamePosition

   [junit4] Completed [331/438] on J0 in 0.01s, 2 tests

   [junit4] 

   [junit4] Suite: org.apache.lucene.index.TestDocCount

   [junit4] Completed [332/438] on J2 in 0.04s, 1 test

   [junit4] 

   [junit4] Suite: org.apache.lucene.search.TestCachingCollector

   [junit4] Completed [333/438] on J0 in 0.02s, 4 tests

   [junit4] 

   [junit4] Suite: org.apache.lucene.document.TestBinaryDocument

   [junit4] Completed [334/438] on J2 in 0.01s, 2 tests

   [junit4] 

   [junit4] Suite: org.apache.lucene.search.TestTotalHitCountCollector

   [junit4] Completed [335/438] on J0 in 0.01s, 1 test

   [junit4] 

   [junit4] Suite: org.apache.lucene.search.spans.TestSpanFirstQuery

   [junit4] Completed [336/438] on J0 in 0.02s, 1 test

   [junit4] 

   [junit4] Suite: org.apache.lucene.index.TestIsCurrent

   [junit4] Completed [337/438] on J0 in 0.04s, 2 tests

   [junit4] 

   [junit4] Suite: org.apache.lucene.index.TestNoMergePolicy

   [junit4] Completed [338/438] on J0 in 0.02s, 4 tests

   [junit4] 

   [junit4] Suite: org.apache.lucene.util.TestNamedSPILoader

   [junit4] Completed [339/438] on J0 in 0.01s, 3 tests

   [junit4] 

   [junit4] Suite: org.apache.lucene.search.TestBooleanScorer

   [junit4] Completed [340/438] on J2 in 1.23s, 5 tests

   [junit4] 

   [junit4] Suite: org.apache.lucene.util.TestBytesRef

   [junit4] Completed [341/438] on J0 in 0.01s, 3 tests

   [junit4] 

   [junit4] Suite: org.apache.lucene.analysis.TestCharFilter

   [junit4] Completed [342/438] on J2 in 0.01s, 4 tests

   [junit4] 

   [junit4] Suite: org.apache.lucene.index.TestRollback

   [junit4] Completed [343/438] on J0 in 0.01s, 1 test

   [junit4] 

   [junit4] Suite: org.apache.lucene.search.TestNot

   [junit4] Completed [344/438] on J2 in 0.01s, 1 test

   [junit4] 

   [junit4] Suite: org.apache.lucene.search.MultiCollectorTest

   [junit4] Completed [345/438] on J0 in 0.01s, 4 tests

   [junit4] 

   [junit4] Suite: org.apache.lucene.analysis.tokenattributes.TestSimpleAttributeImpl

   [junit4] Completed [346/438] on J2 in 0.01s, 1 test

   [junit4] 

   [junit4] Suite: org.apache.lucene.index.TestTermdocPerf

   [junit4] Completed [347/438] on J0 in 0.01s, 1 test

   [junit4] 

   [junit4] Suite: org.apache.lucene.index.Test2BPositions

   [junit4] IGNOR/A 0.00s J2 | Test2BPositions.test

   [junit4]    > Assumption #1: 'monster' test group is disabled (@Monster(value=uses lots of space and takes a few minutes))

   [junit4] Completed [348/438] on J2 in 0.00s, 1 test, 1 skipped

   [junit4] 

   [junit4] Suite: org.apache.lucene.index.TestTerm

   [junit4] Completed [349/438] on J0 in 0.01s, 1 test

   [junit4] 

   [junit4] Suite: org.apache.lucene.index.TestNewestSegment

   [junit4] Completed [350/438] on J2 in 0.01s, 1 test

   [junit4] 

   [junit4] Suite: org.apache.lucene.index.Test2BNumericDocValues

   [junit4] IGNOR/A 0.00s J0 | Test2BNumericDocValues.testNumerics

   [junit4]    > Assumption #1: 'monster' test group is disabled (@Monster(value=takes ~ 2 hours if the heap is 5gb))

   [junit4] Completed [351/438] on J0 in 0.00s, 1 test, 1 skipped

   [junit4] 

   [junit4] Suite: org.apache.lucene.index.Test2BBinaryDocValues

   [junit4] IGNOR/A 0.00s J2 | Test2BBinaryDocValues.testFixedBinary

   [junit4]    > Assumption #1: 'monster' test group is disabled (@Monster(value=takes ~ 6 hours if the heap is 5gb))

   [junit4] IGNOR/A 0.00s J2 | Test2BBinaryDocValues.testVariableBinary

   [junit4]    > Assumption #1: 'monster' test group is disabled (@Monster(value=takes ~ 6 hours if the heap is 5gb))

   [junit4] Completed [352/438] on J2 in 0.01s, 2 tests, 2 skipped

   [junit4] 

   [junit4] Suite: org.apache.lucene.util.Test2BPagedBytes

   [junit4] IGNOR/A 0.00s J0 | Test2BPagedBytes.test

   [junit4]    > Assumption #1: 'monster' test group is disabled (@Monster(value=You must increase heap to > 2 G to run this))

   [junit4] Completed [353/438] on J0 in 0.00s, 1 test, 1 skipped

   [junit4] 

   [junit4] Suite: org.apache.lucene.analysis.TestCharArraySet

   [junit4] Completed [354/438] on J2 in 0.03s, 15 tests

   [junit4] 

   [junit4] Suite: org.apache.lucene.analysis.TestReusableStringReader

   [junit4] Completed [355/438] on J0 in 0.01s, 1 test

   [junit4] 

   [junit4] Suite: org.apache.lucene.analysis.tokenattributes.TestBytesRefAttImpl

   [junit4] Completed [356/438] on J2 in 0.01s, 1 test

   [junit4] 

   [junit4] Suite: org.apache.lucene.analysis.tokenattributes.TestPackedTokenAttributeImpl

   [junit4] Completed [357/438] on J0 in 0.01s, 4 tests

   [junit4] 

   [junit4] Suite: org.apache.lucene.codecs.TestCodecLoadingDeadlock

   [junit4] Completed [358/438] on J2 in 0.30s, 1 test

   [junit4] 

   [junit4] Suite: org.apache.lucene.codecs.lucene53.TestLucene53NormsFormat

   [junit4] IGNOR/A 0.00s J2 | TestLucene53NormsFormat.testMergeStability

   [junit4]    > Assumption #1: The MockRandom PF randomizes content on the fly, so we can't check it

   [junit4] IGNOR/A 0.00s J2 | TestLucene53NormsFormat.testNCommonBig

   [junit4]    > Assumption #1: 'nightly' test group is disabled (@Nightly())

   [junit4] Completed [359/438] on J2 in 4.33s, 17 tests, 2 skipped

   [junit4] 

   [junit4] HEARTBEAT J1 PID(6438@localhost): 2016-08-01T07:41:58, stalled for 66.2s at: TestBoolean2 (suite)

   [junit4] Suite: org.apache.lucene.codecs.compressing.TestGrowableByteArrayDataOutput

   [junit4] Completed [360/438] on J0 in 49.91s, 2 tests

   [junit4] 

   [junit4] Suite: org.apache.lucene.codecs.lucene60.TestLucene60PointsFormat

   [junit4] IGNOR/A 0.00s J0 | TestLucene60PointsFormat.testRandomBinaryBig

   [junit4]    > Assumption #1: 'nightly' test group is disabled (@Nightly())

   [junit4] IGNOR/A 0.00s J0 | TestLucene60PointsFormat.testMergeStability

   [junit4]    > Assumption #1: merge is not stable

   [junit4] Completed [361/438] on J0 in 3.74s, 17 tests, 2 skipped

   [junit4] 

   [junit4] Suite: org.apache.lucene.geo.TestGeoEncodingUtils

   [junit4] Completed [362/438] on J0 in 1.03s, 3 tests

   [junit4] 

   [junit4] Suite: org.apache.lucene.index.Test2BSortedDocValuesFixedSorted

   [junit4] IGNOR/A 0.00s J0 | Test2BSortedDocValuesFixedSorted.testFixedSorted

   [junit4]    > Assumption #1: 'monster' test group is disabled (@Monster(value=Takes ~ 6 hours if the heap is 5gb))

   [junit4] Completed [363/438] on J0 in 0.01s, 1 test, 1 skipped

   [junit4] 

   [junit4] Suite: org.apache.lucene.index.Test2BSortedDocValuesOrds

   [junit4] IGNOR/A 0.00s J0 | Test2BSortedDocValuesOrds.test2BOrds

   [junit4]    > Assumption #1: 'monster' test group is disabled (@Monster(value=Takes ~ 6 hours if the heap is 5gb))

   [junit4] Completed [364/438] on J0 in 0.00s, 1 test, 1 skipped

   [junit4] 

   [junit4] Suite: org.apache.lucene.index.TestAllFilesCheckIndexHeader

   [junit4] Completed [365/438] on J0 in 0.50s, 1 test

   [junit4] 

   [junit4] Suite: org.apache.lucene.index.TestAllFilesDetectTruncation

   [junit4] Completed [366/438] on J0 in 0.44s, 1 test

   [junit4] 

   [junit4] Suite: org.apache.lucene.index.TestAllFilesHaveChecksumFooter

   [junit4] Completed [367/438] on J0 in 0.29s, 1 test

   [junit4] 

   [junit4] Suite: org.apache.lucene.index.TestBinaryDocValuesUpdates

   [junit4] IGNOR/A 0.00s J0 | TestBinaryDocValuesUpdates.testTonsOfUpdates

   [junit4]    > Assumption #1: 'nightly' test group is disabled (@Nightly())

   [junit4] Completed [368/438] on J0 in 4.11s, 28 tests, 1 skipped

   [junit4] 

   [junit4] Suite: org.apache.lucene.index.TestDemoParallelLeafReader

   [junit4] Completed [369/438] on J0 in 3.70s, 5 tests

   [junit4] 

   [junit4] Suite: org.apache.lucene.index.TestDocIDMerger

   [junit4] Completed [370/438] on J0 in 0.07s, 2 tests

   [junit4] 

   [junit4] Suite: org.apache.lucene.index.TestDocInverterPerFieldErrorInfo

   [junit4] Completed [371/438] on J0 in 0.02s, 2 tests

   [junit4] 

   [junit4] Suite: org.apache.lucene.codecs.lucene54.TestLucene54DocValuesFormat

   [junit4] IGNOR/A 0.00s J2 | TestLucene54DocValuesFormat.testTermsEnumRandomMany

   [junit4]    > Assumption #1: 'nightly' test group is disabled (@Nightly())

   [junit4] IGNOR/A 0.00s J2 | TestLucene54DocValuesFormat.testSortedVariableLengthManyVsStoredFields

   [junit4]    > Assumption #1: 'nightly' test group is disabled (@Nightly())

   [junit4] IGNOR/A 0.00s J2 | TestLucene54DocValuesFormat.testSortedSetVariableLengthManyVsStoredFields

   [junit4]    > Assumption #1: 'nightly' test group is disabled (@Nightly())

   [junit4] Completed [372/438] on J2 in 61.18s, 109 tests, 3 skipped

   [junit4] 

   [junit4] Suite: org.apache.lucene.index.TestDocValues

   [junit4] Completed [373/438] on J0 in 0.08s, 7 tests

   [junit4] 

   [junit4] Suite: org.apache.lucene.index.TestDuelingCodecsAtNight

   [junit4] IGNOR/A 0.00s J2 | TestDuelingCodecsAtNight.testBigEquals

   [junit4]    > Assumption #1: 'nightly' test group is disabled (@Nightly())

   [junit4] IGNOR/A 0.00s J2 | TestDuelingCodecsAtNight.testCrazyReaderEquals

   [junit4]    > Assumption #1: 'nightly' test group is disabled (@Nightly())

   [junit4] IGNOR/A 0.00s J2 | TestDuelingCodecsAtNight.testEquals

   [junit4]    > Assumption #1: 'nightly' test group is disabled (@Nightly())

   [junit4] Completed [374/438] on J2 in 0.00s, 3 tests, 3 skipped

   [junit4] 

   [junit4] Suite: org.apache.lucene.index.TestFieldReuse

   [junit4] Completed [375/438] on J2 in 0.02s, 3 tests

   [junit4] 

   [junit4] Suite: org.apache.lucene.index.TestExitableDirectoryReader

   [junit4] Completed [376/438] on J0 in 0.42s, 1 test

   [junit4] 

   [junit4] Suite: org.apache.lucene.index.TestFilterDirectoryReader

   [junit4] Completed [377/438] on J2 in 0.01s, 1 test

   [junit4] 

   [junit4] Suite: org.apache.lucene.index.TestIndexReaderClose

   [junit4] Completed [378/438] on J0 in 0.13s, 2 tests

   [junit4] 

   [junit4] Suite: org.apache.lucene.index.TestIndexWriterExceptions2

   [junit4] Completed [379/438] on J0 in 4.21s, 1 test

   [junit4] 

   [junit4] Suite: org.apache.lucene.index.TestIndexWriterOutOfFileDescriptors

   [junit4] Completed [380/438] on J0 in 1.86s, 1 test

   [junit4] 

   [junit4] Suite: org.apache.lucene.index.TestIndexSorting

   [junit4] Completed [381/438] on J2 in 22.42s, 27 tests

   [junit4] 

   [junit4] Suite: org.apache.lucene.index.TestInfoStream

   [junit4] Completed [382/438] on J2 in 0.04s, 2 tests

   [junit4] 

   [junit4] Suite: org.apache.lucene.index.TestLogMergePolicy

   [junit4] Completed [383/438] on J2 in 0.01s, 2 tests

   [junit4] 

   [junit4] Suite: org.apache.lucene.index.TestMergePolicyWrapper

   [junit4] Completed [384/438] on J2 in 0.01s, 1 test

   [junit4] 

   [junit4] Suite: org.apache.lucene.index.TestNRTReaderCleanup

   [junit4] Completed [385/438] on J2 in 0.01s, 1 test

   [junit4] 

   [junit4] Suite: org.apache.lucene.index.TestOrdinalMap

   [junit4] Completed [386/438] on J2 in 0.06s, 1 test

   [junit4] 

   [junit4] Suite: org.apache.lucene.index.TestPointValues

   [junit4] Completed [387/438] on J2 in 2.55s, 32 tests

   [junit4] 

   [junit4] Suite: org.apache.lucene.index.TestReadOnlyIndex

   [junit4] Completed [388/438] on J2 in 0.06s, 1 test

   [junit4] 

   [junit4] Suite: org.apache.lucene.index.TestSwappedIndexFiles

   [junit4] Completed [389/438] on J2 in 0.14s, 1 test

   [junit4] 

   [junit4] Suite: org.apache.lucene.index.TestTermVectors

   [junit4] Completed [390/438] on J2 in 0.41s, 3 tests

   [junit4] 

   [junit4] Suite: org.apache.lucene.index.TestTryDelete

   [junit4] Completed [391/438] on J2 in 0.15s, 3 tests

   [junit4] 

   [junit4] Suite: org.apache.lucene.search.FuzzyTermOnShortTermsTest

   [junit4] Completed [392/438] on J2 in 0.20s, 1 test

   [junit4] 

   [junit4] Suite: org.apache.lucene.search.TestBlendedTermQuery

   [junit4] Completed [393/438] on J2 in 0.05s, 3 tests

   [junit4] 

   [junit4] Suite: org.apache.lucene.search.TestBooleanRewrites

   [junit4] Completed [394/438] on J2 in 0.47s, 7 tests

   [junit4] 

   [junit4] Suite: org.apache.lucene.search.TestEarlyTermination

   [junit4] Completed [395/438] on J2 in 0.20s, 1 test

   [junit4] 

   [junit4] Suite: org.apache.lucene.search.TestMultiCollector

   [junit4] Completed [396/438] on J2 in 0.14s, 2 tests

   [junit4] 

   [junit4] Suite: org.apache.lucene.search.TestMultiset

   [junit4] Completed [397/438] on J2 in 0.03s, 2 tests

   [junit4] 

   [junit4] Suite: org.apache.lucene.search.TestNeedsScores

   [junit4] Completed [398/438] on J2 in 0.02s, 4 tests

   [junit4] 

   [junit4] Suite: org.apache.lucene.index.TestIndexingSequenceNumbers

   [junit4] Completed [399/438] on J0 in 29.40s, 8 tests

   [junit4] 

   [junit4] Suite: org.apache.lucene.search.TestSortRescorer

   [junit4] Completed [400/438] on J0 in 0.44s, 2 tests

   [junit4] 

   [junit4] Suite: org.apache.lucene.search.TestUsageTrackingFilterCachingPolicy

   [junit4] Completed [401/438] on J0 in 0.16s, 2 tests

   [junit4] 

   [junit4] Suite: org.apache.lucene.search.spans.TestSpanBoostQuery

   [junit4] Completed [402/438] on J0 in 0.03s, 2 tests

   [junit4] 

   [junit4] Suite: org.apache.lucene.search.spans.TestSpanContainQuery

   [junit4] Completed [403/438] on J0 in 0.05s, 4 tests

   [junit4] 

   [junit4] Suite: org.apache.lucene.search.spans.TestSpanNearQuery

   [junit4] Completed [404/438] on J0 in 0.04s, 4 tests

   [junit4] 

   [junit4] Suite: org.apache.lucene.search.spans.TestSpanNotQuery

   [junit4] Completed [405/438] on J0 in 0.02s, 3 tests

   [junit4] 

   [junit4] Suite: org.apache.lucene.search.spans.TestSpanOrQuery

   [junit4] Completed [406/438] on J0 in 0.01s, 3 tests

   [junit4] 

   [junit4] Suite: org.apache.lucene.search.spans.TestSpanTermQuery

   [junit4] Completed [407/438] on J0 in 0.12s, 2 tests

   [junit4] 

   [junit4] Suite: org.apache.lucene.search.spans.TestSpansEnum

   [junit4] Completed [408/438] on J0 in 0.07s, 7 tests

   [junit4] 

   [junit4] Suite: org.apache.lucene.store.TestBufferedChecksum

   [junit4] Completed [409/438] on J0 in 0.14s, 2 tests

   [junit4] 

   [junit4] Suite: org.apache.lucene.store.TestMmapDirectory

   [junit4] Completed [410/438] on J0 in 1.25s, 44 tests

   [junit4] 

   [junit4] Suite: org.apache.lucene.store.TestNIOFSDirectory

   [junit4] Completed [411/438] on J0 in 1.67s, 44 tests

   [junit4] 

   [junit4] Suite: org.apache.lucene.search.TestBoolean2

   [junit4] Completed [412/438] on J1 in 134.66s, 11 tests

   [junit4] 

   [junit4] Suite: org.apache.lucene.store.TestNativeFSLockFactory

   [junit4] Completed [413/438] on J0 in 4.86s, 10 tests

   [junit4] 

   [junit4] Suite: org.apache.lucene.codecs.perfield.TestPerFieldPostingsFormat2

   [junit4] Completed [414/438] on J1 in 1.45s, 5 tests

   [junit4] 

   [junit4] Suite: org.apache.lucene.store.TestSimpleFSDirectory

   [junit4] Completed [415/438] on J0 in 0.96s, 44 tests

   [junit4] 

   [junit4] Suite: org.apache.lucene.codecs.compressing.TestFastCompressionMode

   [junit4] Completed [416/438] on J1 in 0.76s, 11 tests

   [junit4] 

   [junit4] Suite: org.apache.lucene.util.TestCharsRefBuilder

   [junit4] Completed [417/438] on J1 in 0.01s, 2 tests

   [junit4] 

   [junit4] Suite: org.apache.lucene.search.TestSimpleExplanationsWithFillerDocs

   [junit4] Completed [418/438] on J2 in 18.38s, 70 tests

   [junit4] 

   [junit4] Suite: org.apache.lucene.util.TestFrequencyTrackingRingBuffer

   [junit4] Completed [419/438] on J1 in 0.31s, 2 tests

   [junit4] 

   [junit4] Suite: org.apache.lucene.util.TestInPlaceMergeSorter

   [junit4] Completed [420/438] on J2 in 0.08s, 9 tests

   [junit4] 

   [junit4] Suite: org.apache.lucene.util.TestLongBitSet

   [junit4] IGNOR/A 0.00s J1 | TestLongBitSet.testHugeCapacity

   [junit4]    > Assumption #1: 'nightly' test group is disabled (@Nightly())

   [junit4] Completed [421/438] on J1 in 0.30s, 9 tests, 1 skipped

   [junit4] 

   [junit4] Suite: org.apache.lucene.util.TestSparseFixedBitDocIdSet

   [junit4] Completed [422/438] on J1 in 0.97s, 5 

[...truncated too long message...]

vy-settings.xml


resolve:


ivy-availability-check:


ivy-fail:


ivy-configure:

[ivy:configure] :: loading settings :: file = /x1/jenkins/jenkins-slave/workspace/Lucene-Solr-Tests-6.x/lucene/top-level-ivy-settings.xml


resolve:


ivy-availability-check:


ivy-fail:


ivy-configure:

[ivy:configure] :: loading settings :: file = /x1/jenkins/jenkins-slave/workspace/Lucene-Solr-Tests-6.x/lucene/top-level-ivy-settings.xml


resolve:


ivy-availability-check:


ivy-fail:


ivy-configure:

[ivy:configure] :: loading settings :: file = /x1/jenkins/jenkins-slave/workspace/Lucene-Solr-Tests-6.x/lucene/top-level-ivy-settings.xml


resolve:


ivy-availability-check:


ivy-fail:


ivy-configure:

[ivy:configure] :: loading settings :: file = /x1/jenkins/jenkins-slave/workspace/Lucene-Solr-Tests-6.x/lucene/top-level-ivy-settings.xml


resolve:


ivy-availability-check:


ivy-fail:


ivy-configure:

[ivy:configure] :: loading settings :: file = /x1/jenkins/jenkins-slave/workspace/Lucene-Solr-Tests-6.x/lucene/top-level-ivy-settings.xml


resolve:


ivy-availability-check:


ivy-fail:


ivy-configure:

[ivy:configure] :: loading settings :: file = /x1/jenkins/jenkins-slave/workspace/Lucene-Solr-Tests-6.x/lucene/top-level-ivy-settings.xml


resolve:


ivy-availability-check:


ivy-fail:


ivy-configure:

[ivy:configure] :: loading settings :: file = /x1/jenkins/jenkins-slave/workspace/Lucene-Solr-Tests-6.x/lucene/top-level-ivy-settings.xml


resolve:


ivy-availability-check:


ivy-fail:


ivy-configure:

[ivy:configure] :: loading settings :: file = /x1/jenkins/jenkins-slave/workspace/Lucene-Solr-Tests-6.x/lucene/top-level-ivy-settings.xml


resolve:


ivy-availability-check:


ivy-fail:


ivy-configure:

[ivy:configure] :: loading settings :: file = /x1/jenkins/jenkins-slave/workspace/Lucene-Solr-Tests-6.x/lucene/top-level-ivy-settings.xml


resolve:


ivy-availability-check:


ivy-fail:


ivy-configure:

[ivy:configure] :: loading settings :: file = /x1/jenkins/jenkins-slave/workspace/Lucene-Solr-Tests-6.x/lucene/top-level-ivy-settings.xml


resolve:


ivy-availability-check:


ivy-fail:


ivy-configure:

[ivy:configure] :: loading settings :: file = /x1/jenkins/jenkins-slave/workspace/Lucene-Solr-Tests-6.x/lucene/top-level-ivy-settings.xml


resolve:


ivy-availability-check:


ivy-fail:


ivy-configure:

[ivy:configure] :: loading settings :: file = /x1/jenkins/jenkins-slave/workspace/Lucene-Solr-Tests-6.x/lucene/top-level-ivy-settings.xml


resolve:


ivy-availability-check:


ivy-fail:


ivy-configure:

[ivy:configure] :: loading settings :: file = /x1/jenkins/jenkins-slave/workspace/Lucene-Solr-Tests-6.x/lucene/top-level-ivy-settings.xml


common.resolve:


resolve:


ivy-availability-check:


ivy-fail:


ivy-configure:

[ivy:configure] :: loading settings :: file = /x1/jenkins/jenkins-slave/workspace/Lucene-Solr-Tests-6.x/lucene/top-level-ivy-settings.xml


resolve:


ivy-availability-check:


ivy-fail:


ivy-configure:

[ivy:configure] :: loading settings :: file = /x1/jenkins/jenkins-slave/workspace/Lucene-Solr-Tests-6.x/lucene/top-level-ivy-settings.xml


resolve:


ivy-availability-check:


ivy-fail:


ivy-configure:

[ivy:configure] :: loading settings :: file = /x1/jenkins/jenkins-slave/workspace/Lucene-Solr-Tests-6.x/lucene/top-level-ivy-settings.xml


resolve:


ivy-availability-check:


ivy-fail:


ivy-configure:

[ivy:configure] :: loading settings :: file = /x1/jenkins/jenkins-slave/workspace/Lucene-Solr-Tests-6.x/lucene/top-level-ivy-settings.xml


resolve:


ivy-availability-check:


ivy-fail:


ivy-configure:

[ivy:configure] :: loading settings :: file = /x1/jenkins/jenkins-slave/workspace/Lucene-Solr-Tests-6.x/lucene/top-level-ivy-settings.xml


resolve:


jar-checksums:

    [mkdir] Created dir: /x1/jenkins/jenkins-slave/workspace/Lucene-Solr-Tests-6.x/lucene/null783830220

     [copy] Copying 34 files to /x1/jenkins/jenkins-slave/workspace/Lucene-Solr-Tests-6.x/lucene/null783830220

   [delete] Deleting directory /x1/jenkins/jenkins-slave/workspace/Lucene-Solr-Tests-6.x/lucene/null783830220


resolve-example:


ivy-availability-check:


ivy-fail:


ivy-configure:

[ivy:configure] :: loading settings :: file = /x1/jenkins/jenkins-slave/workspace/Lucene-Solr-Tests-6.x/lucene/top-level-ivy-settings.xml


resolve:


resolve-server:


ivy-availability-check:


ivy-fail:


ivy-fail:


ivy-configure:

[ivy:configure] :: loading settings :: file = /x1/jenkins/jenkins-slave/workspace/Lucene-Solr-Tests-6.x/lucene/top-level-ivy-settings.xml


resolve:


resolve:


ivy-availability-check:


ivy-fail:


ivy-fail:


ivy-configure:

[ivy:configure] :: loading settings :: file = /x1/jenkins/jenkins-slave/workspace/Lucene-Solr-Tests-6.x/lucene/top-level-ivy-settings.xml


resolve:


ivy-availability-check:


ivy-fail:


ivy-fail:


ivy-configure:

[ivy:configure] :: loading settings :: file = /x1/jenkins/jenkins-slave/workspace/Lucene-Solr-Tests-6.x/lucene/top-level-ivy-settings.xml


resolve:


ivy-availability-check:


ivy-fail:


ivy-configure:

[ivy:configure] :: loading settings :: file = /x1/jenkins/jenkins-slave/workspace/Lucene-Solr-Tests-6.x/lucene/top-level-ivy-settings.xml


resolve:


ivy-availability-check:


ivy-fail:


ivy-fail:


ivy-configure:

[ivy:configure] :: loading settings :: file = /x1/jenkins/jenkins-slave/workspace/Lucene-Solr-Tests-6.x/lucene/top-level-ivy-settings.xml


resolve:


ivy-availability-check:


ivy-fail:


ivy-fail:


ivy-configure:

[ivy:configure] :: loading settings :: file = /x1/jenkins/jenkins-slave/workspace/Lucene-Solr-Tests-6.x/lucene/top-level-ivy-settings.xml


resolve:


ivy-availability-check:


ivy-fail:


ivy-fail:


ivy-configure:

[ivy:configure] :: loading settings :: file = /x1/jenkins/jenkins-slave/workspace/Lucene-Solr-Tests-6.x/lucene/top-level-ivy-settings.xml


resolve:


ivy-availability-check:


ivy-fail:


ivy-fail:


ivy-configure:

[ivy:configure] :: loading settings :: file = /x1/jenkins/jenkins-slave/workspace/Lucene-Solr-Tests-6.x/lucene/top-level-ivy-settings.xml


resolve:


ivy-availability-check:


ivy-fail:


ivy-fail:


ivy-configure:

[ivy:configure] :: loading settings :: file = /x1/jenkins/jenkins-slave/workspace/Lucene-Solr-Tests-6.x/lucene/top-level-ivy-settings.xml


resolve:


ivy-availability-check:


ivy-fail:


ivy-fail:


ivy-configure:

[ivy:configure] :: loading settings :: file = /x1/jenkins/jenkins-slave/workspace/Lucene-Solr-Tests-6.x/lucene/top-level-ivy-settings.xml


resolve:


ivy-availability-check:


ivy-fail:


ivy-fail:


ivy-configure:

[ivy:configure] :: loading settings :: file = /x1/jenkins/jenkins-slave/workspace/Lucene-Solr-Tests-6.x/lucene/top-level-ivy-settings.xml


resolve:


ivy-availability-check:


ivy-fail:


ivy-fail:


ivy-configure:

[ivy:configure] :: loading settings :: file = /x1/jenkins/jenkins-slave/workspace/Lucene-Solr-Tests-6.x/lucene/top-level-ivy-settings.xml


resolve:


ivy-availability-check:


ivy-fail:


ivy-fail:


ivy-configure:

[ivy:configure] :: loading settings :: file = /x1/jenkins/jenkins-slave/workspace/Lucene-Solr-Tests-6.x/lucene/top-level-ivy-settings.xml


resolve:


ivy-availability-check:


ivy-fail:


ivy-fail:


ivy-configure:

[ivy:configure] :: loading settings :: file = /x1/jenkins/jenkins-slave/workspace/Lucene-Solr-Tests-6.x/lucene/top-level-ivy-settings.xml


resolve:


ivy-availability-check:


ivy-fail:


ivy-fail:


ivy-configure:

[ivy:configure] :: loading settings :: file = /x1/jenkins/jenkins-slave/workspace/Lucene-Solr-Tests-6.x/lucene/top-level-ivy-settings.xml


resolve:


ivy-availability-check:


ivy-fail:


ivy-fail:


ivy-configure:

[ivy:configure] :: loading settings :: file = /x1/jenkins/jenkins-slave/workspace/Lucene-Solr-Tests-6.x/lucene/top-level-ivy-settings.xml


resolve:


jar-checksums:

    [mkdir] Created dir: /x1/jenkins/jenkins-slave/workspace/Lucene-Solr-Tests-6.x/solr/null70607886

     [copy] Copying 259 files to /x1/jenkins/jenkins-slave/workspace/Lucene-Solr-Tests-6.x/solr/null70607886

   [delete] Deleting directory /x1/jenkins/jenkins-slave/workspace/Lucene-Solr-Tests-6.x/solr/null70607886


check-working-copy:

[ivy:cachepath] :: resolving dependencies :: org.eclipse.jgit#org.eclipse.jgit-caller;working

[ivy:cachepath] 	confs: [default]

[ivy:cachepath] 	found org.eclipse.jgit#org.eclipse.jgit;4.4.1.201607150455-r in public

[ivy:cachepath] 	found com.jcraft#jsch;0.1.53 in public

[ivy:cachepath] 	found com.googlecode.javaewah#JavaEWAH;0.7.9 in public

[ivy:cachepath] 	found org.apache.httpcomponents#httpclient;4.3.6 in public

[ivy:cachepath] 	found org.apache.httpcomponents#httpcore;4.3.3 in public

[ivy:cachepath] 	found commons-logging#commons-logging;1.1.3 in public

[ivy:cachepath] 	found commons-codec#commons-codec;1.6 in public

[ivy:cachepath] 	found org.slf4j#slf4j-api;1.7.2 in public

[ivy:cachepath] :: resolution report :: resolve 17ms :: artifacts dl 1ms

	---------------------------------------------------------------------

	|                  |            modules            ||   artifacts   |

	|       conf       | number| search|dwnlded|evicted|| number|dwnlded|

	---------------------------------------------------------------------

	|      default     |   8   |   0   |   0   |   0   ||   8   |   0   |

	---------------------------------------------------------------------

[wc-checker] Initializing working copy...

[wc-checker] SLF4J: Failed to load class "org.slf4j.impl.StaticLoggerBinder".

[wc-checker] SLF4J: Defaulting to no-operation (NOP) logger implementation

[wc-checker] SLF4J: See http://www.slf4j.org/codes.html#StaticLoggerBinder for further details.

[wc-checker] Checking working copy status...


-jenkins-base:


BUILD SUCCESSFUL

Total time: 74 minutes 6 seconds

Archiving artifacts

Recording test results

Build step 'Publish JUnit test result report' changed build result to UNSTABLE

Email was triggered for: Unstable (Test Failures)

Sending email for trigger: Unstable (Test Failures)





[JENKINS] Lucene-Solr-Tests-6.x - Build # 363 - Still Unstable

Posted by Apache Jenkins Server <je...@builds.apache.org>.
Build: https://builds.apache.org/job/Lucene-Solr-Tests-6.x/363/

1 tests failed.
FAILED:  org.apache.solr.cloud.LeaderFailoverAfterPartitionTest.test

Error Message:
No live SolrServers available to handle this request:[http://127.0.0.1:42174/frn/p/c8n_1x3_lf_shard1_replica2]

Stack Trace:
org.apache.solr.client.solrj.impl.CloudSolrClient$RouteException: No live SolrServers available to handle this request:[http://127.0.0.1:42174/frn/p/c8n_1x3_lf_shard1_replica2]
	at __randomizedtesting.SeedInfo.seed([AE386E48E8DF754:82B7B93E20719AAC]:0)
	at org.apache.solr.client.solrj.impl.CloudSolrClient.directUpdate(CloudSolrClient.java:760)
	at org.apache.solr.client.solrj.impl.CloudSolrClient.sendRequest(CloudSolrClient.java:1172)
	at org.apache.solr.client.solrj.impl.CloudSolrClient.requestWithRetryOnStaleState(CloudSolrClient.java:1061)
	at org.apache.solr.client.solrj.impl.CloudSolrClient.request(CloudSolrClient.java:997)
	at org.apache.solr.client.solrj.SolrClient.request(SolrClient.java:1219)
	at org.apache.solr.cloud.HttpPartitionTest.sendDoc(HttpPartitionTest.java:592)
	at org.apache.solr.cloud.HttpPartitionTest.sendDoc(HttpPartitionTest.java:578)
	at org.apache.solr.cloud.LeaderFailoverAfterPartitionTest.testRf3WithLeaderFailover(LeaderFailoverAfterPartitionTest.java:174)
	at org.apache.solr.cloud.LeaderFailoverAfterPartitionTest.test(LeaderFailoverAfterPartitionTest.java:55)
	at sun.reflect.NativeMethodAccessorImpl.invoke0(Native Method)
	at sun.reflect.NativeMethodAccessorImpl.invoke(NativeMethodAccessorImpl.java:62)
	at sun.reflect.DelegatingMethodAccessorImpl.invoke(DelegatingMethodAccessorImpl.java:43)
	at java.lang.reflect.Method.invoke(Method.java:498)
	at com.carrotsearch.randomizedtesting.RandomizedRunner.invoke(RandomizedRunner.java:1764)
	at com.carrotsearch.randomizedtesting.RandomizedRunner$8.evaluate(RandomizedRunner.java:871)
	at com.carrotsearch.randomizedtesting.RandomizedRunner$9.evaluate(RandomizedRunner.java:907)
	at com.carrotsearch.randomizedtesting.RandomizedRunner$10.evaluate(RandomizedRunner.java:921)
	at org.apache.solr.BaseDistributedSearchTestCase$ShardsRepeatRule$ShardsFixedStatement.callStatement(BaseDistributedSearchTestCase.java:992)
	at org.apache.solr.BaseDistributedSearchTestCase$ShardsRepeatRule$ShardsStatement.evaluate(BaseDistributedSearchTestCase.java:967)
	at com.carrotsearch.randomizedtesting.rules.SystemPropertiesRestoreRule$1.evaluate(SystemPropertiesRestoreRule.java:57)
	at org.apache.lucene.util.TestRuleSetupTeardownChained$1.evaluate(TestRuleSetupTeardownChained.java:49)
	at org.apache.lucene.util.AbstractBeforeAfterRule$1.evaluate(AbstractBeforeAfterRule.java:45)
	at org.apache.lucene.util.TestRuleThreadAndTestName$1.evaluate(TestRuleThreadAndTestName.java:48)
	at org.apache.lucene.util.TestRuleIgnoreAfterMaxFailures$1.evaluate(TestRuleIgnoreAfterMaxFailures.java:64)
	at org.apache.lucene.util.TestRuleMarkFailure$1.evaluate(TestRuleMarkFailure.java:47)
	at com.carrotsearch.randomizedtesting.rules.StatementAdapter.evaluate(StatementAdapter.java:36)
	at com.carrotsearch.randomizedtesting.ThreadLeakControl$StatementRunner.run(ThreadLeakControl.java:367)
	at com.carrotsearch.randomizedtesting.ThreadLeakControl.forkTimeoutingTask(ThreadLeakControl.java:809)
	at com.carrotsearch.randomizedtesting.ThreadLeakControl$3.evaluate(ThreadLeakControl.java:460)
	at com.carrotsearch.randomizedtesting.RandomizedRunner.runSingleTest(RandomizedRunner.java:880)
	at com.carrotsearch.randomizedtesting.RandomizedRunner$5.evaluate(RandomizedRunner.java:781)
	at com.carrotsearch.randomizedtesting.RandomizedRunner$6.evaluate(RandomizedRunner.java:816)
	at com.carrotsearch.randomizedtesting.RandomizedRunner$7.evaluate(RandomizedRunner.java:827)
	at com.carrotsearch.randomizedtesting.rules.StatementAdapter.evaluate(StatementAdapter.java:36)
	at com.carrotsearch.randomizedtesting.rules.SystemPropertiesRestoreRule$1.evaluate(SystemPropertiesRestoreRule.java:57)
	at org.apache.lucene.util.AbstractBeforeAfterRule$1.evaluate(AbstractBeforeAfterRule.java:45)
	at com.carrotsearch.randomizedtesting.rules.StatementAdapter.evaluate(StatementAdapter.java:36)
	at org.apache.lucene.util.TestRuleStoreClassName$1.evaluate(TestRuleStoreClassName.java:41)
	at com.carrotsearch.randomizedtesting.rules.NoShadowingOrOverridesOnMethodsRule$1.evaluate(NoShadowingOrOverridesOnMethodsRule.java:40)
	at com.carrotsearch.randomizedtesting.rules.NoShadowingOrOverridesOnMethodsRule$1.evaluate(NoShadowingOrOverridesOnMethodsRule.java:40)
	at com.carrotsearch.randomizedtesting.rules.StatementAdapter.evaluate(StatementAdapter.java:36)
	at com.carrotsearch.randomizedtesting.rules.StatementAdapter.evaluate(StatementAdapter.java:36)
	at com.carrotsearch.randomizedtesting.rules.StatementAdapter.evaluate(StatementAdapter.java:36)
	at org.apache.lucene.util.TestRuleAssertionsRequired$1.evaluate(TestRuleAssertionsRequired.java:53)
	at org.apache.lucene.util.TestRuleMarkFailure$1.evaluate(TestRuleMarkFailure.java:47)
	at org.apache.lucene.util.TestRuleIgnoreAfterMaxFailures$1.evaluate(TestRuleIgnoreAfterMaxFailures.java:64)
	at org.apache.lucene.util.TestRuleIgnoreTestSuites$1.evaluate(TestRuleIgnoreTestSuites.java:54)
	at com.carrotsearch.randomizedtesting.rules.StatementAdapter.evaluate(StatementAdapter.java:36)
	at com.carrotsearch.randomizedtesting.ThreadLeakControl$StatementRunner.run(ThreadLeakControl.java:367)
	at java.lang.Thread.run(Thread.java:745)
Caused by: org.apache.solr.client.solrj.SolrServerException: No live SolrServers available to handle this request:[http://127.0.0.1:42174/frn/p/c8n_1x3_lf_shard1_replica2]
	at org.apache.solr.client.solrj.impl.LBHttpSolrClient.request(LBHttpSolrClient.java:383)
	at org.apache.solr.client.solrj.impl.CloudSolrClient.lambda$directUpdate$0(CloudSolrClient.java:735)
	at java.util.concurrent.FutureTask.run(FutureTask.java:266)
	at org.apache.solr.common.util.ExecutorUtil$MDCAwareThreadPoolExecutor.lambda$execute$0(ExecutorUtil.java:229)
	at java.util.concurrent.ThreadPoolExecutor.runWorker(ThreadPoolExecutor.java:1142)
	at java.util.concurrent.ThreadPoolExecutor$Worker.run(ThreadPoolExecutor.java:617)
	... 1 more
Caused by: org.apache.solr.client.solrj.SolrServerException: Server refused connection at: http://127.0.0.1:42174/frn/p/c8n_1x3_lf_shard1_replica2
	at org.apache.solr.client.solrj.impl.HttpSolrClient.executeMethod(HttpSolrClient.java:597)
	at org.apache.solr.client.solrj.impl.HttpSolrClient.request(HttpSolrClient.java:259)
	at org.apache.solr.client.solrj.impl.HttpSolrClient.request(HttpSolrClient.java:248)
	at org.apache.solr.client.solrj.impl.LBHttpSolrClient.doRequest(LBHttpSolrClient.java:403)
	at org.apache.solr.client.solrj.impl.LBHttpSolrClient.request(LBHttpSolrClient.java:356)
	... 6 more
Caused by: java.net.ConnectException: Connection refused
	at java.net.PlainSocketImpl.socketConnect(Native Method)
	at java.net.AbstractPlainSocketImpl.doConnect(AbstractPlainSocketImpl.java:350)
	at java.net.AbstractPlainSocketImpl.connectToAddress(AbstractPlainSocketImpl.java:206)
	at java.net.AbstractPlainSocketImpl.connect(AbstractPlainSocketImpl.java:188)
	at java.net.SocksSocketImpl.connect(SocksSocketImpl.java:392)
	at java.net.Socket.connect(Socket.java:589)
	at org.apache.http.conn.scheme.PlainSocketFactory.connectSocket(PlainSocketFactory.java:117)
	at org.apache.http.impl.conn.DefaultClientConnectionOperator.openConnection(DefaultClientConnectionOperator.java:177)
	at org.apache.http.impl.conn.ManagedClientConnectionImpl.open(ManagedClientConnectionImpl.java:304)
	at org.apache.http.impl.client.DefaultRequestDirector.tryConnect(DefaultRequestDirector.java:611)
	at org.apache.http.impl.client.DefaultRequestDirector.execute(DefaultRequestDirector.java:446)
	at org.apache.http.impl.client.AbstractHttpClient.doExecute(AbstractHttpClient.java:882)
	at org.apache.http.impl.client.CloseableHttpClient.execute(CloseableHttpClient.java:82)
	at org.apache.http.impl.client.CloseableHttpClient.execute(CloseableHttpClient.java:107)
	at org.apache.http.impl.client.CloseableHttpClient.execute(CloseableHttpClient.java:55)
	at org.apache.solr.client.solrj.impl.HttpSolrClient.executeMethod(HttpSolrClient.java:495)
	... 10 more




Build Log:
[...truncated 11432 lines...]
   [junit4] Suite: org.apache.solr.cloud.LeaderFailoverAfterPartitionTest
   [junit4]   2> Creating dataDir: /x1/jenkins/jenkins-slave/workspace/Lucene-Solr-Tests-6.x/solr/build/solr-core/test/J2/temp/solr.cloud.LeaderFailoverAfterPartitionTest_AE386E48E8DF754-001/init-core-data-001
   [junit4]   2> 705375 INFO  (SUITE-LeaderFailoverAfterPartitionTest-seed#[AE386E48E8DF754]-worker) [    ] o.a.s.SolrTestCaseJ4 Randomized ssl (false) and clientAuth (false) via: @org.apache.solr.SolrTestCaseJ4$SuppressSSL(bugUrl=https://issues.apache.org/jira/browse/SOLR-5776)
   [junit4]   2> 705375 INFO  (SUITE-LeaderFailoverAfterPartitionTest-seed#[AE386E48E8DF754]-worker) [    ] o.a.s.BaseDistributedSearchTestCase Setting hostContext system property: /frn/p
   [junit4]   2> 705377 INFO  (TEST-LeaderFailoverAfterPartitionTest.test-seed#[AE386E48E8DF754]) [    ] o.a.s.c.ZkTestServer STARTING ZK TEST SERVER
   [junit4]   2> 705377 INFO  (Thread-3889) [    ] o.a.s.c.ZkTestServer client port:0.0.0.0/0.0.0.0:0
   [junit4]   2> 705377 INFO  (Thread-3889) [    ] o.a.s.c.ZkTestServer Starting server
   [junit4]   2> 705477 INFO  (TEST-LeaderFailoverAfterPartitionTest.test-seed#[AE386E48E8DF754]) [    ] o.a.s.c.ZkTestServer start zk server on port:37340
   [junit4]   2> 705477 INFO  (TEST-LeaderFailoverAfterPartitionTest.test-seed#[AE386E48E8DF754]) [    ] o.a.s.c.c.SolrZkClient Using default ZkCredentialsProvider
   [junit4]   2> 705478 INFO  (TEST-LeaderFailoverAfterPartitionTest.test-seed#[AE386E48E8DF754]) [    ] o.a.s.c.c.ConnectionManager Waiting for client to connect to ZooKeeper
   [junit4]   2> 705480 INFO  (zkCallback-1215-thread-1) [    ] o.a.s.c.c.ConnectionManager Watcher org.apache.solr.common.cloud.ConnectionManager@7ea1f40a name:ZooKeeperConnection Watcher:127.0.0.1:37340 got event WatchedEvent state:SyncConnected type:None path:null path:null type:None
   [junit4]   2> 705480 INFO  (TEST-LeaderFailoverAfterPartitionTest.test-seed#[AE386E48E8DF754]) [    ] o.a.s.c.c.ConnectionManager Client is connected to ZooKeeper
   [junit4]   2> 705480 INFO  (TEST-LeaderFailoverAfterPartitionTest.test-seed#[AE386E48E8DF754]) [    ] o.a.s.c.c.SolrZkClient Using default ZkACLProvider
   [junit4]   2> 705480 INFO  (TEST-LeaderFailoverAfterPartitionTest.test-seed#[AE386E48E8DF754]) [    ] o.a.s.c.c.SolrZkClient makePath: /solr
   [junit4]   2> 705482 INFO  (TEST-LeaderFailoverAfterPartitionTest.test-seed#[AE386E48E8DF754]) [    ] o.a.s.c.c.SolrZkClient Using default ZkCredentialsProvider
   [junit4]   2> 705482 INFO  (TEST-LeaderFailoverAfterPartitionTest.test-seed#[AE386E48E8DF754]) [    ] o.a.s.c.c.ConnectionManager Waiting for client to connect to ZooKeeper
   [junit4]   2> 705483 INFO  (zkCallback-1216-thread-1) [    ] o.a.s.c.c.ConnectionManager Watcher org.apache.solr.common.cloud.ConnectionManager@2a1d9c68 name:ZooKeeperConnection Watcher:127.0.0.1:37340/solr got event WatchedEvent state:SyncConnected type:None path:null path:null type:None
   [junit4]   2> 705483 INFO  (TEST-LeaderFailoverAfterPartitionTest.test-seed#[AE386E48E8DF754]) [    ] o.a.s.c.c.ConnectionManager Client is connected to ZooKeeper
   [junit4]   2> 705483 INFO  (TEST-LeaderFailoverAfterPartitionTest.test-seed#[AE386E48E8DF754]) [    ] o.a.s.c.c.SolrZkClient Using default ZkACLProvider
   [junit4]   2> 705483 INFO  (TEST-LeaderFailoverAfterPartitionTest.test-seed#[AE386E48E8DF754]) [    ] o.a.s.c.c.SolrZkClient makePath: /collections/collection1
   [junit4]   2> 705484 INFO  (TEST-LeaderFailoverAfterPartitionTest.test-seed#[AE386E48E8DF754]) [    ] o.a.s.c.c.SolrZkClient makePath: /collections/collection1/shards
   [junit4]   2> 705486 INFO  (TEST-LeaderFailoverAfterPartitionTest.test-seed#[AE386E48E8DF754]) [    ] o.a.s.c.c.SolrZkClient makePath: /collections/control_collection
   [junit4]   2> 705487 INFO  (TEST-LeaderFailoverAfterPartitionTest.test-seed#[AE386E48E8DF754]) [    ] o.a.s.c.c.SolrZkClient makePath: /collections/control_collection/shards
   [junit4]   2> 705487 INFO  (TEST-LeaderFailoverAfterPartitionTest.test-seed#[AE386E48E8DF754]) [    ] o.a.s.c.AbstractZkTestCase put /x1/jenkins/jenkins-slave/workspace/Lucene-Solr-Tests-6.x/solr/core/src/test-files/solr/collection1/conf/solrconfig-tlog.xml to /configs/conf1/solrconfig.xml
   [junit4]   2> 705488 INFO  (TEST-LeaderFailoverAfterPartitionTest.test-seed#[AE386E48E8DF754]) [    ] o.a.s.c.c.SolrZkClient makePath: /configs/conf1/solrconfig.xml
   [junit4]   2> 705489 INFO  (TEST-LeaderFailoverAfterPartitionTest.test-seed#[AE386E48E8DF754]) [    ] o.a.s.c.AbstractZkTestCase put /x1/jenkins/jenkins-slave/workspace/Lucene-Solr-Tests-6.x/solr/core/src/test-files/solr/collection1/conf/schema.xml to /configs/conf1/schema.xml
   [junit4]   2> 705489 INFO  (TEST-LeaderFailoverAfterPartitionTest.test-seed#[AE386E48E8DF754]) [    ] o.a.s.c.c.SolrZkClient makePath: /configs/conf1/schema.xml
   [junit4]   2> 705490 INFO  (TEST-LeaderFailoverAfterPartitionTest.test-seed#[AE386E48E8DF754]) [    ] o.a.s.c.AbstractZkTestCase put /x1/jenkins/jenkins-slave/workspace/Lucene-Solr-Tests-6.x/solr/core/src/test-files/solr/collection1/conf/solrconfig.snippet.randomindexconfig.xml to /configs/conf1/solrconfig.snippet.randomindexconfig.xml
   [junit4]   2> 705490 INFO  (TEST-LeaderFailoverAfterPartitionTest.test-seed#[AE386E48E8DF754]) [    ] o.a.s.c.c.SolrZkClient makePath: /configs/conf1/solrconfig.snippet.randomindexconfig.xml
   [junit4]   2> 705491 INFO  (TEST-LeaderFailoverAfterPartitionTest.test-seed#[AE386E48E8DF754]) [    ] o.a.s.c.AbstractZkTestCase put /x1/jenkins/jenkins-slave/workspace/Lucene-Solr-Tests-6.x/solr/core/src/test-files/solr/collection1/conf/stopwords.txt to /configs/conf1/stopwords.txt
   [junit4]   2> 705491 INFO  (TEST-LeaderFailoverAfterPartitionTest.test-seed#[AE386E48E8DF754]) [    ] o.a.s.c.c.SolrZkClient makePath: /configs/conf1/stopwords.txt
   [junit4]   2> 705492 INFO  (TEST-LeaderFailoverAfterPartitionTest.test-seed#[AE386E48E8DF754]) [    ] o.a.s.c.AbstractZkTestCase put /x1/jenkins/jenkins-slave/workspace/Lucene-Solr-Tests-6.x/solr/core/src/test-files/solr/collection1/conf/protwords.txt to /configs/conf1/protwords.txt
   [junit4]   2> 705492 INFO  (TEST-LeaderFailoverAfterPartitionTest.test-seed#[AE386E48E8DF754]) [    ] o.a.s.c.c.SolrZkClient makePath: /configs/conf1/protwords.txt
   [junit4]   2> 705492 INFO  (TEST-LeaderFailoverAfterPartitionTest.test-seed#[AE386E48E8DF754]) [    ] o.a.s.c.AbstractZkTestCase put /x1/jenkins/jenkins-slave/workspace/Lucene-Solr-Tests-6.x/solr/core/src/test-files/solr/collection1/conf/currency.xml to /configs/conf1/currency.xml
   [junit4]   2> 705492 INFO  (TEST-LeaderFailoverAfterPartitionTest.test-seed#[AE386E48E8DF754]) [    ] o.a.s.c.c.SolrZkClient makePath: /configs/conf1/currency.xml
   [junit4]   2> 705493 INFO  (TEST-LeaderFailoverAfterPartitionTest.test-seed#[AE386E48E8DF754]) [    ] o.a.s.c.AbstractZkTestCase put /x1/jenkins/jenkins-slave/workspace/Lucene-Solr-Tests-6.x/solr/core/src/test-files/solr/collection1/conf/enumsConfig.xml to /configs/conf1/enumsConfig.xml
   [junit4]   2> 705493 INFO  (TEST-LeaderFailoverAfterPartitionTest.test-seed#[AE386E48E8DF754]) [    ] o.a.s.c.c.SolrZkClient makePath: /configs/conf1/enumsConfig.xml
   [junit4]   2> 705494 INFO  (TEST-LeaderFailoverAfterPartitionTest.test-seed#[AE386E48E8DF754]) [    ] o.a.s.c.AbstractZkTestCase put /x1/jenkins/jenkins-slave/workspace/Lucene-Solr-Tests-6.x/solr/core/src/test-files/solr/collection1/conf/open-exchange-rates.json to /configs/conf1/open-exchange-rates.json
   [junit4]   2> 705494 INFO  (TEST-LeaderFailoverAfterPartitionTest.test-seed#[AE386E48E8DF754]) [    ] o.a.s.c.c.SolrZkClient makePath: /configs/conf1/open-exchange-rates.json
   [junit4]   2> 705495 INFO  (TEST-LeaderFailoverAfterPartitionTest.test-seed#[AE386E48E8DF754]) [    ] o.a.s.c.AbstractZkTestCase put /x1/jenkins/jenkins-slave/workspace/Lucene-Solr-Tests-6.x/solr/core/src/test-files/solr/collection1/conf/mapping-ISOLatin1Accent.txt to /configs/conf1/mapping-ISOLatin1Accent.txt
   [junit4]   2> 705495 INFO  (TEST-LeaderFailoverAfterPartitionTest.test-seed#[AE386E48E8DF754]) [    ] o.a.s.c.c.SolrZkClient makePath: /configs/conf1/mapping-ISOLatin1Accent.txt
   [junit4]   2> 705496 INFO  (TEST-LeaderFailoverAfterPartitionTest.test-seed#[AE386E48E8DF754]) [    ] o.a.s.c.AbstractZkTestCase put /x1/jenkins/jenkins-slave/workspace/Lucene-Solr-Tests-6.x/solr/core/src/test-files/solr/collection1/conf/old_synonyms.txt to /configs/conf1/old_synonyms.txt
   [junit4]   2> 705496 INFO  (TEST-LeaderFailoverAfterPartitionTest.test-seed#[AE386E48E8DF754]) [    ] o.a.s.c.c.SolrZkClient makePath: /configs/conf1/old_synonyms.txt
   [junit4]   2> 705496 INFO  (TEST-LeaderFailoverAfterPartitionTest.test-seed#[AE386E48E8DF754]) [    ] o.a.s.c.AbstractZkTestCase put /x1/jenkins/jenkins-slave/workspace/Lucene-Solr-Tests-6.x/solr/core/src/test-files/solr/collection1/conf/synonyms.txt to /configs/conf1/synonyms.txt
   [junit4]   2> 705497 INFO  (TEST-LeaderFailoverAfterPartitionTest.test-seed#[AE386E48E8DF754]) [    ] o.a.s.c.c.SolrZkClient makePath: /configs/conf1/synonyms.txt
   [junit4]   2> 705558 INFO  (TEST-LeaderFailoverAfterPartitionTest.test-seed#[AE386E48E8DF754]) [    ] o.a.s.SolrTestCaseJ4 Writing core.properties file to /x1/jenkins/jenkins-slave/workspace/Lucene-Solr-Tests-6.x/solr/build/solr-core/test/J2/temp/solr.cloud.LeaderFailoverAfterPartitionTest_AE386E48E8DF754-001/control-001/cores/collection1
   [junit4]   2> 705560 INFO  (TEST-LeaderFailoverAfterPartitionTest.test-seed#[AE386E48E8DF754]) [    ] o.e.j.s.Server jetty-9.3.8.v20160314
   [junit4]   2> 705561 INFO  (TEST-LeaderFailoverAfterPartitionTest.test-seed#[AE386E48E8DF754]) [    ] o.e.j.s.h.ContextHandler Started o.e.j.s.ServletContextHandler@5fef58a6{/frn/p,null,AVAILABLE}
   [junit4]   2> 705561 INFO  (TEST-LeaderFailoverAfterPartitionTest.test-seed#[AE386E48E8DF754]) [    ] o.e.j.s.ServerConnector Started ServerConnector@4221497c{HTTP/1.1,[http/1.1]}{127.0.0.1:49237}
   [junit4]   2> 705561 INFO  (TEST-LeaderFailoverAfterPartitionTest.test-seed#[AE386E48E8DF754]) [    ] o.e.j.s.Server Started @707728ms
   [junit4]   2> 705561 INFO  (TEST-LeaderFailoverAfterPartitionTest.test-seed#[AE386E48E8DF754]) [    ] o.a.s.c.s.e.JettySolrRunner Jetty properties: {solr.data.dir=/x1/jenkins/jenkins-slave/workspace/Lucene-Solr-Tests-6.x/solr/build/solr-core/test/J2/temp/solr.cloud.LeaderFailoverAfterPartitionTest_AE386E48E8DF754-001/tempDir-001/control/data, hostContext=/frn/p, hostPort=56047, coreRootDirectory=/x1/jenkins/jenkins-slave/workspace/Lucene-Solr-Tests-6.x/solr/build/solr-core/test/J2/temp/solr.cloud.LeaderFailoverAfterPartitionTest_AE386E48E8DF754-001/control-001/cores}
   [junit4]   2> 705562 INFO  (TEST-LeaderFailoverAfterPartitionTest.test-seed#[AE386E48E8DF754]) [    ] o.a.s.s.SolrDispatchFilter SolrDispatchFilter.init(): sun.misc.Launcher$AppClassLoader@73d16e93
   [junit4]   2> 705562 INFO  (TEST-LeaderFailoverAfterPartitionTest.test-seed#[AE386E48E8DF754]) [    ] o.a.s.c.SolrResourceLoader new SolrResourceLoader for directory: '/x1/jenkins/jenkins-slave/workspace/Lucene-Solr-Tests-6.x/solr/build/solr-core/test/J2/temp/solr.cloud.LeaderFailoverAfterPartitionTest_AE386E48E8DF754-001/control-001'
   [junit4]   2> 705562 INFO  (TEST-LeaderFailoverAfterPartitionTest.test-seed#[AE386E48E8DF754]) [    ] o.a.s.c.SolrResourceLoader JNDI not configured for solr (NoInitialContextEx)
   [junit4]   2> 705562 INFO  (TEST-LeaderFailoverAfterPartitionTest.test-seed#[AE386E48E8DF754]) [    ] o.a.s.c.SolrResourceLoader solr home defaulted to 'solr/' (could not find system property or JNDI)
   [junit4]   2> 705562 INFO  (TEST-LeaderFailoverAfterPartitionTest.test-seed#[AE386E48E8DF754]) [    ] o.a.s.c.c.SolrZkClient Using default ZkCredentialsProvider
   [junit4]   2> 705562 INFO  (TEST-LeaderFailoverAfterPartitionTest.test-seed#[AE386E48E8DF754]) [    ] o.a.s.c.c.ConnectionManager Waiting for client to connect to ZooKeeper
   [junit4]   2> 705563 INFO  (zkCallback-1217-thread-1) [    ] o.a.s.c.c.ConnectionManager Watcher org.apache.solr.common.cloud.ConnectionManager@6a001d95 name:ZooKeeperConnection Watcher:127.0.0.1:37340/solr got event WatchedEvent state:SyncConnected type:None path:null path:null type:None
   [junit4]   2> 705563 INFO  (TEST-LeaderFailoverAfterPartitionTest.test-seed#[AE386E48E8DF754]) [    ] o.a.s.c.c.ConnectionManager Client is connected to ZooKeeper
   [junit4]   2> 705563 INFO  (TEST-LeaderFailoverAfterPartitionTest.test-seed#[AE386E48E8DF754]) [    ] o.a.s.c.c.SolrZkClient Using default ZkACLProvider
   [junit4]   2> 705564 INFO  (TEST-LeaderFailoverAfterPartitionTest.test-seed#[AE386E48E8DF754]) [    ] o.a.s.s.SolrDispatchFilter Loading solr.xml from SolrHome (not found in ZooKeeper)
   [junit4]   2> 705564 INFO  (TEST-LeaderFailoverAfterPartitionTest.test-seed#[AE386E48E8DF754]) [    ] o.a.s.c.SolrXmlConfig Loading container configuration from /x1/jenkins/jenkins-slave/workspace/Lucene-Solr-Tests-6.x/solr/build/solr-core/test/J2/temp/solr.cloud.LeaderFailoverAfterPartitionTest_AE386E48E8DF754-001/control-001/solr.xml
   [junit4]   2> 705567 INFO  (TEST-LeaderFailoverAfterPartitionTest.test-seed#[AE386E48E8DF754]) [    ] o.a.s.c.CorePropertiesLocator Config-defined core root directory: /x1/jenkins/jenkins-slave/workspace/Lucene-Solr-Tests-6.x/solr/build/solr-core/test/J2/temp/solr.cloud.LeaderFailoverAfterPartitionTest_AE386E48E8DF754-001/control-001/cores
   [junit4]   2> 705568 INFO  (TEST-LeaderFailoverAfterPartitionTest.test-seed#[AE386E48E8DF754]) [    ] o.a.s.c.CoreContainer New CoreContainer 1944222787
   [junit4]   2> 705568 INFO  (TEST-LeaderFailoverAfterPartitionTest.test-seed#[AE386E48E8DF754]) [    ] o.a.s.c.CoreContainer Loading cores into CoreContainer [instanceDir=/x1/jenkins/jenkins-slave/workspace/Lucene-Solr-Tests-6.x/solr/build/solr-core/test/J2/temp/solr.cloud.LeaderFailoverAfterPartitionTest_AE386E48E8DF754-001/control-001]
   [junit4]   2> 705568 WARN  (TEST-LeaderFailoverAfterPartitionTest.test-seed#[AE386E48E8DF754]) [    ] o.a.s.c.CoreContainer Couldn't add files from /x1/jenkins/jenkins-slave/workspace/Lucene-Solr-Tests-6.x/solr/build/solr-core/test/J2/temp/solr.cloud.LeaderFailoverAfterPartitionTest_AE386E48E8DF754-001/control-001/lib to classpath: /x1/jenkins/jenkins-slave/workspace/Lucene-Solr-Tests-6.x/solr/build/solr-core/test/J2/temp/solr.cloud.LeaderFailoverAfterPartitionTest_AE386E48E8DF754-001/control-001/lib
   [junit4]   2> 705568 INFO  (TEST-LeaderFailoverAfterPartitionTest.test-seed#[AE386E48E8DF754]) [    ] o.a.s.h.c.HttpShardHandlerFactory created with socketTimeout : 90000,urlScheme : ,connTimeout : 15000,maxConnectionsPerHost : 20,maxConnections : 10000,corePoolSize : 0,maximumPoolSize : 2147483647,maxThreadIdleTime : 5,sizeOfQueue : -1,fairnessPolicy : false,useRetries : false,connectionsEvictorSleepDelay : 5000,maxConnectionIdleTime : 40000,
   [junit4]   2> 705569 INFO  (TEST-LeaderFailoverAfterPartitionTest.test-seed#[AE386E48E8DF754]) [    ] o.a.s.u.UpdateShardHandler Creating UpdateShardHandler HTTP client with params: socketTimeout=340000&connTimeout=45000&retry=true
   [junit4]   2> 705569 INFO  (TEST-LeaderFailoverAfterPartitionTest.test-seed#[AE386E48E8DF754]) [    ] o.a.s.l.LogWatcher SLF4J impl is org.slf4j.impl.Log4jLoggerFactory
   [junit4]   2> 705569 INFO  (TEST-LeaderFailoverAfterPartitionTest.test-seed#[AE386E48E8DF754]) [    ] o.a.s.l.LogWatcher Registering Log Listener [Log4j (org.slf4j.impl.Log4jLoggerFactory)]
   [junit4]   2> 705569 INFO  (TEST-LeaderFailoverAfterPartitionTest.test-seed#[AE386E48E8DF754]) [    ] o.a.s.c.ZkContainer Zookeeper client=127.0.0.1:37340/solr
   [junit4]   2> 705569 INFO  (TEST-LeaderFailoverAfterPartitionTest.test-seed#[AE386E48E8DF754]) [    ] o.a.s.c.ZkController zkHost includes chroot
   [junit4]   2> 705569 INFO  (TEST-LeaderFailoverAfterPartitionTest.test-seed#[AE386E48E8DF754]) [    ] o.a.s.c.c.SolrZkClient Using default ZkCredentialsProvider
   [junit4]   2> 705569 INFO  (TEST-LeaderFailoverAfterPartitionTest.test-seed#[AE386E48E8DF754]) [    ] o.a.s.c.c.ConnectionManager Waiting for client to connect to ZooKeeper
   [junit4]   2> 705570 INFO  (zkCallback-1220-thread-1) [    ] o.a.s.c.c.ConnectionManager Watcher org.apache.solr.common.cloud.ConnectionManager@4c880a99 name:ZooKeeperConnection Watcher:127.0.0.1:37340 got event WatchedEvent state:SyncConnected type:None path:null path:null type:None
   [junit4]   2> 705571 INFO  (TEST-LeaderFailoverAfterPartitionTest.test-seed#[AE386E48E8DF754]) [    ] o.a.s.c.c.ConnectionManager Client is connected to ZooKeeper
   [junit4]   2> 705571 INFO  (TEST-LeaderFailoverAfterPartitionTest.test-seed#[AE386E48E8DF754]) [    ] o.a.s.c.c.SolrZkClient Using default ZkACLProvider
   [junit4]   2> 705571 INFO  (TEST-LeaderFailoverAfterPartitionTest.test-seed#[AE386E48E8DF754]) [n:127.0.0.1:56047_frn%2Fp    ] o.a.s.c.ZkController Added new OnReconnect listener org.apache.solr.cloud.ZkController$$Lambda$96/2127056345@6bd0790e
   [junit4]   2> 705572 INFO  (TEST-LeaderFailoverAfterPartitionTest.test-seed#[AE386E48E8DF754]) [n:127.0.0.1:56047_frn%2Fp    ] o.a.s.c.c.ConnectionManager Waiting for client to connect to ZooKeeper
   [junit4]   2> 705572 INFO  (zkCallback-1221-thread-1-processing-n:127.0.0.1:56047_frn%2Fp) [n:127.0.0.1:56047_frn%2Fp    ] o.a.s.c.c.ConnectionManager Watcher org.apache.solr.common.cloud.ConnectionManager@656f90a9 name:ZooKeeperConnection Watcher:127.0.0.1:37340/solr got event WatchedEvent state:SyncConnected type:None path:null path:null type:None
   [junit4]   2> 705572 INFO  (TEST-LeaderFailoverAfterPartitionTest.test-seed#[AE386E48E8DF754]) [n:127.0.0.1:56047_frn%2Fp    ] o.a.s.c.c.ConnectionManager Client is connected to ZooKeeper
   [junit4]   2> 705573 INFO  (TEST-LeaderFailoverAfterPartitionTest.test-seed#[AE386E48E8DF754]) [n:127.0.0.1:56047_frn%2Fp    ] o.a.s.c.c.SolrZkClient makePath: /overseer/queue
   [junit4]   2> 705573 INFO  (TEST-LeaderFailoverAfterPartitionTest.test-seed#[AE386E48E8DF754]) [n:127.0.0.1:56047_frn%2Fp    ] o.a.s.c.c.SolrZkClient makePath: /overseer/collection-queue-work
   [junit4]   2> 705575 INFO  (TEST-LeaderFailoverAfterPartitionTest.test-seed#[AE386E48E8DF754]) [n:127.0.0.1:56047_frn%2Fp    ] o.a.s.c.c.SolrZkClient makePath: /overseer/collection-map-running
   [junit4]   2> 705575 INFO  (TEST-LeaderFailoverAfterPartitionTest.test-seed#[AE386E48E8DF754]) [n:127.0.0.1:56047_frn%2Fp    ] o.a.s.c.c.SolrZkClient makePath: /overseer/collection-map-completed
   [junit4]   2> 705576 INFO  (TEST-LeaderFailoverAfterPartitionTest.test-seed#[AE386E48E8DF754]) [n:127.0.0.1:56047_frn%2Fp    ] o.a.s.c.c.SolrZkClient makePath: /overseer/collection-map-failure
   [junit4]   2> 705577 INFO  (TEST-LeaderFailoverAfterPartitionTest.test-seed#[AE386E48E8DF754]) [n:127.0.0.1:56047_frn%2Fp    ] o.a.s.c.c.SolrZkClient makePath: /live_nodes
   [junit4]   2> 705577 INFO  (TEST-LeaderFailoverAfterPartitionTest.test-seed#[AE386E48E8DF754]) [n:127.0.0.1:56047_frn%2Fp    ] o.a.s.c.c.SolrZkClient makePath: /aliases.json
   [junit4]   2> 705578 INFO  (TEST-LeaderFailoverAfterPartitionTest.test-seed#[AE386E48E8DF754]) [n:127.0.0.1:56047_frn%2Fp    ] o.a.s.c.c.SolrZkClient makePath: /clusterstate.json
   [junit4]   2> 705578 INFO  (TEST-LeaderFailoverAfterPartitionTest.test-seed#[AE386E48E8DF754]) [n:127.0.0.1:56047_frn%2Fp    ] o.a.s.c.c.SolrZkClient makePath: /security.json
   [junit4]   2> 705579 INFO  (TEST-LeaderFailoverAfterPartitionTest.test-seed#[AE386E48E8DF754]) [n:127.0.0.1:56047_frn%2Fp    ] o.a.s.c.c.ZkStateReader Updating cluster state from ZooKeeper... 
   [junit4]   2> 705579 INFO  (TEST-LeaderFailoverAfterPartitionTest.test-seed#[AE386E48E8DF754]) [n:127.0.0.1:56047_frn%2Fp    ] o.a.s.c.c.ZkStateReader Loaded empty cluster properties
   [junit4]   2> 705579 INFO  (TEST-LeaderFailoverAfterPartitionTest.test-seed#[AE386E48E8DF754]) [n:127.0.0.1:56047_frn%2Fp    ] o.a.s.c.c.ZkStateReader Updated live nodes from ZooKeeper... (0) -> (0)
   [junit4]   2> 705580 INFO  (TEST-LeaderFailoverAfterPartitionTest.test-seed#[AE386E48E8DF754]) [n:127.0.0.1:56047_frn%2Fp    ] o.a.s.c.c.SolrZkClient makePath: /overseer_elect
   [junit4]   2> 705581 INFO  (TEST-LeaderFailoverAfterPartitionTest.test-seed#[AE386E48E8DF754]) [n:127.0.0.1:56047_frn%2Fp    ] o.a.s.c.c.SolrZkClient makePath: /overseer_elect/election
   [junit4]   2> 705581 INFO  (TEST-LeaderFailoverAfterPartitionTest.test-seed#[AE386E48E8DF754]) [n:127.0.0.1:56047_frn%2Fp    ] o.a.s.c.Overseer Overseer (id=null) closing
   [junit4]   2> 705582 INFO  (TEST-LeaderFailoverAfterPartitionTest.test-seed#[AE386E48E8DF754]) [n:127.0.0.1:56047_frn%2Fp    ] o.a.s.c.LeaderElector Joined leadership election with path: /overseer_elect/election/96343080728068100-127.0.0.1:56047_frn%2Fp-n_0000000000
   [junit4]   2> 705582 INFO  (TEST-LeaderFailoverAfterPartitionTest.test-seed#[AE386E48E8DF754]) [n:127.0.0.1:56047_frn%2Fp    ] o.a.s.c.OverseerElectionContext I am going to be the leader 127.0.0.1:56047_frn%2Fp
   [junit4]   2> 705582 INFO  (TEST-LeaderFailoverAfterPartitionTest.test-seed#[AE386E48E8DF754]) [n:127.0.0.1:56047_frn%2Fp    ] o.a.s.c.c.SolrZkClient makePath: /overseer_elect/leader
   [junit4]   2> 705582 INFO  (TEST-LeaderFailoverAfterPartitionTest.test-seed#[AE386E48E8DF754]) [n:127.0.0.1:56047_frn%2Fp    ] o.a.s.c.Overseer Overseer (id=96343080728068100-127.0.0.1:56047_frn%2Fp-n_0000000000) starting
   [junit4]   2> 705583 INFO  (TEST-LeaderFailoverAfterPartitionTest.test-seed#[AE386E48E8DF754]) [n:127.0.0.1:56047_frn%2Fp    ] o.a.s.c.c.SolrZkClient makePath: /overseer/queue-work
   [junit4]   2> 705586 INFO  (TEST-LeaderFailoverAfterPartitionTest.test-seed#[AE386E48E8DF754]) [n:127.0.0.1:56047_frn%2Fp    ] o.a.s.c.OverseerAutoReplicaFailoverThread Starting OverseerAutoReplicaFailoverThread autoReplicaFailoverWorkLoopDelay=10000 autoReplicaFailoverWaitAfterExpiration=10000 autoReplicaFailoverBadNodeExpiration=60000
   [junit4]   2> 705586 INFO  (OverseerCollectionConfigSetProcessor-96343080728068100-127.0.0.1:56047_frn%2Fp-n_0000000000) [n:127.0.0.1:56047_frn%2Fp    ] o.a.s.c.OverseerTaskProcessor Process current queue of overseer operations
   [junit4]   2> 705586 INFO  (TEST-LeaderFailoverAfterPartitionTest.test-seed#[AE386E48E8DF754]) [n:127.0.0.1:56047_frn%2Fp    ] o.a.s.c.ZkController Register node as live in ZooKeeper:/live_nodes/127.0.0.1:56047_frn%2Fp
   [junit4]   2> 705586 INFO  (TEST-LeaderFailoverAfterPartitionTest.test-seed#[AE386E48E8DF754]) [n:127.0.0.1:56047_frn%2Fp    ] o.a.s.c.c.SolrZkClient makePath: /live_nodes/127.0.0.1:56047_frn%2Fp
   [junit4]   2> 705586 INFO  (OverseerStateUpdate-96343080728068100-127.0.0.1:56047_frn%2Fp-n_0000000000) [n:127.0.0.1:56047_frn%2Fp    ] o.a.s.c.Overseer Starting to work on the main queue
   [junit4]   2> 705587 INFO  (zkCallback-1221-thread-1-processing-n:127.0.0.1:56047_frn%2Fp) [n:127.0.0.1:56047_frn%2Fp    ] o.a.s.c.c.ZkStateReader A live node change: [WatchedEvent state:SyncConnected type:NodeChildrenChanged path:/live_nodes], has occurred - updating... (live nodes size: [0])
   [junit4]   2> 705588 INFO  (OverseerStateUpdate-96343080728068100-127.0.0.1:56047_frn%2Fp-n_0000000000) [n:127.0.0.1:56047_frn%2Fp    ] o.a.s.c.c.ZkStateReader Updated live nodes from ZooKeeper... (0) -> (1)
   [junit4]   2> 705594 INFO  (TEST-LeaderFailoverAfterPartitionTest.test-seed#[AE386E48E8DF754]) [n:127.0.0.1:56047_frn%2Fp    ] o.a.s.c.CoreContainer Security conf doesn't exist. Skipping setup for authorization module.
   [junit4]   2> 705594 INFO  (TEST-LeaderFailoverAfterPartitionTest.test-seed#[AE386E48E8DF754]) [n:127.0.0.1:56047_frn%2Fp    ] o.a.s.c.CoreContainer No authentication plugin used.
   [junit4]   2> 705594 INFO  (TEST-LeaderFailoverAfterPartitionTest.test-seed#[AE386E48E8DF754]) [n:127.0.0.1:56047_frn%2Fp    ] o.a.s.c.CorePropertiesLocator Looking for core definitions underneath /x1/jenkins/jenkins-slave/workspace/Lucene-Solr-Tests-6.x/solr/build/solr-core/test/J2/temp/solr.cloud.LeaderFailoverAfterPartitionTest_AE386E48E8DF754-001/control-001/cores
   [junit4]   2> 705595 INFO  (TEST-LeaderFailoverAfterPartitionTest.test-seed#[AE386E48E8DF754]) [n:127.0.0.1:56047_frn%2Fp    ] o.a.s.c.CoreDescriptor Created CoreDescriptor: {name=collection1, config=solrconfig.xml, transient=false, schema=schema.xml, loadOnStartup=true, configSetProperties=configsetprops.json, collection=control_collection, coreNodeName=, dataDir=data/, shard=}
   [junit4]   2> 705595 INFO  (TEST-LeaderFailoverAfterPartitionTest.test-seed#[AE386E48E8DF754]) [n:127.0.0.1:56047_frn%2Fp    ] o.a.s.c.CorePropertiesLocator Found core collection1 in /x1/jenkins/jenkins-slave/workspace/Lucene-Solr-Tests-6.x/solr/build/solr-core/test/J2/temp/solr.cloud.LeaderFailoverAfterPartitionTest_AE386E48E8DF754-001/control-001/cores/collection1
   [junit4]   2> 705595 INFO  (TEST-LeaderFailoverAfterPartitionTest.test-seed#[AE386E48E8DF754]) [n:127.0.0.1:56047_frn%2Fp    ] o.a.s.c.CorePropertiesLocator Found 1 core definitions
   [junit4]   2> 705595 INFO  (coreLoadExecutor-3122-thread-1-processing-n:127.0.0.1:56047_frn%2Fp) [n:127.0.0.1:56047_frn%2Fp c:control_collection   x:collection1] o.a.s.c.ZkController publishing state=down
   [junit4]   2> 705595 INFO  (coreLoadExecutor-3122-thread-1-processing-n:127.0.0.1:56047_frn%2Fp) [n:127.0.0.1:56047_frn%2Fp c:control_collection   x:collection1] o.a.s.c.ZkController numShards not found on descriptor - reading it from system property
   [junit4]   2> 705595 INFO  (TEST-LeaderFailoverAfterPartitionTest.test-seed#[AE386E48E8DF754]) [n:127.0.0.1:56047_frn%2Fp    ] o.a.s.s.SolrDispatchFilter user.dir=/x1/jenkins/jenkins-slave/workspace/Lucene-Solr-Tests-6.x/solr/build/solr-core/test/J2
   [junit4]   2> 705595 INFO  (TEST-LeaderFailoverAfterPartitionTest.test-seed#[AE386E48E8DF754]) [n:127.0.0.1:56047_frn%2Fp    ] o.a.s.s.SolrDispatchFilter SolrDispatchFilter.init() done
   [junit4]   2> 705596 INFO  (coreLoadExecutor-3122-thread-1-processing-n:127.0.0.1:56047_frn%2Fp) [n:127.0.0.1:56047_frn%2Fp c:control_collection   x:collection1] o.a.s.c.ZkController Collection control_collection not visible yet, but flagging it so a watch is registered when it becomes visible
   [junit4]   2> 705596 INFO  (OverseerStateUpdate-96343080728068100-127.0.0.1:56047_frn%2Fp-n_0000000000) [n:127.0.0.1:56047_frn%2Fp    ] o.a.s.c.Overseer processMessage: queueSize: 1, message = {
   [junit4]   2>   "core":"collection1",
   [junit4]   2>   "roles":null,
   [junit4]   2>   "base_url":"http://127.0.0.1:56047/frn/p",
   [junit4]   2>   "node_name":"127.0.0.1:56047_frn%2Fp",
   [junit4]   2>   "numShards":"1",
   [junit4]   2>   "state":"down",
   [junit4]   2>   "shard":null,
   [junit4]   2>   "collection":"control_collection",
   [junit4]   2>   "operation":"state"} current state version: 0
   [junit4]   2> 705596 INFO  (OverseerStateUpdate-96343080728068100-127.0.0.1:56047_frn%2Fp-n_0000000000) [n:127.0.0.1:56047_frn%2Fp    ] o.a.s.c.o.ReplicaMutator Update state numShards=1 message={
   [junit4]   2>   "core":"collection1",
   [junit4]   2>   "roles":null,
   [junit4]   2>   "base_url":"http://127.0.0.1:56047/frn/p",
   [junit4]   2>   "node_name":"127.0.0.1:56047_frn%2Fp",
   [junit4]   2>   "numShards":"1",
   [junit4]   2>   "state":"down",
   [junit4]   2>   "shard":null,
   [junit4]   2>   "collection":"control_collection",
   [junit4]   2>   "operation":"state"}
   [junit4]   2> 705596 INFO  (coreLoadExecutor-3122-thread-1-processing-n:127.0.0.1:56047_frn%2Fp) [n:127.0.0.1:56047_frn%2Fp c:control_collection   x:collection1] o.a.s.c.c.ZkStateReader Deleting data for [control_collection]
   [junit4]   2> 705596 INFO  (OverseerStateUpdate-96343080728068100-127.0.0.1:56047_frn%2Fp-n_0000000000) [n:127.0.0.1:56047_frn%2Fp    ] o.a.s.c.o.ClusterStateMutator building a new cName: control_collection
   [junit4]   2> 705597 INFO  (OverseerStateUpdate-96343080728068100-127.0.0.1:56047_frn%2Fp-n_0000000000) [n:127.0.0.1:56047_frn%2Fp    ] o.a.s.c.o.ReplicaMutator Assigning new node to shard shard=shard1
   [junit4]   2> 705597 INFO  (coreLoadExecutor-3122-thread-1-processing-n:127.0.0.1:56047_frn%2Fp) [n:127.0.0.1:56047_frn%2Fp c:control_collection   x:collection1] o.a.s.c.ZkController look for our core node name
   [junit4]   2> 705597 INFO  (zkCallback-1221-thread-1-processing-n:127.0.0.1:56047_frn%2Fp) [n:127.0.0.1:56047_frn%2Fp    ] o.a.s.c.c.ZkStateReader A cluster state change: [WatchedEvent state:SyncConnected type:NodeDataChanged path:/clusterstate.json], has occurred - updating... (live nodes size: [1])
   [junit4]   2> 706597 INFO  (coreLoadExecutor-3122-thread-1-processing-n:127.0.0.1:56047_frn%2Fp) [n:127.0.0.1:56047_frn%2Fp c:control_collection   x:collection1] o.a.s.c.ZkController waiting to find shard id in clusterstate for collection1
   [junit4]   2> 706597 INFO  (coreLoadExecutor-3122-thread-1-processing-n:127.0.0.1:56047_frn%2Fp) [n:127.0.0.1:56047_frn%2Fp c:control_collection   x:collection1] o.a.s.c.ZkController Check for collection zkNode:control_collection
   [junit4]   2> 706598 INFO  (coreLoadExecutor-3122-thread-1-processing-n:127.0.0.1:56047_frn%2Fp) [n:127.0.0.1:56047_frn%2Fp c:control_collection   x:collection1] o.a.s.c.ZkController Collection zkNode exists
   [junit4]   2> 706598 INFO  (coreLoadExecutor-3122-thread-1-processing-n:127.0.0.1:56047_frn%2Fp) [n:127.0.0.1:56047_frn%2Fp c:control_collection   x:collection1] o.a.s.c.c.ZkStateReader Load collection config from: [/collections/control_collection]
   [junit4]   2> 706598 INFO  (coreLoadExecutor-3122-thread-1-processing-n:127.0.0.1:56047_frn%2Fp) [n:127.0.0.1:56047_frn%2Fp c:control_collection   x:collection1] o.a.s.c.c.ZkStateReader path=[/collections/control_collection] [configName]=[conf1] specified config exists in ZooKeeper
   [junit4]   2> 706598 INFO  (coreLoadExecutor-3122-thread-1-processing-n:127.0.0.1:56047_frn%2Fp) [n:127.0.0.1:56047_frn%2Fp c:control_collection   x:collection1] o.a.s.c.SolrResourceLoader new SolrResourceLoader for directory: '/x1/jenkins/jenkins-slave/workspace/Lucene-Solr-Tests-6.x/solr/build/solr-core/test/J2/temp/solr.cloud.LeaderFailoverAfterPartitionTest_AE386E48E8DF754-001/control-001/cores/collection1'
   [junit4]   2> 706598 INFO  (coreLoadExecutor-3122-thread-1-processing-n:127.0.0.1:56047_frn%2Fp) [n:127.0.0.1:56047_frn%2Fp c:control_collection   x:collection1] o.a.s.c.SolrResourceLoader JNDI not configured for solr (NoInitialContextEx)
   [junit4]   2> 706598 INFO  (coreLoadExecutor-3122-thread-1-processing-n:127.0.0.1:56047_frn%2Fp) [n:127.0.0.1:56047_frn%2Fp c:control_collection   x:collection1] o.a.s.c.SolrResourceLoader solr home defaulted to 'solr/' (could not find system property or JNDI)
   [junit4]   2> 706600 INFO  (coreLoadExecutor-3122-thread-1-processing-n:127.0.0.1:56047_frn%2Fp) [n:127.0.0.1:56047_frn%2Fp c:control_collection   x:collection1] o.a.s.c.Config loaded config solrconfig.xml with version 0 
   [junit4]   2> 706605 INFO  (coreLoadExecutor-3122-thread-1-processing-n:127.0.0.1:56047_frn%2Fp) [n:127.0.0.1:56047_frn%2Fp c:control_collection   x:collection1] o.a.s.c.SolrConfig current version of requestparams : -1
   [junit4]   2> 706609 INFO  (coreLoadExecutor-3122-thread-1-processing-n:127.0.0.1:56047_frn%2Fp) [n:127.0.0.1:56047_frn%2Fp c:control_collection   x:collection1] o.a.s.c.SolrConfig Using Lucene MatchVersion: 6.2.0
   [junit4]   2> 706615 INFO  (coreLoadExecutor-3122-thread-1-processing-n:127.0.0.1:56047_frn%2Fp) [n:127.0.0.1:56047_frn%2Fp c:control_collection   x:collection1] o.a.s.c.SolrConfig Loaded SolrConfig: solrconfig.xml
   [junit4]   2> 706619 INFO  (coreLoadExecutor-3122-thread-1-processing-n:127.0.0.1:56047_frn%2Fp) [n:127.0.0.1:56047_frn%2Fp c:control_collection   x:collection1] o.a.s.s.IndexSchema [collection1] Schema name=test
   [junit4]   2> 706683 INFO  (coreLoadExecutor-3122-thread-1-processing-n:127.0.0.1:56047_frn%2Fp) [n:127.0.0.1:56047_frn%2Fp c:control_collection   x:collection1] o.a.s.s.OpenExchangeRatesOrgProvider Initialized with rates=open-exchange-rates.json, refreshInterval=1440.
   [junit4]   2> 706687 INFO  (coreLoadExecutor-3122-thread-1-processing-n:127.0.0.1:56047_frn%2Fp) [n:127.0.0.1:56047_frn%2Fp c:control_collection   x:collection1] o.a.s.s.IndexSchema default search field in schema is text
   [junit4]   2> 706688 INFO  (coreLoadExecutor-3122-thread-1-processing-n:127.0.0.1:56047_frn%2Fp) [n:127.0.0.1:56047_frn%2Fp c:control_collection   x:collection1] o.a.s.s.IndexSchema unique key field: id
   [junit4]   2> 706694 INFO  (coreLoadExecutor-3122-thread-1-processing-n:127.0.0.1:56047_frn%2Fp) [n:127.0.0.1:56047_frn%2Fp c:control_collection   x:collection1] o.a.s.s.FileExchangeRateProvider Reloading exchange rates from file currency.xml
   [junit4]   2> 706696 INFO  (coreLoadExecutor-3122-thread-1-processing-n:127.0.0.1:56047_frn%2Fp) [n:127.0.0.1:56047_frn%2Fp c:control_collection   x:collection1] o.a.s.s.FileExchangeRateProvider Reloading exchange rates from file currency.xml
   [junit4]   2> 706697 INFO  (coreLoadExecutor-3122-thread-1-processing-n:127.0.0.1:56047_frn%2Fp) [n:127.0.0.1:56047_frn%2Fp c:control_collection   x:collection1] o.a.s.s.OpenExchangeRatesOrgProvider Reloading exchange rates from open-exchange-rates.json
   [junit4]   2> 706697 INFO  (coreLoadExecutor-3122-thread-1-processing-n:127.0.0.1:56047_frn%2Fp) [n:127.0.0.1:56047_frn%2Fp c:control_collection   x:collection1] o.a.s.s.OpenExchangeRatesOrgProvider Reloading exchange rates from open-exchange-rates.json
   [junit4]   2> 706698 INFO  (coreLoadExecutor-3122-thread-1-processing-n:127.0.0.1:56047_frn%2Fp) [n:127.0.0.1:56047_frn%2Fp c:control_collection   x:collection1] o.a.s.c.ConfigSetProperties Did not find ConfigSet properties, assuming default properties: Can't find resource 'configsetprops.json' in classpath or '/configs/conf1', cwd=/x1/jenkins/jenkins-slave/workspace/Lucene-Solr-Tests-6.x/solr/build/solr-core/test/J2
   [junit4]   2> 706698 INFO  (coreLoadExecutor-3122-thread-1-processing-n:127.0.0.1:56047_frn%2Fp) [n:127.0.0.1:56047_frn%2Fp c:control_collection   x:collection1] o.a.s.c.CoreContainer Creating SolrCore 'collection1' using configuration from collection control_collection
   [junit4]   2> 706699 INFO  (coreLoadExecutor-3122-thread-1-processing-n:127.0.0.1:56047_frn%2Fp) [n:127.0.0.1:56047_frn%2Fp c:control_collection s:shard1 r:core_node1 x:collection1] o.a.s.c.SolrCore org.apache.solr.core.MockDirectoryFactory
   [junit4]   2> 706699 INFO  (coreLoadExecutor-3122-thread-1-processing-n:127.0.0.1:56047_frn%2Fp) [n:127.0.0.1:56047_frn%2Fp c:control_collection s:shard1 r:core_node1 x:collection1] o.a.s.c.SolrCore [[collection1] ] Opening new SolrCore at [/x1/jenkins/jenkins-slave/workspace/Lucene-Solr-Tests-6.x/solr/build/solr-core/test/J2/temp/solr.cloud.LeaderFailoverAfterPartitionTest_AE386E48E8DF754-001/control-001/cores/collection1], dataDir=[/x1/jenkins/jenkins-slave/workspace/Lucene-Solr-Tests-6.x/solr/build/solr-core/test/J2/temp/solr.cloud.LeaderFailoverAfterPartitionTest_AE386E48E8DF754-001/control-001/cores/collection1/data/]
   [junit4]   2> 706699 INFO  (coreLoadExecutor-3122-thread-1-processing-n:127.0.0.1:56047_frn%2Fp) [n:127.0.0.1:56047_frn%2Fp c:control_collection s:shard1 r:core_node1 x:collection1] o.a.s.c.JmxMonitoredMap JMX monitoring is enabled. Adding Solr mbeans to JMX Server: com.sun.jmx.mbeanserver.JmxMBeanServer@70a1d0e1
   [junit4]   2> 706699 INFO  (coreLoadExecutor-3122-thread-1-processing-n:127.0.0.1:56047_frn%2Fp) [n:127.0.0.1:56047_frn%2Fp c:control_collection s:shard1 r:core_node1 x:collection1] o.a.s.c.CachingDirectoryFactory return new directory for /x1/jenkins/jenkins-slave/workspace/Lucene-Solr-Tests-6.x/solr/build/solr-core/test/J2/temp/solr.cloud.LeaderFailoverAfterPartitionTest_AE386E48E8DF754-001/control-001/cores/collection1/data/snapshot_metadata
   [junit4]   2> 706699 INFO  (coreLoadExecutor-3122-thread-1-processing-n:127.0.0.1:56047_frn%2Fp) [n:127.0.0.1:56047_frn%2Fp c:control_collection s:shard1 r:core_node1 x:collection1] o.a.s.c.s.SolrSnapshotMetaDataManager Loading from snapshot metadata file...
   [junit4]   2> 706699 INFO  (coreLoadExecutor-3122-thread-1-processing-n:127.0.0.1:56047_frn%2Fp) [n:127.0.0.1:56047_frn%2Fp c:control_collection s:shard1 r:core_node1 x:collection1] o.a.s.c.CachingDirectoryFactory return new directory for /x1/jenkins/jenkins-slave/workspace/Lucene-Solr-Tests-6.x/solr/build/solr-core/test/J2/temp/solr.cloud.LeaderFailoverAfterPartitionTest_AE386E48E8DF754-001/control-001/cores/collection1/data
   [junit4]   2> 706699 INFO  (coreLoadExecutor-3122-thread-1-processing-n:127.0.0.1:56047_frn%2Fp) [n:127.0.0.1:56047_frn%2Fp c:control_collection s:shard1 r:core_node1 x:collection1] o.a.s.c.SolrCore New index directory detected: old=null new=/x1/jenkins/jenkins-slave/workspace/Lucene-Solr-Tests-6.x/solr/build/solr-core/test/J2/temp/solr.cloud.LeaderFailoverAfterPartitionTest_AE386E48E8DF754-001/control-001/cores/collection1/data/index/
   [junit4]   2> 706699 WARN  (coreLoadExecutor-3122-thread-1-processing-n:127.0.0.1:56047_frn%2Fp) [n:127.0.0.1:56047_frn%2Fp c:control_collection s:shard1 r:core_node1 x:collection1] o.a.s.c.SolrCore [collection1] Solr index directory '/x1/jenkins/jenkins-slave/workspace/Lucene-Solr-Tests-6.x/solr/build/solr-core/test/J2/temp/solr.cloud.LeaderFailoverAfterPartitionTest_AE386E48E8DF754-001/control-001/cores/collection1/data/index' doesn't exist. Creating new index...
   [junit4]   2> 706700 INFO  (coreLoadExecutor-3122-thread-1-processing-n:127.0.0.1:56047_frn%2Fp) [n:127.0.0.1:56047_frn%2Fp c:control_collection s:shard1 r:core_node1 x:collection1] o.a.s.c.CachingDirectoryFactory return new directory for /x1/jenkins/jenkins-slave/workspace/Lucene-Solr-Tests-6.x/solr/build/solr-core/test/J2/temp/solr.cloud.LeaderFailoverAfterPartitionTest_AE386E48E8DF754-001/control-001/cores/collection1/data/index
   [junit4]   2> 706700 INFO  (coreLoadExecutor-3122-thread-1-processing-n:127.0.0.1:56047_frn%2Fp) [n:127.0.0.1:56047_frn%2Fp c:control_collection s:shard1 r:core_node1 x:collection1] o.a.s.u.RandomMergePolicy RandomMergePolicy wrapping class org.apache.lucene.index.LogDocMergePolicy: [LogDocMergePolicy: minMergeSize=1000, mergeFactor=24, maxMergeSize=9223372036854775807, maxMergeSizeForForcedMerge=9223372036854775807, calibrateSizeByDeletes=false, maxMergeDocs=2147483647, maxCFSSegmentSizeMB=8.796093022207999E12, noCFSRatio=0.13816978462298152]
   [junit4]   2> 706700 INFO  (coreLoadExecutor-3122-thread-1-processing-n:127.0.0.1:56047_frn%2Fp) [n:127.0.0.1:56047_frn%2Fp c:control_collection s:shard1 r:core_node1 x:collection1] o.a.s.c.SolrDeletionPolicy SolrDeletionPolicy.onCommit: commits: num=1
   [junit4]   2> 	commit{dir=MockDirectoryWrapper(RAMDirectory@2767901f lockFactory=org.apache.lucene.store.SingleInstanceLockFactory@4bc37de0),segFN=segments_1,generation=1}
   [junit4]   2> 706700 INFO  (coreLoadExecutor-3122-thread-1-processing-n:127.0.0.1:56047_frn%2Fp) [n:127.0.0.1:56047_frn%2Fp c:control_collection s:shard1 r:core_node1 x:collection1] o.a.s.c.SolrDeletionPolicy newest commit generation = 1
   [junit4]   2> 706705 INFO  (coreLoadExecutor-3122-thread-1-processing-n:127.0.0.1:56047_frn%2Fp) [n:127.0.0.1:56047_frn%2Fp c:control_collection s:shard1 r:core_node1 x:collection1] o.a.s.u.p.UpdateRequestProcessorChain creating updateRequestProcessorChain "nodistrib"
   [junit4]   2> 706705 INFO  (coreLoadExecutor-3122-thread-1-processing-n:127.0.0.1:56047_frn%2Fp) [n:127.0.0.1:56047_frn%2Fp c:control_collection s:shard1 r:core_node1 x:collection1] o.a.s.u.p.UpdateRequestProcessorChain creating updateRequestProcessorChain "dedupe"
   [junit4]   2> 706705 INFO  (coreLoadExecutor-3122-thread-1-processing-n:127.0.0.1:56047_frn%2Fp) [n:127.0.0.1:56047_frn%2Fp c:control_collection s:shard1 r:core_node1 x:collection1] o.a.s.u.p.UpdateRequestProcessorChain inserting DistributedUpdateProcessorFactory into updateRequestProcessorChain "dedupe"
   [junit4]   2> 706706 INFO  (coreLoadExecutor-3122-thread-1-processing-n:127.0.0.1:56047_frn%2Fp) [n:127.0.0.1:56047_frn%2Fp c:control_collection s:shard1 r:core_node1 x:collection1] o.a.s.u.p.UpdateRequestProcessorChain creating updateRequestProcessorChain "stored_sig"
   [junit4]   2> 706706 INFO  (coreLoadExecutor-3122-thread-1-processing-n:127.0.0.1:56047_frn%2Fp) [n:127.0.0.1:56047_frn%2Fp c:control_collection s:shard1 r:core_node1 x:collection1] o.a.s.u.p.UpdateRequestProcessorChain inserting DistributedUpdateProcessorFactory into updateRequestProcessorChain "stored_sig"
   [junit4]   2> 706706 INFO  (coreLoadExecutor-3122-thread-1-processing-n:127.0.0.1:56047_frn%2Fp) [n:127.0.0.1:56047_frn%2Fp c:control_collection s:shard1 r:core_node1 x:collection1] o.a.s.u.p.UpdateRequestProcessorChain creating updateRequestProcessorChain "distrib-dup-test-chain-explicit"
   [junit4]   2> 706706 INFO  (coreLoadExecutor-3122-thread-1-processing-n:127.0.0.1:56047_frn%2Fp) [n:127.0.0.1:56047_frn%2Fp c:control_collection s:shard1 r:core_node1 x:collection1] o.a.s.u.p.UpdateRequestProcessorChain creating updateRequestProcessorChain "distrib-dup-test-chain-implicit"
   [junit4]   2> 706706 INFO  (coreLoadExecutor-3122-thread-1-processing-n:127.0.0.1:56047_frn%2Fp) [n:127.0.0.1:56047_frn%2Fp c:control_collection s:shard1 r:core_node1 x:collection1] o.a.s.u.p.UpdateRequestProcessorChain inserting DistributedUpdateProcessorFactory into updateRequestProcessorChain "distrib-dup-test-chain-implicit"
   [junit4]   2> 706706 INFO  (coreLoadExecutor-3122-thread-1-processing-n:127.0.0.1:56047_frn%2Fp) [n:127.0.0.1:56047_frn%2Fp c:control_collection s:shard1 r:core_node1 x:collection1] o.a.s.c.SolrCore no updateRequestProcessorChain defined as default, creating implicit default
   [junit4]   2> 706706 WARN  (coreLoadExecutor-3122-thread-1-processing-n:127.0.0.1:56047_frn%2Fp) [n:127.0.0.1:56047_frn%2Fp c:control_collection s:shard1 r:core_node1 x:collection1] o.a.s.c.RequestHandlers INVALID paramSet a in requestHandler {type = requestHandler,name = /dump,class = DumpRequestHandler,args = {defaults={a=A,b=B}}}
   [junit4]   2> 706707 INFO  (coreLoadExecutor-3122-thread-1-processing-n:127.0.0.1:56047_frn%2Fp) [n:127.0.0.1:56047_frn%2Fp c:control_collection s:shard1 r:core_node1 x:collection1] o.a.s.h.l.XMLLoader xsltCacheLifetimeSeconds=60
   [junit4]   2> 706708 INFO  (coreLoadExecutor-3122-thread-1-processing-n:127.0.0.1:56047_frn%2Fp) [n:127.0.0.1:56047_frn%2Fp c:control_collection s:shard1 r:core_node1 x:collection1] o.a.s.h.l.XMLLoader xsltCacheLifetimeSeconds=60
   [junit4]   2> 706708 INFO  (coreLoadExecutor-3122-thread-1-processing-n:127.0.0.1:56047_frn%2Fp) [n:127.0.0.1:56047_frn%2Fp c:control_collection s:shard1 r:core_node1 x:collection1] o.a.s.h.l.XMLLoader xsltCacheLifetimeSeconds=60
   [junit4]   2> 706709 INFO  (coreLoadExecutor-3122-thread-1-processing-n:127.0.0.1:56047_frn%2Fp) [n:127.0.0.1:56047_frn%2Fp c:control_collection s:shard1 r:core_node1 x:collection1] o.a.s.h.l.XMLLoader xsltCacheLifetimeSeconds=60
   [junit4]   2> 706711 INFO  (coreLoadExecutor-3122-thread-1-processing-n:127.0.0.1:56047_frn%2Fp) [n:127.0.0.1:56047_frn%2Fp c:control_collection s:shard1 r:core_node1 x:collection1] o.a.s.c.RequestHandlers Registered paths: /admin/mbeans,standard,/update/json/docs,/admin/luke,/export,/get,/admin/properties,/update/json,/admin/threads,/dump,/update/csv,/sql,/graph,/admin/segments,/admin/system,/replication,/config,/stream,/schema,/admin/plugins,/admin/logging,/admin/ping,/update,/admin/file,/terms
   [junit4]   2> 706711 INFO  (coreLoadExecutor-3122-thread-1-processing-n:127.0.0.1:56047_frn%2Fp) [n:127.0.0.1:56047_frn%2Fp c:control_collection s:shard1 r:core_node1 x:collection1] o.a.s.c.SolrCore Using default statsCache cache: org.apache.solr.search.stats.LocalStatsCache
   [junit4]   2> 706712 INFO  (OldIndexDirectoryCleanupThreadForCore-collection1) [n:127.0.0.1:56047_frn%2Fp c:control_collection s:shard1 r:core_node1 x:collection1] o.a.s.c.SolrCore Looking for old index directories to cleanup for core collection1 in /x1/jenkins/jenkins-slave/workspace/Lucene-Solr-Tests-6.x/solr/build/solr-core/test/J2/temp/solr.cloud.LeaderFailoverAfterPartitionTest_AE386E48E8DF754-001/control-001/cores/collection1/data/
   [junit4]   2> 706712 WARN  (OldIndexDirectoryCleanupThreadForCore-collection1) [n:127.0.0.1:56047_frn%2Fp c:control_collection s:shard1 r:core_node1 x:collection1] o.a.s.c.DirectoryFactory /x1/jenkins/jenkins-slave/workspace/Lucene-Solr-Tests-6.x/solr/build/solr-core/test/J2/temp/solr.cloud.LeaderFailoverAfterPartitionTest_AE386E48E8DF754-001/control-001/cores/collection1/data/ does not point to a valid data directory; skipping clean-up of old index directories.
   [junit4]   2> 706712 INFO  (coreLoadExecutor-3122-thread-1-processing-n:127.0.0.1:56047_frn%2Fp) [n:127.0.0.1:56047_frn%2Fp c:control_collection s:shard1 r:core_node1 x:collection1] o.a.s.u.UpdateHandler Using UpdateLog implementation: org.apache.solr.update.UpdateLog
   [junit4]   2> 706712 INFO  (coreLoadExecutor-3122-thread-1-processing-n:127.0.0.1:56047_frn%2Fp) [n:127.0.0.1:56047_frn%2Fp c:control_collection s:shard1 r:core_node1 x:collection1] o.a.s.u.UpdateLog Initializing UpdateLog: dataDir= defaultSyncLevel=FLUSH numRecordsToKeep=100 maxNumLogsToKeep=10 numVersionBuckets=65536
   [junit4]   2> 706713 INFO  (coreLoadExecutor-3122-thread-1-processing-n:127.0.0.1:56047_frn%2Fp) [n:127.0.0.1:56047_frn%2Fp c:control_collection s:shard1 r:core_node1 x:collection1] o.a.s.u.CommitTracker Hard AutoCommit: disabled
   [junit4]   2> 706713 INFO  (coreLoadExecutor-3122-thread-1-processing-n:127.0.0.1:56047_frn%2Fp) [n:127.0.0.1:56047_frn%2Fp c:control_collection s:shard1 r:core_node1 x:collection1] o.a.s.u.CommitTracker Soft AutoCommit: disabled
   [junit4]   2> 706713 INFO  (coreLoadExecutor-3122-thread-1-processing-n:127.0.0.1:56047_frn%2Fp) [n:127.0.0.1:56047_frn%2Fp c:control_collection s:shard1 r:core_node1 x:collection1] o.a.s.u.RandomMergePolicy RandomMergePolicy wrapping class org.apache.lucene.index.TieredMergePolicy: [TieredMergePolicy: maxMergeAtOnce=50, maxMergeAtOnceExplicit=20, maxMergedSegmentMB=50.400390625, floorSegmentMB=1.71875, forceMergeDeletesPctAllowed=11.732392170414572, segmentsPerTier=28.0, maxCFSSegmentSizeMB=8.796093022207999E12, noCFSRatio=0.3629268181313814
   [junit4]   2> 706713 INFO  (coreLoadExecutor-3122-thread-1-processing-n:127.0.0.1:56047_frn%2Fp) [n:127.0.0.1:56047_frn%2Fp c:control_collection s:shard1 r:core_node1 x:collection1] o.a.s.c.SolrDeletionPolicy SolrDeletionPolicy.onInit: commits: num=1
   [junit4]   2> 	commit{dir=MockDirectoryWrapper(RAMDirectory@2767901f lockFactory=org.apache.lucene.store.SingleInstanceLockFactory@4bc37de0),segFN=segments_1,generation=1}
   [junit4]   2> 706713 INFO  (coreLoadExecutor-3122-thread-1-processing-n:127.0.0.1:56047_frn%2Fp) [n:127.0.0.1:56047_frn%2Fp c:control_collection s:shard1 r:core_node1 x:collection1] o.a.s.c.SolrDeletionPolicy newest commit generation = 1
   [junit4]   2> 706713 INFO  (coreLoadExecutor-3122-thread-1-processing-n:127.0.0.1:56047_frn%2Fp) [n:127.0.0.1:56047_frn%2Fp c:control_collection s:shard1 r:core_node1 x:collection1] o.a.s.s.SolrIndexSearcher Opening [Searcher@7da27ea8[collection1] main]
   [junit4]   2> 706714 INFO  (coreLoadExecutor-3122-thread-1-processing-n:127.0.0.1:56047_frn%2Fp) [n:127.0.0.1:56047_frn%2Fp c:control_collection s:shard1 r:core_node1 x:collection1] o.a.s.c.c.ZkStateReader Load collection config from: [/collections/control_collection]
   [junit4]   2> 706714 INFO  (coreLoadExecutor-3122-thread-1-processing-n:127.0.0.1:56047_frn%2Fp) [n:127.0.0.1:56047_frn%2Fp c:control_collection s:shard1 r:core_node1 x:collection1] o.a.s.c.c.ZkStateReader path=[/collections/control_collection] [configName]=[conf1] specified config exists in ZooKeeper
   [junit4]   2> 706714 INFO  (coreLoadExecutor-3122-thread-1-processing-n:127.0.0.1:56047_frn%2Fp) [n:127.0.0.1:56047_frn%2Fp c:control_collection s:shard1 r:core_node1 x:collection1] o.a.s.r.ManagedResourceStorage Setting up ZooKeeper-based storage for the RestManager with znodeBase: /configs/conf1
   [junit4]   2> 706714 INFO  (coreLoadExecutor-3122-thread-1-processing-n:127.0.0.1:56047_frn%2Fp) [n:127.0.0.1:56047_frn%2Fp c:control_collection s:shard1 r:core_node1 x:collection1] o.a.s.r.ManagedResourceStorage Configured ZooKeeperStorageIO with znodeBase: /configs/conf1
   [junit4]   2> 706714 INFO  (coreLoadExecutor-3122-thread-1-processing-n:127.0.0.1:56047_frn%2Fp) [n:127.0.0.1:56047_frn%2Fp c:control_collection s:shard1 r:core_node1 x:collection1] o.a.s.r.RestManager Initializing RestManager with initArgs: {}
   [junit4]   2> 706714 INFO  (coreLoadExecutor-3122-thread-1-processing-n:127.0.0.1:56047_frn%2Fp) [n:127.0.0.1:56047_frn%2Fp c:control_collection s:shard1 r:core_node1 x:collection1] o.a.s.r.ManagedResourceStorage Reading _rest_managed.json using ZooKeeperStorageIO:path=/configs/conf1
   [junit4]   2> 706715 INFO  (coreLoadExecutor-3122-thread-1-processing-n:127.0.0.1:56047_frn%2Fp) [n:127.0.0.1:56047_frn%2Fp c:control_collection s:shard1 r:core_node1 x:collection1] o.a.s.r.ManagedResourceStorage No data found for znode /configs/conf1/_rest_managed.json
   [junit4]   2> 706715 INFO  (coreLoadExecutor-3122-thread-1-processing-n:127.0.0.1:56047_frn%2Fp) [n:127.0.0.1:56047_frn%2Fp c:control_collection s:shard1 r:core_node1 x:collection1] o.a.s.r.ManagedResourceStorage Loaded null at path _rest_managed.json using ZooKeeperStorageIO:path=/configs/conf1
   [junit4]   2> 706715 INFO  (coreLoadExecutor-3122-thread-1-processing-n:127.0.0.1:56047_frn%2Fp) [n:127.0.0.1:56047_frn%2Fp c:control_collection s:shard1 r:core_node1 x:collection1] o.a.s.r.RestManager Initializing 0 registered ManagedResources
   [junit4]   2> 706715 INFO  (coreLoadExecutor-3122-thread-1-processing-n:127.0.0.1:56047_frn%2Fp) [n:127.0.0.1:56047_frn%2Fp c:control_collection s:shard1 r:core_node1 x:collection1] o.a.s.h.ReplicationHandler Commits will be reserved for  10000
   [junit4]   2> 706715 INFO  (searcherExecutor-3123-thread-1-processing-n:127.0.0.1:56047_frn%2Fp x:collection1 s:shard1 c:control_collection r:core_node1) [n:127.0.0.1:56047_frn%2Fp c:control_collection s:shard1 r:core_node1 x:collection1] o.a.s.c.SolrCore [collection1] Registered new searcher Searcher@7da27ea8[collection1] main{ExitableDirectoryReader(UninvertingDirectoryReader())}
   [junit4]   2> 706715 INFO  (coreLoadExecutor-3122-thread-1-processing-n:127.0.0.1:56047_frn%2Fp) [n:127.0.0.1:56047_frn%2Fp c:control_collection s:shard1 r:core_node1 x:collection1] o.a.s.u.UpdateLog Looking up max value of version field to seed version buckets
   [junit4]   2> 706715 INFO  (coreLoadExecutor-3122-thread-1-processing-n:127.0.0.1:56047_frn%2Fp) [n:127.0.0.1:56047_frn%2Fp c:control_collection s:shard1 r:core_node1 x:collection1] o.a.s.u.VersionInfo Refreshing highest value of _version_ for 65536 version buckets from index
   [junit4]   2> 706715 INFO  (coreLoadExecutor-3122-thread-1-processing-n:127.0.0.1:56047_frn%2Fp) [n:127.0.0.1:56047_frn%2Fp c:control_collection s:shard1 r:core_node1 x:collection1] o.a.s.u.VersionInfo No terms found for _version_, cannot seed version bucket highest value from index
   [junit4]   2> 706715 INFO  (coreLoadExecutor-3122-thread-1-processing-n:127.0.0.1:56047_frn%2Fp) [n:127.0.0.1:56047_frn%2Fp c:control_collection s:shard1 r:core_node1 x:collection1] o.a.s.u.UpdateLog Could not find max version in index or recent updates, using new clock 1541489293051035648
   [junit4]   2> 706717 INFO  (coreLoadExecutor-3122-thread-1-processing-n:127.0.0.1:56047_frn%2Fp) [n:127.0.0.1:56047_frn%2Fp c:control_collection s:shard1 r:core_node1 x:collection1] o.a.s.u.UpdateLog Took 1.0ms to seed version buckets with highest version 1541489293051035648
   [junit4]   2> 706717 INFO  (coreLoadExecutor-3122-thread-1-processing-n:127.0.0.1:56047_frn%2Fp) [n:127.0.0.1:56047_frn%2Fp c:control_collection s:shard1 r:core_node1 x:collection1] o.a.s.c.ZkController watch zkdir /configs/conf1
   [junit4]   2> 706717 INFO  (coreLoadExecutor-3122-thread-1-processing-n:127.0.0.1:56047_frn%2Fp) [n:127.0.0.1:56047_frn%2Fp c:control_collection s:shard1 r:core_node1 x:collection1] o.a.s.c.CoreContainer registering core: collection1
   [junit4]   2> 706720 INFO  (coreZkRegister-3116-thread-1-processing-n:127.0.0.1:56047_frn%2Fp x:collection1 s:shard1 c:control_collection r:core_node1) [n:127.0.0.1:56047_frn%2Fp c:control_collection s:shard1 r:core_node1 x:collection1] o.a.s.c.ZkController Register replica - core:collection1 address:http://127.0.0.1:56047/frn/p collection:control_collection shard:shard1
   [junit4]   2> 706720 INFO  (coreZkRegister-3116-thread-1-processing-n:127.0.0.1:56047_frn%2Fp x:collection1 s:shard1 c:control_collection r:core_node1) [n:127.0.0.1:56047_frn%2Fp c:control_collection s:shard1 r:core_node1 x:collection1] o.a.s.c.c.SolrZkClient makePath: /collections/control_collection/leader_elect/shard1/election
   [junit4]   2> 706721 INFO  (coreZkRegister-3116-thread-1-processing-n:127.0.0.1:56047_frn%2Fp x:collection1 s:shard1 c:control_collection r:core_node1) [n:127.0.0.1:56047_frn%2Fp c:control_collection s:shard1 r:core_node1 x:collection1] o.a.s.c.LeaderElector Joined leadership election with path: /collections/control_collection/leader_elect/shard1/election/96343080728068100-core_node1-n_0000000000
   [junit4]   2> 706722 INFO  (coreZkRegister-3116-thread-1-processing-n:127.0.0.1:56047_frn%2Fp x:collection1 s:shard1 c:control_collection r:core_node1) [n:127.0.0.1:56047_frn%2Fp c:control_collection s:shard1 r:core_node1 x:collection1] o.a.s.c.ShardLeaderElectionContext Running the leader process for shard=shard1 and weAreReplacement=false and leaderVoteWait=10000
   [junit4]   2> 706722 INFO  (OverseerStateUpdate-96343080728068100-127.0.0.1:56047_frn%2Fp-n_0000000000) [n:127.0.0.1:56047_frn%2Fp    ] o.a.s.c.Overseer processMessage: queueSize: 1, message = {
   [junit4]   2>   "operation":"leader",
   [junit4]   2>   "shard":"shard1",
   [junit4]   2>   "collection":"control_collection"} current state version: 1
   [junit4]   2> 706723 INFO  (coreZkRegister-3116-thread-1-processing-n:127.0.0.1:56047_frn%2Fp x:collection1 s:shard1 c:control_collection r:core_node1) [n:127.0.0.1:56047_frn%2Fp c:control_collection s:shard1 r:core_node1 x:collection1] o.a.s.c.ShardLeaderElectionContext Enough replicas found to continue.
   [junit4]   2> 706723 INFO  (coreZkRegister-3116-thread-1-processing-n:127.0.0.1:56047_frn%2Fp x:collection1 s:shard1 c:control_collection r:core_node1) [n:127.0.0.1:56047_frn%2Fp c:control_collection s:shard1 r:core_node1 x:collection1] o.a.s.c.ShardLeaderElectionContext I may be the new leader - try and sync
   [junit4]   2> 706723 INFO  (coreZkRegister-3116-thread-1-processing-n:127.0.0.1:56047_frn%2Fp x:collection1 s:shard1 c:control_collection r:core_node1) [n:127.0.0.1:56047_frn%2Fp c:control_collection s:shard1 r:core_node1 x:collection1] o.a.s.c.SyncStrategy Sync replicas to http://127.0.0.1:56047/frn/p/collection1/
   [junit4]   2> 706723 INFO  (coreZkRegister-3116-thread-1-processing-n:127.0.0.1:56047_frn%2Fp x:collection1 s:shard1 c:control_collection r:core_node1) [n:127.0.0.1:56047_frn%2Fp c:control_collection s:shard1 r:core_node1 x:collection1] o.a.s.c.SyncStrategy Sync Success - now sync replicas to me
   [junit4]   2> 706723 INFO  (coreZkRegister-3116-thread-1-processing-n:127.0.0.1:56047_frn%2Fp x:collection1 s:shard1 c:control_collection r:core_node1) [n:127.0.0.1:56047_frn%2Fp c:control_collection s:shard1 r:core_node1 x:collection1] o.a.s.c.SyncStrategy http://127.0.0.1:56047/frn/p/collection1/ has no replicas
   [junit4]   2> 706725 INFO  (coreZkRegister-3116-thread-1-processing-n:127.0.0.1:56047_frn%2Fp x:collection1 s:shard1 c:control_collection r:core_node1) [n:127.0.0.1:56047_frn%2Fp c:control_collection s:shard1 r:core_node1 x:collection1] o.a.s.c.c.SolrZkClient makePath: /collections/control_collection/leaders/shard1
   [junit4]   2> 706732 INFO  (coreZkRegister-3116-thread-1-processing-n:127.0.0.1:56047_frn%2Fp x:collection1 s:shard1 c:control_collection r:core_node1) [n:127.0.0.1:56047_frn%2Fp c:control_collection s:shard1 r:core_node1 x:collection1] o.a.s.c.ShardLeaderElectionContextBase Creating leader registration node /collections/control_collection/leaders/shard1/leader after winning as /collections/control_collection/leader_elect/shard1/election/96343080728068100-core_node1-n_0000000000
   [junit4]   2> 706733 INFO  (coreZkRegister-3116-thread-1-processing-n:127.0.0.1:56047_frn%2Fp x:collection1 s:shard1 c:control_collection r:core_node1) [n:127.0.0.1:56047_frn%2Fp c:control_collection s:shard1 r:core_node1 x:collection1] o.a.s.c.ShardLeaderElectionContext I am the new leader: http://127.0.0.1:56047/frn/p/collection1/ shard1
   [junit4]   2> 706733 INFO  (OverseerStateUpdate-96343080728068100-127.0.0.1:56047_frn%2Fp-n_0000000000) [n:127.0.0.1:56047_frn%2Fp    ] o.a.s.c.Overseer processMessage: queueSize: 1, message = {
   [junit4]   2>   "operation":"leader",
   [junit4]   2>   "shard":"shard1",
   [junit4]   2>   "collection":"control_collection",
   [junit4]   2>   "base_url":"http://127.0.0.1:56047/frn/p",
   [junit4]   2>   "core":"collection1",
   [junit4]   2>   "state":"active"} current state version: 1
   [junit4]   2> 706835 INFO  (zkCallback-1221-thread-3-processing-n:127.0.0.1:56047_frn%2Fp) [n:127.0.0.1:56047_frn%2Fp    ] o.a.s.c.c.ZkStateReader A cluster state change: [WatchedEvent state:SyncConnected type:NodeDataChanged path:/clusterstate.json], has occurred - updating... (live nodes size: [1])
   [junit4]   2> 706884 INFO  (coreZkRegister-3116-thread-1-processing-n:127.0.0.1:56047_frn%2Fp x:collection1 s:shard1 c:control_collection r:core_node1) [n:127.0.0.1:56047_frn%2Fp c:control_collection s:shard1 r:core_node1 x:collection1] o.a.s.c.ZkController We are http://127.0.0.1:56047/frn/p/collection1/ and leader is http://127.0.0.1:56047/frn/p/collection1/
   [junit4]   2> 706884 INFO  (coreZkRegister-3116-thread-1-processing-n:127.0.0.1:56047_frn%2Fp x:collection1 s:shard1 c:control_collection r:core_node1) [n:127.0.0.1:56047_frn%2Fp c:control_collection s:shard1 r:core_node1 x:collection1] o.a.s.c.ZkController No LogReplay needed for core=collection1 baseURL=http://127.0.0.1:56047/frn/p
   [junit4]   2> 706884 INFO  (coreZkRegister-3116-thread-1-processing-n:127.0.0.1:56047_frn%2Fp x:collection1 s:shard1 c:control_collection r:core_node1) [n:127.0.0.1:56047_frn%2Fp c:control_collection s:shard1 r:core_node1 x:collection1] o.a.s.c.ZkController I am the leader, no recovery necessary
   [junit4]   2> 706884 INFO  (coreZkRegister-3116-thread-1-processing-n:127.0.0.1:56047_frn%2Fp x:collection1 s:shard1 c:control_collection r:core_node1) [n:127.0.0.1:56047_frn%2Fp c:control_collection s:shard1 r:core_node1 x:collection1] o.a.s.c.ZkController publishing state=active
   [junit4]   2> 706884 INFO  (coreZkRegister-3116-thread-1-processing-n:127.0.0.1:56047_frn%2Fp x:collection1 s:shard1 c:control_collection r:core_node1) [n:127.0.0.1:56047_frn%2Fp c:control_collection s:shard1 r:core_node1 x:collection1] o.a.s.c.ZkController numShards not found on descriptor - reading it from system property
   [junit4]   2> 706885 INFO  (coreZkRegister-3116-thread-1-processing-n:127.0.0.1:56047_frn%2Fp x:collection1 s:shard1 c:control_collection r:core_node1) [n:127.0.0.1:56047_frn%2Fp c:control_collection s:shard1 r:core_node1 x:collection1] o.a.s.c.c.ZkStateReader Checking legacy cluster state for collection control_collection
   [junit4]   2> 706885 INFO  (OverseerStateUpdate-96343080728068100-127.0.0.1:56047_frn%2Fp-n_0000000000) [n:127.0.0.1:56047_frn%2Fp    ] o.a.s.c.Overseer processMessage: queueSize: 1, message = {
   [junit4]   2>   "core":"collection1",
   [junit4]   2>   "core_node_name":"core_node1",
   [junit4]   2>   "roles":null,
   [junit4]   2>   "base_url":"http://127.0.0.1:56047/frn/p",
   [junit4]   2>   "node_name":"127.0.0.1:56047_frn%2Fp",
   [junit4]   2>   "numShards":"1",
   [junit4]   2>   "state":"active",
   [junit4]   2>   "shard":"shard1",
   [junit4]   2>   "collection":"control_collection",
   [junit4]   2>   "operation":"state"} current state version: 2
   [junit4]   2> 706885 INFO  (OverseerStateUpdate-96343080728068100-127.0.0.1:56047_frn%2Fp-n_0000000000) [n:127.0.0.1:56047_frn%2Fp    ] o.a.s.c.o.ReplicaMutator Update state numShards=1 message={
   [junit4]   2>   "core":"collection1",
   [junit4]   2>   "core_node_name":"core_node1",
   [junit4]   2>   "roles":null,
   [junit4]   2>   "base_url":"http://127.0.0.1:56047/frn/p",
   [junit4]   2>   "node_name":"127.0.0.1:56047_frn%2Fp",
   [junit4]   2>   "numShards":"1",
   [junit4]   2>   "state":"active",
   [junit4]   2>   "shard":"shard1",
   [junit4]   2>   "collection":"control_collection",
   [junit4]   2>   "operation":"state"}
   [junit4]   2> 706987 INFO  (zkCallback-1221-thread-3-processing-n:127.0.0.1:56047_frn%2Fp) [n:127.0.0.1:56047_frn%2Fp    ] o.a.s.c.c.ZkStateReader A cluster state change: [WatchedEvent state:SyncConnected type:NodeDataChanged path:/clusterstate.json], has occurred - updating... (live nodes size: [1])
   [junit4]   2> 707098 INFO  (TEST-LeaderFailoverAfterPartitionTest.test-seed#[AE386E48E8DF754]) [    ] o.a.s.c.c.SolrZkClient Using default ZkCredentialsProvider
   [junit4]   2> 707098 INFO  (TEST-LeaderFailoverAfterPartitionTest.test-seed#[AE386E48E8DF754]) [    ] o.a.s.c.c.ConnectionManager Waiting for client to connect to ZooKeeper
   [junit4]   2> 707099 INFO  (zkCallback-1225-thread-1) [    ] o.a.s.c.c.ConnectionManager Watcher org.apache.solr.common.cloud.ConnectionManager@2a672b3d name:ZooKeeperConnection Watcher:127.0.0.1:37340/solr got event WatchedEvent state:SyncConnected type:None path:null path:null type:None
   [junit4]   2> 707099 INFO  (TEST-LeaderFailoverAfterPartitionTest.test-seed#[AE386E48E8DF754]) [    ] o.a.s.c.c.ConnectionManager Client is connected to ZooKeeper
   [junit4]   2> 707099 INFO  (TEST-LeaderFailoverAfterPartitionTest.test-seed#[AE386E48E8DF754]) [    ] o.a.s.c.c.SolrZkClient Using default ZkACLProvider
   [junit4]   2> 707099 INFO  (TEST-LeaderFailoverAfterPartitionTest.test-seed#[AE386E48E8DF754]) [    ] o.a.s.c.c.ZkStateReader Updating cluster state from ZooKeeper... 
   [junit4]   2> 707100 INFO  (TEST-LeaderFailoverAfterPartitionTest.test-seed#[AE386E48E8DF754]) [    ] o.a.s.c.c.ZkStateReader Loaded empty cluster properties
   [junit4]   2> 707100 INFO  (TEST-LeaderFailoverAfterPartitionTest.test-seed#[AE386E48E8DF754]) [    ] o.a.s.c.c.ZkStateReader Updated live nodes from ZooKeeper... (0) -> (1)
   [junit4]   2> 707101 INFO  (TEST-LeaderFailoverAfterPartitionTest.test-seed#[AE386E48E8DF754]) [    ] o.a.s.c.ChaosMonkey monkey: init - expire sessions:false cause connection loss:false
   [junit4]   2> 707101 INFO  (TEST-LeaderFailoverAfterPartitionTest.test-seed#[AE386E48E8DF754]) [    ] o.a.s.c.AbstractFullDistribZkTestBase Creating collection1 with stateFormat=2
   [junit4]   2> 707101 INFO  (TEST-LeaderFailoverAfterPartitionTest.test-seed#[AE386E48E8DF754]) [    ] o.a.s.c.c.SolrZkClient Using default ZkCredentialsProvider
   [junit4]   2> 707101 INFO  (TEST-LeaderFailoverAfterPartitionTest.test-seed#[AE386E48E8DF754]) [    ] o.a.s.c.c.ConnectionManager Waiting for client to connect to ZooKeeper
   [junit4]   2> 707102 INFO  (zkCallback-1226-thread-1) [    ] o.a.s.c.c.ConnectionManager Watcher org.apache.solr.common.cloud.ConnectionManager@7913683 name:ZooKeeperConnection Watcher:127.0.0.1:37340/solr got event WatchedEvent state:SyncConnected type:None path:null path:null type:None
   [junit4]   2> 707102 INFO  (TEST-LeaderFailoverAfterPartitionTest.test-seed#[AE386E48E8DF754]) [    ] o.a.s.c.c.ConnectionManager Client is connected to ZooKeeper
   [junit4]   2> 707102 INFO  (TEST-LeaderFailoverAfterPartitionTest.test-seed#[AE386E48E8DF754]) [    ] o.a.s.c.c.SolrZkClient Using default ZkACLProvider
   [junit4]   2> 707104 INFO  (OverseerStateUpdate-96343080728068100-127.0.0.1:56047_frn%2Fp-n_0000000000) [n:127.0.0.1:56047_frn%2Fp    ] o.a.s.c.Overseer processMessage: queueSize: 1, message = {
   [junit4]   2>   "operation":"create",
   [junit4]   2>   "name":"collection1",
   [junit4]   2>   "numShards":"2",
   [junit4]   2>   "stateFormat":"2"} current state version: 3
   [junit4]   2> 707104 INFO  (OverseerStateUpdate-96343080728068100-127.0.0.1:56047_frn%2Fp-n_0000000000) [n:127.0.0.1:56047_frn%2Fp    ] o.a.s.c.o.ClusterStateMutator building a new cName: collection1
   [junit4]   2> 707166 INFO  (TEST-LeaderFailoverAfterPartitionTest.test-seed#[AE386E48E8DF754]) [    ] o.a.s.SolrTestCaseJ4 Writing core.properties file to /x1/jenkins/jenkins-slave/workspace/Lucene-Solr-Tests-6.x/solr/build/solr-core/test/J2/temp/solr.cloud.LeaderFailoverAfterPartitionTest_AE386E48E8DF754-001/shard-1-001/cores/collection1
   [junit4]   2> 707166 INFO  (TEST-LeaderFailoverAfterPartitionTest.test-seed#[AE386E48E8DF754]) [    ] o.a.s.c.AbstractFullDistribZkTestBase create jetty 1 in directory /x1/jenkins/jenkins-slave/workspace/Lucene-Solr-Tests-6.x/solr/build/solr-core/test/J2/temp/solr.cloud.LeaderFailoverAfterPartitionTest_AE386E48E8DF754-001/shard-1-001
   [junit4]   2> 707167 INFO  (TEST-LeaderFailoverAfterPartitionTest.test-seed#[AE386E48E8DF754]) [    ] o.e.j.s.Server jetty-9.3.8.v20160314
   [junit4]   2> 707168 INFO  (TEST-LeaderFailoverAfterPartitionTest.test-seed#[AE386E48E8DF754]) [    ] o.e.j.s.h.ContextHandler Started o.e.j.s.ServletContextHandler@1ab8aef3{/frn/p,null,AVAILABLE}
   [junit4]   2> 707168 INFO  (TEST-LeaderFailoverAfterPartitionTest.test-seed#[AE386E48E8DF754]) [    ] o.e.j.s.ServerConnector Started ServerConnector@4edab571{HTTP/1.1,[http/1.1]}{127.0.0.1:60748}
   [junit4]   2> 707168 INFO  (TEST-LeaderFailoverAfterPartitionTest.test-seed#[AE386E48E8DF754]) [    ] o.e.j.s.Server Started @709335ms
   [junit4]   2> 707168 INFO  (TEST-LeaderFailoverAfterPartitionTest.test-seed#[AE386E48E8DF754]) [    ] o.a.s.c.s.e.JettySolrRunner Jetty properties: {solr.data.dir=/x1/jenkins/jenkins-slave/workspace/Lucene-Solr-Tests-6.x/solr/build/solr-core/test/J2/temp/solr.cloud.LeaderFailoverAfterPartitionTest_AE386E48E8DF754-001/tempDir-001/jetty1, solrconfig=solrconfig.xml, hostContext=/frn/p, hostPort=52819, coreRootDirectory=/x1/jenkins/jenkins-slave/workspace/Lucene-Solr-Tests-6.x/solr/build/solr-core/test/J2/temp/solr.cloud.LeaderFailoverAfterPartitionTest_AE386E48E8DF754-001/shard-1-001/cores}
   [junit4]   2> 707168 INFO  (TEST-LeaderFailoverAfterPartitionTest.test-seed#[AE386E48E8DF754]) [    ] o.a.s.s.SolrDispatchFilter SolrDispatchFilter.init(): sun.misc.Launcher$AppClassLoader@73d16e93
   [junit4]   2> 707168 INFO  (TEST-LeaderFailoverAfterPartitionTest.test-seed#[AE386E48E8DF754]) [    ] o.a.s.c.SolrResourceLoader new SolrResourceLoader for directory: '/x1/jenkins/jenkins-slave/workspace/Lucene-Solr-Tests-6.x/solr/build/solr-core/test/J2/temp/solr.cloud.LeaderFailoverAfterPartitionTest_AE386E48E8DF754-001/shard-1-001'
   [junit4]   2> 707168 INFO  (TEST-LeaderFailoverAfterPartitionTest.test-seed#[AE386E48E8DF754]) [    ] o.a.s.c.SolrResourceLoader JNDI not configured for solr (NoInitialContextEx)
   [junit4]   2> 707168 INFO  (TEST-LeaderFailoverAfterPartitionTest.test-seed#[AE386E48E8DF754]) [    ] o.a.s.c.SolrResourceLoader solr home defaulted to 'solr/' (could not find system property or JNDI)
   [junit4]   2> 707169 INFO  (TEST-LeaderFailoverAfterPartitionTest.test-seed#[AE386E48E8DF754]) [    ] o.a.s.c.c.SolrZkClient Using default ZkCredentialsProvider
   [junit4]   2> 707169 INFO  (TEST-LeaderFailoverAfterPartitionTest.test-seed#[AE386E48E8DF754]) [    ] o.a.s.c.c.ConnectionManager Waiting for client to connect to ZooKeeper
   [junit4]   2> 707170 INFO  (zkCallback-1227-thread-1) [    ] o.a.s.c.c.ConnectionManager Watcher org.apache.solr.common.cloud.ConnectionManager@78153d72 name:ZooKeeperConnection Watcher:127.0.0.1:37340/solr got event WatchedEvent state:SyncConnected type:None path:null path:null type:None
   [junit4]   2> 707170 INFO  (TEST-LeaderFailoverAfterPartitionTest.test-seed#[AE386E48E8DF754]) [    ] o.a.s.c.c.ConnectionManager Client is connected to ZooKeeper
   [junit4]   2> 707170 INFO  (TEST-LeaderFailoverAfterPartitionTest.test-seed#[AE386E48E8DF754]) [    ] o.a.s.c.c.SolrZkClient Using default ZkACLProvider
   [junit4]   2> 707172 INFO  (TEST-LeaderFailoverAfterPartitionTest.test-seed#[AE386E48E8DF754]) [    ] o.a.s.s.SolrDispatchFilter Loading solr.xml from SolrHome (not found in ZooKeeper)
   [junit4]   2> 707172 INFO  (TEST-LeaderFailoverAfterPartitionTest.test-seed#[AE386E48E8DF754]) [    ] o.a.s.c.SolrXmlConfig Loading container configuration from /x1/jenkins/jenkins-slave/workspace/Lucene-Solr-Tests-6.x/solr/build/solr-core/test/J2/temp/solr.cloud.LeaderFailoverAfterPartitionTest_AE386E48E8DF754-001/shard-1-001/solr.xml
   [junit4]   2> 707175 INFO  (TEST-LeaderFailoverAfterPartitionTest.test-seed#[AE386E48E8DF754]) [    ] o.a.s.c.CorePropertiesLocator Config-defined core root directory: /x1/jenkins/jenkins-slave/workspace/Lucene-Solr-Tests-6.x/solr/build/solr-core/test/J2/temp/solr.cloud.LeaderFailoverAfterPartitionTest_AE386E48E8DF754-001/shard-1-001/cores
   [junit4]   2> 707175 INFO  (TEST-LeaderFailoverAfterPartitionTest.test-seed#[AE386E48E8DF754]) [    ] o.a.s.c.CoreContainer New CoreContainer 966386245
   [junit4]   2> 707175 INFO  (TEST-LeaderFailoverAfterPartitionTest.test-seed#[AE386E48E8DF754]) [    ] o.a.s.c.CoreContainer Loading cores into CoreContainer [instanceDir=/x1/jenkins/jenkins-slave/workspace/Lucene-Solr-Tests-6.x/solr/build/solr-core/test/J2/temp/solr.cloud.LeaderFailoverAfterPartitionTest_AE386E48E8DF754-001/shard-1-001]
   [junit4]   2> 707175 WARN  (TEST-LeaderFailoverAfterPartitionTest.test-seed#[AE386E48E8DF754]) [    ] o.a.s.c.CoreContainer Couldn't add files from /x1/jenkins/jenkins-slave/workspace/Lucene-Solr-Tests-6.x/solr/build/solr-core/test/J2/temp/solr.cloud.LeaderFailoverAfterPartitionTest_AE386E48E8DF754-001/shard-1-001/lib to classpath: /x1/jenkins/jenkins-slave/workspace/Lucene-Solr-Tests-6.x/solr/build/solr-core/test/J2/temp/solr.cloud.LeaderFailoverAfterPartitionTest_AE386E48E8DF754-001/shard-1-001/lib
   [junit4]   2> 707176 INFO  (TEST-LeaderFailoverAfterPartitionTest.test-seed#[AE386E48E8DF754]) [    ] o.a.s.h.c.HttpShardHandlerFactory created with socketTimeout : 90000,urlScheme : ,connTimeout : 15000,maxConnectionsPerHost : 20,maxConnections : 10000,corePoolSize : 0,maximumPoolSize : 2147483647,maxThreadIdleTime : 5,sizeOfQueue : -1,fairnessPolicy : false,useRetries : false,connectionsEvictorSleepDelay : 5000,maxConnectionIdleTime : 40000,
   [junit4]   2> 707176 INFO  (TEST-LeaderFailoverAfterPartitionTest.test-seed#[AE386E48E8DF754]) [    ] o.a.s.u.UpdateShardHandler Creating UpdateShardHandler HTTP client with params: socketTimeout=340000&connTimeout=45000&retry=true
   [junit4]   2> 707177 INFO  (TEST-LeaderFailoverAfterPartitionTest.test-seed#[AE386E48E8DF754]) [    ] o.a.s.l.LogWatcher SLF4J impl is org.slf4j.impl.Log4jLoggerFactory
   [junit4]   2> 707177 INFO  (TEST-LeaderFailoverAfterPartitionTest.test-seed#[AE386E48E8DF754]) [    ] o.a.s.l.LogWatcher Registering Log Listener [Log4j (org.slf4j.impl.Log4jLoggerFactory)]
   [junit4]   2> 707177 INFO  (TEST-LeaderFailoverAfterPartitionTest.test-seed#[AE386E48E8DF754]) [    ] o.a.s.c.ZkContainer Zookeeper client=127.0.0.1:37340/solr
   [junit4]   2> 707177 INFO  (TEST-LeaderFailoverAfterPartitionTest.test-seed#[AE386E48E8DF754]) [    ] o.a.s.c.ZkController zkHost includes chroot
   [junit4]   2> 707177 INFO  (TEST-LeaderFailoverAfterPartitionTest.test-seed#[AE386E48E8DF754]) [    ] o.a.s.c.c.SolrZkClient Using default ZkCredentialsProvider
   [junit4]   2> 707177 INFO  (TEST-LeaderFailoverAfterPartitionTest.test-seed#[AE386E48E8DF754]) [    ] o.a.s.c.c.ConnectionManager Waiting for client to connect to ZooKeeper
   [junit4]   2> 707178 INFO  (zkCallback-1230-thread-1) [    ] o.a.s.c.c.ConnectionManager Watcher org.apache.solr.common.cloud.ConnectionManager@3588c436 name:ZooKeeperConnection Watcher:127.0.0.1:37340 got event WatchedEvent state:SyncConnected type:None path:null path:null type:None
   [junit4]   2> 707178 INFO  (TEST-LeaderFailoverAfterPartitionTest.test-seed#[AE386E48E8DF754]) [    ] o.a.s.c.c.ConnectionManager Client is connected to ZooKeeper
   [junit4]   2> 707178 INFO  (TEST-LeaderFailoverAfterPartitionTest.test-seed#[AE386E48E8DF754]) [    ] o.a.s.c.c.SolrZkClient Using default ZkACLProvider
   [junit4]   2> 707179 INFO  (TEST-LeaderFailoverAfterPartitionTest.test-seed#[AE386E48E8DF754]) [n:127.0.0.1:52819_frn%2Fp    ] o.a.s.c.ZkController Added new OnReconnect listener org.apache.solr.cloud.ZkController$$Lambda$96/2127056345@5b7302c0
   [junit4]   2> 707179 INFO  (TEST-LeaderFailoverAfterPartitionTest.test-seed#[AE386E48E8DF754]) [n:127.0.0.1:52819_frn%2Fp    ] o.a.s.c.c.ConnectionManager Waiting for client to connect to ZooKeeper
   [junit4]   2> 707180 INFO  (zkCallback-1231-thread-1-processing-n:127.0.0.1:52819_frn%2Fp) [n:127.0.0.1:52819_frn%2Fp    ] o.a.s.c.c.ConnectionManager Watcher org.apache.solr.common.cloud.ConnectionManager@1f59eb2c name:ZooKeeperConnection Watcher:127.0.0.1:37340/solr got event WatchedEvent state:SyncConnected type:None path:null path:null type:None
   [junit4]   2> 707180 INFO  (TEST-LeaderFailoverAfterPartitionTest.test-seed#[AE386E48E8DF754]) [n:127.0.0.1:52819_frn%2Fp    ] o.a.s.c.c.ConnectionManager Client is connected to ZooKeeper
   [junit4]   2> 707183 INFO  (TEST-LeaderFailoverAfterPartitionTest.test-seed#[AE386E48E8DF754]) [n:127.0.0.1:52819_frn%2Fp    ] o.a.s.c.c.ZkStateReader Updating cluster state from ZooKeeper... 
   [junit4]   2> 707183 INFO  (TEST-LeaderFailoverAfterPartitionTest.test-seed#[AE386E48E8DF754]) [n:127.0.0.1:52819_frn%2Fp    ] o.a.s.c.c.ZkStateReader Loaded empty cluster properties
   [junit4]   2> 707183 INFO  (TEST-LeaderFailoverAfterPartitionTest.test-seed#[AE386E48E8DF754]) [n:127.0.0.1:52819_frn%2Fp    ] o.a.s.c.c.ZkStateReader Updated live nodes from ZooKeeper... (0) -> (1)
   [junit4]   2> 707185 INFO  (TEST-LeaderFailoverAfterPartitionTest.test-seed#[AE386E48E8DF754]) [n:127.0.0.1:52819_frn%2Fp    ] o.a.s.c.Overseer Overseer (id=null) closing
   [junit4]   2> 707185 INFO  (TEST-LeaderFailoverAfterPartitionTest.test-seed#[AE386E48E8DF754]) [n:127.0.0.1:52819_frn%2Fp    ] o.a.s.c.LeaderElector Joined leadership election with path: /overseer_elect/election/96343080728068105-127.0.0.1:52819_frn%2Fp-n_0000000001
   [junit4]   2> 707185 INFO  (TEST-LeaderFailoverAfterPartitionTest.test-seed#[AE386E48E8DF754]) [n:127.0.0.1:52819_frn%2Fp    ] o.a.s.c.LeaderElector Watching path /overseer_elect/election/96343080728068100-127.0.0.1:56047_frn%2Fp-n_0000000000 to know if I could be the leader
   [junit4]   2> 707185 INFO  (TEST-LeaderFailoverAfterPartitionTest.test-seed#[AE386E48E8DF754]) [n:127.0.0.1:52819_frn%2Fp    ] o.a.s.c.ZkController Publish node=127.0.0.1:52819_frn%2Fp as DOWN
   [junit4]   2> 707186 INFO  (TEST-LeaderFailoverAfterPartitionTest.test-seed#[AE386E48E8DF754]) [n:127.0.0.1:52819_frn%2Fp    ] o.a.s.c.ZkController Register node as live in ZooKeeper:/live_nodes/127.0.0.1:52819_frn%2Fp
   [junit4]   2> 707186 INFO  (TEST-LeaderFailoverAfterPartitionTest.test-seed#[AE386E48E8DF754]) [n:127.0.0.1:52819_frn%2Fp    ] o.a.s.c.c.SolrZkClient makePath: /live_nodes/127.0.0.1:52819_frn%2Fp
   [junit4]   2> 707186 INFO  (OverseerStateUpdate-96343080728068100-127.0.0.1:56047_frn%2Fp-n_0000000000) [n:127.0.0.1:56047_frn%2Fp    ] o.a.s.c.Overseer processMessage: queueSize: 1, message = {
   [junit4]   2>   "operation":"downnode",
   [junit4]   2>   "node_name":"127.0.0.1:52819_frn%2Fp"} current state version: 3
   [junit4]   2> 707186 INFO  (OverseerStateUpdate-96343080728068100-127.0.0.1:56047_frn%2Fp-n_0000000000) [n:127.0.0.1:56047_frn%2Fp    ] o.a.s.c.o.NodeMutator DownNode state invoked for node: 127.0.0.1:52819_frn%2Fp
   [junit4]   2> 707187 INFO  (OverseerStateUpdate-96343080728068100-127.0.0.1:56047_frn%2Fp-n_0000000000) [n:127.0.0.1:56047_frn%2Fp    ] o.a.s.c.o.ZkStateWriter going to create_collection /collections/collection1/state.json
   [junit4]   2> 707187 INFO  (zkCallback-1225-thread-1) [    ] o.a.s.c.c.ZkStateReader A live node change: [WatchedEvent state:SyncConnected type:NodeChildrenChanged path:/live_nodes], has occurred - updating... (live nodes size: [1])
   [junit4]   2> 707187 INFO  (zkCallback-1221-thread-3-processing-n:127.0.0.1:56047_frn%2Fp) [n:127.0.0.1:56047_frn%2Fp    ] o.a.s.c.c.ZkStateReader A live node change: [WatchedEvent state:SyncConnected type:NodeChildrenChanged path:/live_nodes], has occurred - updating... (live nodes size: [1])
   [junit4]   2> 707187 INFO  (zkCallback-1231-thread-1-processing-n:127.0.0.1:52819_frn%2Fp) [n:127.0.0.1:52819_frn%2Fp    ] o.a.s.c.c.ZkStateReader A live node change: [WatchedEvent state:SyncConnected type:NodeChildrenChanged path:/live_nodes], has occurred - updating... (live nodes size: [1])
   [junit4]   2> 707187 INFO  (zkCallback-1225-thread-1) [    ] o.a.s.c.c.ZkStateReader Updated live nodes from ZooKeeper... (1) -> (2)
   [junit4]   2> 707187 INFO  (zkCallback-1221-thread-3-processing-n:127.0.0.1:56047_frn%2Fp) [n:127.0.0.1:56047_frn%2Fp    ] o.a.s.c.c.ZkStateReader Updated live nodes from ZooKeeper... (1) -> (2)
   [junit4]   2> 707187 INFO  (zkCallback-1231-thread-1-processing-n:127.0.0.1:52819_frn%2Fp) [n:127.0.0.1:52819_frn%2Fp    ] o.a.s.c.c.ZkStateReader Updated live nodes from ZooKeeper... (1) -> (2)
   [junit4]   2> 707188 INFO  (zkCallback-1225-thread-1) [    ] o.a.s.c.c.ZkStateReader A cluster state change: [WatchedEvent state:SyncConnected type:NodeDataChanged path:/clusterstate.json], has occurred - updating... (live nodes size: [2])
   [junit4]   2> 707188 INFO  (zkCallback-1231-thread-1-processing-n:127.0.0.1:52819_frn%2Fp) [n:127.0.0.1:52819_frn%2Fp    ] o.a.s.c.c.ZkStateReader A cluster state change: [WatchedEvent state:SyncConnected type:NodeDataChanged path:/clusterstate.json], has occurred - updating... (live nodes size: [2])
   [junit4]   2> 707188 INFO  (zkCallback-1221-thread-3-processing-n:127.0.0.1:56047_frn%2Fp) [n:127.0.0.1:56047_frn%2Fp    ] o.a.s.c.c.ZkStateReader A cluster state change: [WatchedEvent state:SyncConnected type:NodeDataChanged path:/clusterstate.json], has occurred - updating... (live nodes size: [2])
   [junit4]   2> 707199 INFO  (TEST-LeaderFailoverAfterPartitionTest.test-seed#[AE386E48E8DF754]) [n:127.0.0.1:52819_frn%2Fp    ] o.a.s.c.CoreContainer Security conf doesn't exist. Skipping setup for authorization module.
   [junit4]   2> 707199 INFO  (TEST-LeaderFailoverAfterPartitionTest.test-seed#[AE386E48E8DF754]) [n:127.0.0.1:52819_frn%2Fp    ] o.a.s.c.CoreContainer No authentication plugin used.
   [junit4]   2> 707199 INFO  (TEST-LeaderFailoverAfterPartitionTest.test-seed#[AE386E48E8DF754]) [n:127.0.0.1:52819_frn%2Fp    ] o.a.s.c.CorePropertiesLocator Looking for core definitions underneath /x1/jenkins/jenkins-slave/workspace/Lucene-Solr-Tests-6.x/solr/build/solr-core/test/J2/temp/solr.cloud.LeaderFailoverAfterPartitionTest_AE386E48E8DF754-001/shard-1-001/cores
   [junit4]   2> 707199 INFO  (TEST-LeaderFailoverAfterPartitionTest.test-seed#[AE386E48E8DF754]) [n:127.0.0.1:52819_frn%2Fp    ] o.a.s.c.CoreDescriptor Created CoreDescriptor: {name=collection1, config=solrconfig.xml, transient=false, schema=schema.xml, loadOnStartup=true, configSetProperties=configsetprops.json, collection=collection1, coreNodeName=, dataDir=data/, shard=}
   [junit4]   2> 707199 INFO  (TEST-LeaderFailoverAfterPartitionTest.test-seed#[AE386E48E8DF754]) [n:127.0.0.1:52819_frn%2Fp    ] o.a.s.c.CorePropertiesLocator Found core collection1 in /x1/jenkins/jenkins-slave/workspace/Lucene-Solr-Tests-6.x/solr/build/solr-core/test/J2/temp/solr.cloud.LeaderFailoverAfterPartitionTest_AE386E48E8DF754-001/shard-1-001/cores/collection1
   [junit4]   2> 707199 INFO  (TEST-LeaderFailoverAfterPartitionTest.test-seed#[AE386E48E8DF754]) [n:127.0.0.1:52819_frn%2Fp    ] o.a.s.c.CorePropertiesLocator Found 1 core definitions
   [junit4]   2> 707200 INFO  (TEST-LeaderFailoverAfterPartitionTest.test-seed#[AE386E48E8DF754]) [n:127.0.0.1:52819_frn%2Fp    ] o.a.s.s.SolrDispatchFilter user.dir=/x1/jenkins/jenkins-slave/workspace/Lucene-Solr-Tests-6.x/solr/build/solr-core/test/J2
   [junit4]   2> 707200 INFO  (TEST-LeaderFailoverAfterPartitionTest.test-seed#[AE386E48E8DF754]) [n:127.0.0.1:52819_frn%2Fp    ] o.a.s.s.SolrDispatchFilter SolrDispatchFilter.init() done
   [junit4]   2> 707200 INFO  (coreLoadExecutor-3133-thread-1-processing-n:127.0.0.1:52819_frn%2Fp) [n:127.0.0.1:52819_frn%2Fp c:collection1   x:collection1] o.a.s.c.ZkController publishing state=down
   [junit4]   2> 707200 INFO  (coreLoadExecutor-3133-thread-1-processing-n:127.0.0.1:52819_frn%2Fp) [n:127.0.0.1:52819_frn%2Fp c:collection1   x:collection1] o.a.s.c.ZkController numShards not found on descriptor - reading it from system property
   [junit4]   2> 707201 INFO  (coreLoadExecutor-3133-thread-1-processing-n:127.0.0.1:52819_frn%2Fp) [n:127.0.0.1:52819_frn%2Fp c:collection1   x:collection1] o.a.s.c.ZkController Registering watch for collection collection1
   [junit4]   2> 707201 INFO  (OverseerStateUpdate-96343080728068100-127.0.0.1:56047_frn%2Fp-n_0000000000) [n:127.0.0.1:56047_frn%2Fp    ] o.a.s.c.Overseer processMessage: queueSize: 1, message = {
   [junit4]   2>   "core":"collection1",
   [junit4]   2>   "roles":nul

[...truncated too long message...]

rget: http://127.0.0.1:42009/frn/p
   [junit4]   2> 770136 WARN  (TEST-LeaderFailoverAfterPartitionTest.test-seed#[AE386E48E8DF754]) [    ] o.a.s.c.SocketProxy Closing 6 connections to: http://127.0.0.1:52819/frn/p, target: http://127.0.0.1:60748/frn/p
   [junit4]   2> 770136 WARN  (TEST-LeaderFailoverAfterPartitionTest.test-seed#[AE386E48E8DF754]) [    ] o.a.s.c.SocketProxy Closing 0 connections to: http://127.0.0.1:42174/frn/p, target: http://127.0.0.1:32978/frn/p
   [junit4]   2> NOTE: reproduce with: ant test  -Dtestcase=LeaderFailoverAfterPartitionTest -Dtests.method=test -Dtests.seed=AE386E48E8DF754 -Dtests.multiplier=2 -Dtests.slow=true -Dtests.locale=ms -Dtests.timezone=America/Shiprock -Dtests.asserts=true -Dtests.file.encoding=UTF-8
   [junit4] ERROR   64.8s J2 | LeaderFailoverAfterPartitionTest.test <<<
   [junit4]    > Throwable #1: org.apache.solr.client.solrj.impl.CloudSolrClient$RouteException: No live SolrServers available to handle this request:[http://127.0.0.1:42174/frn/p/c8n_1x3_lf_shard1_replica2]
   [junit4]    > 	at __randomizedtesting.SeedInfo.seed([AE386E48E8DF754:82B7B93E20719AAC]:0)
   [junit4]    > 	at org.apache.solr.client.solrj.impl.CloudSolrClient.directUpdate(CloudSolrClient.java:760)
   [junit4]    > 	at org.apache.solr.client.solrj.impl.CloudSolrClient.sendRequest(CloudSolrClient.java:1172)
   [junit4]    > 	at org.apache.solr.client.solrj.impl.CloudSolrClient.requestWithRetryOnStaleState(CloudSolrClient.java:1061)
   [junit4]    > 	at org.apache.solr.client.solrj.impl.CloudSolrClient.request(CloudSolrClient.java:997)
   [junit4]    > 	at org.apache.solr.client.solrj.SolrClient.request(SolrClient.java:1219)
   [junit4]    > 	at org.apache.solr.cloud.HttpPartitionTest.sendDoc(HttpPartitionTest.java:592)
   [junit4]    > 	at org.apache.solr.cloud.HttpPartitionTest.sendDoc(HttpPartitionTest.java:578)
   [junit4]    > 	at org.apache.solr.cloud.LeaderFailoverAfterPartitionTest.testRf3WithLeaderFailover(LeaderFailoverAfterPartitionTest.java:174)
   [junit4]    > 	at org.apache.solr.cloud.LeaderFailoverAfterPartitionTest.test(LeaderFailoverAfterPartitionTest.java:55)
   [junit4]    > 	at org.apache.solr.BaseDistributedSearchTestCase$ShardsRepeatRule$ShardsFixedStatement.callStatement(BaseDistributedSearchTestCase.java:992)
   [junit4]    > 	at org.apache.solr.BaseDistributedSearchTestCase$ShardsRepeatRule$ShardsStatement.evaluate(BaseDistributedSearchTestCase.java:967)
   [junit4]    > 	at java.lang.Thread.run(Thread.java:745)
   [junit4]    > Caused by: org.apache.solr.client.solrj.SolrServerException: No live SolrServers available to handle this request:[http://127.0.0.1:42174/frn/p/c8n_1x3_lf_shard1_replica2]
   [junit4]    > 	at org.apache.solr.client.solrj.impl.LBHttpSolrClient.request(LBHttpSolrClient.java:383)
   [junit4]    > 	at org.apache.solr.client.solrj.impl.CloudSolrClient.lambda$directUpdate$0(CloudSolrClient.java:735)
   [junit4]    > 	at java.util.concurrent.FutureTask.run(FutureTask.java:266)
   [junit4]    > 	at org.apache.solr.common.util.ExecutorUtil$MDCAwareThreadPoolExecutor.lambda$execute$0(ExecutorUtil.java:229)
   [junit4]    > 	at java.util.concurrent.ThreadPoolExecutor.runWorker(ThreadPoolExecutor.java:1142)
   [junit4]    > 	at java.util.concurrent.ThreadPoolExecutor$Worker.run(ThreadPoolExecutor.java:617)
   [junit4]    > 	... 1 more
   [junit4]    > Caused by: org.apache.solr.client.solrj.SolrServerException: Server refused connection at: http://127.0.0.1:42174/frn/p/c8n_1x3_lf_shard1_replica2
   [junit4]    > 	at org.apache.solr.client.solrj.impl.HttpSolrClient.executeMethod(HttpSolrClient.java:597)
   [junit4]    > 	at org.apache.solr.client.solrj.impl.HttpSolrClient.request(HttpSolrClient.java:259)
   [junit4]    > 	at org.apache.solr.client.solrj.impl.HttpSolrClient.request(HttpSolrClient.java:248)
   [junit4]    > 	at org.apache.solr.client.solrj.impl.LBHttpSolrClient.doRequest(LBHttpSolrClient.java:403)
   [junit4]    > 	at org.apache.solr.client.solrj.impl.LBHttpSolrClient.request(LBHttpSolrClient.java:356)
   [junit4]    > 	... 6 more
   [junit4]    > Caused by: java.net.ConnectException: Connection refused
   [junit4]    > 	at java.net.PlainSocketImpl.socketConnect(Native Method)
   [junit4]    > 	at java.net.AbstractPlainSocketImpl.doConnect(AbstractPlainSocketImpl.java:350)
   [junit4]    > 	at java.net.AbstractPlainSocketImpl.connectToAddress(AbstractPlainSocketImpl.java:206)
   [junit4]    > 	at java.net.AbstractPlainSocketImpl.connect(AbstractPlainSocketImpl.java:188)
   [junit4]    > 	at java.net.SocksSocketImpl.connect(SocksSocketImpl.java:392)
   [junit4]    > 	at java.net.Socket.connect(Socket.java:589)
   [junit4]    > 	at org.apache.http.conn.scheme.PlainSocketFactory.connectSocket(PlainSocketFactory.java:117)
   [junit4]    > 	at org.apache.http.impl.conn.DefaultClientConnectionOperator.openConnection(DefaultClientConnectionOperator.java:177)
   [junit4]    > 	at org.apache.http.impl.conn.ManagedClientConnectionImpl.open(ManagedClientConnectionImpl.java:304)
   [junit4]    > 	at org.apache.http.impl.client.DefaultRequestDirector.tryConnect(DefaultRequestDirector.java:611)
   [junit4]    > 	at org.apache.http.impl.client.DefaultRequestDirector.execute(DefaultRequestDirector.java:446)
   [junit4]    > 	at org.apache.http.impl.client.AbstractHttpClient.doExecute(AbstractHttpClient.java:882)
   [junit4]    > 	at org.apache.http.impl.client.CloseableHttpClient.execute(CloseableHttpClient.java:82)
   [junit4]    > 	at org.apache.http.impl.client.CloseableHttpClient.execute(CloseableHttpClient.java:107)
   [junit4]    > 	at org.apache.http.impl.client.CloseableHttpClient.execute(CloseableHttpClient.java:55)
   [junit4]    > 	at org.apache.solr.client.solrj.impl.HttpSolrClient.executeMethod(HttpSolrClient.java:495)
   [junit4]    > 	... 10 more
   [junit4]   2> 770139 INFO  (SUITE-LeaderFailoverAfterPartitionTest-seed#[AE386E48E8DF754]-worker) [    ] o.a.s.SolrTestCaseJ4 ###deleteCore
   [junit4]   2> NOTE: leaving temporary files on disk at: /x1/jenkins/jenkins-slave/workspace/Lucene-Solr-Tests-6.x/solr/build/solr-core/test/J2/temp/solr.cloud.LeaderFailoverAfterPartitionTest_AE386E48E8DF754-001
   [junit4]   2> Aug 01, 2016 7:13:31 PM com.carrotsearch.randomizedtesting.ThreadLeakControl checkThreadLeaks
   [junit4]   2> WARNING: Will linger awaiting termination of 1 leaked thread(s).
   [junit4]   2> NOTE: test params are: codec=Asserting(Lucene62): {range_facet_l_dv=FSTOrd50, _version_=TestBloomFilteredLucenePostings(BloomFilteringPostingsFormat(Lucene50(blocksize=128))), multiDefault=PostingsFormat(name=Asserting), a_t=TestBloomFilteredLucenePostings(BloomFilteringPostingsFormat(Lucene50(blocksize=128))), intDefault=TestBloomFilteredLucenePostings(BloomFilteringPostingsFormat(Lucene50(blocksize=128))), id=FSTOrd50, range_facet_i_dv=TestBloomFilteredLucenePostings(BloomFilteringPostingsFormat(Lucene50(blocksize=128))), text=FST50, range_facet_l=TestBloomFilteredLucenePostings(BloomFilteringPostingsFormat(Lucene50(blocksize=128))), timestamp=TestBloomFilteredLucenePostings(BloomFilteringPostingsFormat(Lucene50(blocksize=128)))}, docValues:{range_facet_l_dv=DocValuesFormat(name=Lucene54), range_facet_i_dv=DocValuesFormat(name=Memory), timestamp=DocValuesFormat(name=Memory)}, maxPointsInLeafNode=798, maxMBSortInHeap=6.23660675157018, sim=ClassicSimilarity, locale=ms, timezone=America/Shiprock
   [junit4]   2> NOTE: Linux 3.13.0-85-generic amd64/Oracle Corporation 1.8.0_74 (64-bit)/cpus=4,threads=1,free=219750760,total=527958016
   [junit4]   2> NOTE: All tests run in this JVM: [FieldMutatingUpdateProcessorTest, QueryParsingTest, PrimitiveFieldTypeTest, CoreSorterTest, TestFieldTypeCollectionResource, TestSolrQueryParser, TestRequestStatusCollectionAPI, TestInfoStreamLogging, TestScoreJoinQPScore, TestUniqueKeyFieldResource, TestPostingsSolrHighlighter, BigEndianAscendingWordDeserializerTest, TestTrackingShardHandlerFactory, DistributedFacetPivotLargeTest, RankQueryTest, HdfsChaosMonkeySafeLeaderTest, TestSearchPerf, TestExactSharedStatsCache, TestConfigSets, HdfsSyncSliceTest, TestHdfsCloudBackupRestore, SimpleFacetsTest, SaslZkACLProviderTest, TestPKIAuthenticationPlugin, ResponseHeaderTest, BadCopyFieldTest, ConnectionManagerTest, HdfsRecoverLeaseTest, StatsComponentTest, TestUseDocValuesAsStored, TestRestManager, TlogReplayBufferedWhileIndexingTest, PreAnalyzedUpdateProcessorTest, SpatialHeatmapFacetsTest, TestFieldCacheSanityChecker, TestSolrDeletionPolicy1, DistributedQueryComponentOptimizationTest, TestConfigOverlay, TestUtils, TestCopyFieldCollectionResource, CollectionStateFormat2Test, SpatialRPTFieldTypeTest, PluginInfoTest, TestCharFilters, HighlighterConfigTest, DistributedVersionInfoTest, TestSolrConfigHandlerConcurrent, SuggesterWFSTTest, HdfsUnloadDistributedZkTest, FieldAnalysisRequestHandlerTest, UnloadDistributedZkTest, HardAutoCommitTest, TestReversedWildcardFilterFactory, TestDynamicFieldResource, SolrCloudExampleTest, TestRestoreCore, TestXIncludeConfig, TestOverriddenPrefixQueryForCustomFieldType, RecoveryZkTest, UpdateParamsTest, DataDrivenBlockJoinTest, DebugComponentTest, BasicAuthIntegrationTest, TestCollationField, TestRawTransformer, AddBlockUpdateTest, TestSizeLimitedDistributedMap, HLLUtilTest, SharedFSAutoReplicaFailoverUtilsTest, AtomicUpdatesTest, FullSolrCloudDistribCmdsTest, TestHdfsUpdateLog, OverseerTest, OverseerRolesTest, TestSlowCompositeReaderWrapper, TestReloadAndDeleteDocs, BlobRepositoryCloudTest, TestMaxScoreQueryParser, HdfsDirectoryFactoryTest, TermVectorComponentDistributedTest, TestClusterStateMutator, TestSerializedLuceneMatchVersion, TestPerFieldSimilarity, CdcrRequestHandlerTest, TestLocalFSCloudBackupRestore, ShowFileRequestHandlerTest, ExplicitHLLTest, RequestLoggingTest, DateMathParserTest, TestBlendedInfixSuggestions, DocValuesMultiTest, LeaderFailoverAfterPartitionTest]
   [junit4] Completed [255/625 (1!)] on J2 in 65.80s, 1 test, 1 error <<< FAILURES!

[...truncated 61276 lines...]