You are viewing a plain text version of this content. The canonical link for it is here.
Posted to dev@ace.apache.org by Apache Jenkins Server <je...@builds.apache.org> on 2014/02/18 19:50:14 UTC

Build failed in Jenkins: ACE-trunk #197

See <https://builds.apache.org/job/ACE-trunk/197/changes>

Changes:

[marrs] ACE-456 fixed the CI build, forgot a dependency

------------------------------------------
[...truncated 1640 lines...]
   [testng] Bundle Indexer | v2.2
   [testng] (c) 2007 OSGi, All Rights Reserved
   [testng] Bundle Indexer | v2.2
   [testng] (c) 2007 OSGi, All Rights Reserved
   [testng] 
   [testng] ===============================================
   [testng] Ant suite
   [testng] Total tests run: 34, Failures: 0, Skips: 0
   [testng] ===============================================
   [testng] 

template.init:
     [echo] Enter project org.apache.ace.resourceprocessor.useradmin

init:

dependencies:

compile:
    [javac] Compiling 5 source files to /zonestorage/hudson_solaris/home/hudson/hudson-slave/workspace/ACE-trunk/org.apache.ace.resourceprocessor.useradmin/bin
    [javac] /zonestorage/hudson_solaris/home/hudson/hudson-slave/workspace/ACE-trunk/org.apache.ace.resourceprocessor.useradmin/src/org/apache/ace/resourceprocessor/useradmin/UserAdminConfigurator.java
    [javac] /zonestorage/hudson_solaris/home/hudson/hudson-slave/workspace/ACE-trunk/org.apache.ace.resourceprocessor.useradmin/src/org/apache/ace/resourceprocessor/useradmin/impl/Activator.java
    [javac] /zonestorage/hudson_solaris/home/hudson/hudson-slave/workspace/ACE-trunk/org.apache.ace.resourceprocessor.useradmin/src/org/apache/ace/resourceprocessor/useradmin/impl/Processor.java
    [javac] /zonestorage/hudson_solaris/home/hudson/hudson-slave/workspace/ACE-trunk/org.apache.ace.resourceprocessor.useradmin/src/org/apache/ace/resourceprocessor/useradmin/impl/ResourceStore.java
    [javac] /zonestorage/hudson_solaris/home/hudson/hudson-slave/workspace/ACE-trunk/org.apache.ace.resourceprocessor.useradmin/src/org/apache/ace/resourceprocessor/useradmin/impl/UserAdminStore.java
    [javac] Note: /zonestorage/hudson_solaris/home/hudson/hudson-slave/workspace/ACE-trunk/org.apache.ace.resourceprocessor.useradmin/src/org/apache/ace/resourceprocessor/useradmin/impl/UserAdminStore.java uses unchecked or unsafe operations.
    [javac] Note: Recompile with -Xlint:unchecked for details.
     [copy] Copying 1 file to /zonestorage/hudson_solaris/home/hudson/hudson-slave/workspace/ACE-trunk/org.apache.ace.resourceprocessor.useradmin/bin

build:

compileTests:

testng:

template.init:
     [echo] Enter project org.apache.ace.configurator

init:

dependencies:

compile:
    [javac] Compiling 4 source files to /zonestorage/hudson_solaris/home/hudson/hudson-slave/workspace/ACE-trunk/org.apache.ace.configurator/bin
    [javac] /zonestorage/hudson_solaris/home/hudson/hudson-slave/workspace/ACE-trunk/org.apache.ace.configurator/src/org/apache/ace/configurator/Activator.java
    [javac] /zonestorage/hudson_solaris/home/hudson/hudson-slave/workspace/ACE-trunk/org.apache.ace.configurator/src/org/apache/ace/configurator/Configurator.java
    [javac] /zonestorage/hudson_solaris/home/hudson/hudson-slave/workspace/ACE-trunk/org.apache.ace.configurator/src/org/apache/ace/configurator/useradmin/task/Activator.java
    [javac] /zonestorage/hudson_solaris/home/hudson/hudson-slave/workspace/ACE-trunk/org.apache.ace.configurator/src/org/apache/ace/configurator/useradmin/task/UpdateUserAdminTask.java

build:

compileTests:
    [mkdir] Created dir: /zonestorage/hudson_solaris/home/hudson/hudson-slave/workspace/ACE-trunk/org.apache.ace.configurator/bin_test
    [javac] Compiling 3 source files to /zonestorage/hudson_solaris/home/hudson/hudson-slave/workspace/ACE-trunk/org.apache.ace.configurator/bin_test
    [javac] /zonestorage/hudson_solaris/home/hudson/hudson-slave/workspace/ACE-trunk/org.apache.ace.configurator/test/org/apache/ace/configurator/ConfiguratorTest.java
    [javac] /zonestorage/hudson_solaris/home/hudson/hudson-slave/workspace/ACE-trunk/org.apache.ace.configurator/test/org/apache/ace/configurator/MockConfigAdmin.java
    [javac] /zonestorage/hudson_solaris/home/hudson/hudson-slave/workspace/ACE-trunk/org.apache.ace.configurator/test/org/apache/ace/configurator/MockConfiguration.java

testng:
    [mkdir] Created dir: /zonestorage/hudson_solaris/home/hudson/hudson-slave/workspace/ACE-trunk/org.apache.ace.configurator/generated/testng
   [testng] [TestNG] Running:
   [testng]   Ant suite
   [testng] 
   [testng] 
   [testng] ===============================================
   [testng] Ant suite
   [testng] Total tests run: 9, Failures: 0, Skips: 0
   [testng] ===============================================
   [testng] 

template.init:
     [echo] Enter project org.apache.ace.authentication.itest

init:

dependencies:

compile:
    [javac] Compiling 3 source files to /zonestorage/hudson_solaris/home/hudson/hudson-slave/workspace/ACE-trunk/org.apache.ace.authentication.itest/bin
    [javac] /zonestorage/hudson_solaris/home/hudson/hudson-slave/workspace/ACE-trunk/org.apache.ace.authentication.itest/src/org/apache/ace/it/authentication/AuthenticationTestBase.java
    [javac] /zonestorage/hudson_solaris/home/hudson/hudson-slave/workspace/ACE-trunk/org.apache.ace.authentication.itest/src/org/apache/ace/it/authentication/LogAuthenticationTest.java
    [javac] /zonestorage/hudson_solaris/home/hudson/hudson-slave/workspace/ACE-trunk/org.apache.ace.authentication.itest/src/org/apache/ace/it/authentication/ObrAuthenticationTest.java
    [javac] Note: /zonestorage/hudson_solaris/home/hudson/hudson-slave/workspace/ACE-trunk/org.apache.ace.authentication.itest/src/org/apache/ace/it/authentication/ObrAuthenticationTest.java uses unchecked or unsafe operations.
    [javac] Note: Recompile with -Xlint:unchecked for details.

build:

compileTests:
    [mkdir] Created dir: /zonestorage/hudson_solaris/home/hudson/hudson-slave/workspace/ACE-trunk/org.apache.ace.authentication.itest/bin_test

testng:

template.init:
     [echo] Enter project org.apache.ace.bnd

init:

dependencies:

compile:
    [javac] Compiling 1 source file to /zonestorage/hudson_solaris/home/hudson/hudson-slave/workspace/ACE-trunk/org.apache.ace.bnd/bin
    [javac] /zonestorage/hudson_solaris/home/hudson/hudson-slave/workspace/ACE-trunk/org.apache.ace.bnd/src/org/apache/ace/bnd/repository/AceObrRepository.java
     [copy] Copying 1 file to /zonestorage/hudson_solaris/home/hudson/hudson-slave/workspace/ACE-trunk/org.apache.ace.bnd/bin

build:

compileTests:
    [mkdir] Created dir: /zonestorage/hudson_solaris/home/hudson/hudson-slave/workspace/ACE-trunk/org.apache.ace.bnd/bin_test

testng:

template.init:
     [echo] Enter project org.apache.ace.client.automation

init:

dependencies:

compile:
    [javac] Compiling 2 source files to /zonestorage/hudson_solaris/home/hudson/hudson-slave/workspace/ACE-trunk/org.apache.ace.client.automation/bin
    [javac] /zonestorage/hudson_solaris/home/hudson/hudson-slave/workspace/ACE-trunk/org.apache.ace.client.automation/src/org/apache/ace/client/automation/Activator.java
    [javac] /zonestorage/hudson_solaris/home/hudson/hudson-slave/workspace/ACE-trunk/org.apache.ace.client.automation/src/org/apache/ace/client/automation/AutoTargetOperator.java

build:

compileTests:

testng:

template.init:
     [echo] Enter project org.apache.ace.client.repository.itest

init:

dependencies:

compile:
    [javac] Compiling 5 source files to /zonestorage/hudson_solaris/home/hudson/hudson-slave/workspace/ACE-trunk/org.apache.ace.client.repository.itest/bin
    [javac] /zonestorage/hudson_solaris/home/hudson/hudson-slave/workspace/ACE-trunk/org.apache.ace.client.repository.itest/src/org/apache/ace/it/repositoryadmin/BaseRepositoryAdminTest.java
    [javac] /zonestorage/hudson_solaris/home/hudson/hudson-slave/workspace/ACE-trunk/org.apache.ace.client.repository.itest/src/org/apache/ace/it/repositoryadmin/ClientAutomationTest.java
    [javac] /zonestorage/hudson_solaris/home/hudson/hudson-slave/workspace/ACE-trunk/org.apache.ace.client.repository.itest/src/org/apache/ace/it/repositoryadmin/RepositoryAdminTest.java
    [javac] /zonestorage/hudson_solaris/home/hudson/hudson-slave/workspace/ACE-trunk/org.apache.ace.client.repository.itest/src/org/apache/ace/it/repositoryadmin/StatefulTargetRepositoryTest.java
    [javac] /zonestorage/hudson_solaris/home/hudson/hudson-slave/workspace/ACE-trunk/org.apache.ace.client.repository.itest/src/org/apache/ace/it/repositoryadmin/TemplateProcessorTest.java
    [javac] Note: /zonestorage/hudson_solaris/home/hudson/hudson-slave/workspace/ACE-trunk/org.apache.ace.client.repository.itest/src/org/apache/ace/it/repositoryadmin/BaseRepositoryAdminTest.java uses unchecked or unsafe operations.
    [javac] Note: Recompile with -Xlint:unchecked for details.

build:

compileTests:
    [mkdir] Created dir: /zonestorage/hudson_solaris/home/hudson/hudson-slave/workspace/ACE-trunk/org.apache.ace.client.repository.itest/bin_test

testng:

template.init:
     [echo] Enter project org.apache.ace.client.workspace

init:

dependencies:

compile:
    [javac] Compiling 5 source files to /zonestorage/hudson_solaris/home/hudson/hudson-slave/workspace/ACE-trunk/org.apache.ace.client.workspace/bin
    [javac] /zonestorage/hudson_solaris/home/hudson/hudson-slave/workspace/ACE-trunk/org.apache.ace.client.workspace/src/org/apache/ace/client/workspace/Workspace.java
    [javac] /zonestorage/hudson_solaris/home/hudson/hudson-slave/workspace/ACE-trunk/org.apache.ace.client.workspace/src/org/apache/ace/client/workspace/WorkspaceManager.java
    [javac] /zonestorage/hudson_solaris/home/hudson/hudson-slave/workspace/ACE-trunk/org.apache.ace.client.workspace/src/org/apache/ace/client/workspace/impl/Activator.java
    [javac] /zonestorage/hudson_solaris/home/hudson/hudson-slave/workspace/ACE-trunk/org.apache.ace.client.workspace/src/org/apache/ace/client/workspace/impl/WorkspaceImpl.java
    [javac] /zonestorage/hudson_solaris/home/hudson/hudson-slave/workspace/ACE-trunk/org.apache.ace.client.workspace/src/org/apache/ace/client/workspace/impl/WorkspaceManagerImpl.java
     [copy] Copying 1 file to /zonestorage/hudson_solaris/home/hudson/hudson-slave/workspace/ACE-trunk/org.apache.ace.client.workspace/bin

build:

compileTests:
    [mkdir] Created dir: /zonestorage/hudson_solaris/home/hudson/hudson-slave/workspace/ACE-trunk/org.apache.ace.client.workspace/bin_test
    [javac] Compiling 1 source file to /zonestorage/hudson_solaris/home/hudson/hudson-slave/workspace/ACE-trunk/org.apache.ace.client.workspace/bin_test
    [javac] /zonestorage/hudson_solaris/home/hudson/hudson-slave/workspace/ACE-trunk/org.apache.ace.client.workspace/test/org/apache/ace/client/workspace/impl/WorkspaceManagerImplTest.java

testng:
    [mkdir] Created dir: /zonestorage/hudson_solaris/home/hudson/hudson-slave/workspace/ACE-trunk/org.apache.ace.client.workspace/generated/testng
   [testng] [TestNG] Running:
   [testng]   Ant suite
   [testng] 
   [testng] 
   [testng] ===============================================
   [testng] Ant suite
   [testng] Total tests run: 1, Failures: 0, Skips: 0
   [testng] ===============================================
   [testng] 

template.init:
     [echo] Enter project org.apache.ace.client.rest

init:

dependencies:

compile:
    [javac] Compiling 6 source files to /zonestorage/hudson_solaris/home/hudson/hudson-slave/workspace/ACE-trunk/org.apache.ace.client.rest/bin
    [javac] /zonestorage/hudson_solaris/home/hudson/hudson-slave/workspace/ACE-trunk/org.apache.ace.client.rest/src/org/apache/ace/client/rest/Activator.java
    [javac] /zonestorage/hudson_solaris/home/hudson/hudson-slave/workspace/ACE-trunk/org.apache.ace.client.rest/src/org/apache/ace/client/rest/CollectionCommands.java
    [javac] /zonestorage/hudson_solaris/home/hudson/hudson-slave/workspace/ACE-trunk/org.apache.ace.client.rest/src/org/apache/ace/client/rest/LogEventSerializer.java
    [javac] /zonestorage/hudson_solaris/home/hudson/hudson-slave/workspace/ACE-trunk/org.apache.ace.client.rest/src/org/apache/ace/client/rest/RESTClientServlet.java
    [javac] /zonestorage/hudson_solaris/home/hudson/hudson-slave/workspace/ACE-trunk/org.apache.ace.client.rest/src/org/apache/ace/client/rest/RepositoryObjectSerializer.java
    [javac] /zonestorage/hudson_solaris/home/hudson/hudson-slave/workspace/ACE-trunk/org.apache.ace.client.rest/src/org/apache/ace/client/rest/RepositoryValueObject.java

build:

compileTests:
    [mkdir] Created dir: /zonestorage/hudson_solaris/home/hudson/hudson-slave/workspace/ACE-trunk/org.apache.ace.client.rest/bin_test
    [javac] Compiling 1 source file to /zonestorage/hudson_solaris/home/hudson/hudson-slave/workspace/ACE-trunk/org.apache.ace.client.rest/bin_test
    [javac] /zonestorage/hudson_solaris/home/hudson/hudson-slave/workspace/ACE-trunk/org.apache.ace.client.rest/test/org/apache/ace/client/rest/RESTClientTest.java
    [javac] /zonestorage/hudson_solaris/home/hudson/hudson-slave/workspace/ACE-trunk/org.apache.ace.client.rest/test/org/apache/ace/client/rest/RESTClientTest.java:21: package org.apache.ace.test.utils does not exist
    [javac] import static org.apache.ace.test.utils.TestUtils.UNIT;
    [javac]                                        ^
    [javac] /zonestorage/hudson_solaris/home/hudson/hudson-slave/workspace/ACE-trunk/org.apache.ace.client.rest/test/org/apache/ace/client/rest/RESTClientTest.java:21: static import only from classes and interfaces
    [javac] import static org.apache.ace.test.utils.TestUtils.UNIT;
    [javac] ^
    [javac] /zonestorage/hudson_solaris/home/hudson/hudson-slave/workspace/ACE-trunk/org.apache.ace.client.rest/test/org/apache/ace/client/rest/RESTClientTest.java:30: cannot find symbol
    [javac] symbol  : variable UNIT
    [javac] location: class org.apache.ace.client.rest.RESTClientTest
    [javac] 	@Test(groups = { UNIT })
    [javac] 	                 ^
    [javac] 3 errors

BUILD FAILED
/zonestorage/hudson_solaris/home/hudson/hudson-slave/workspace/ACE-trunk/cnf/build.xml:39: The following error occurred while executing this line:
/zonestorage/hudson_solaris/home/hudson/hudson-slave/workspace/ACE-trunk/cnf/build-template.xml:106: Compile failed; see the compiler error output for details.

Total time: 7 minutes 1 second
Build step 'Invoke Ant' marked build as failure
Recording test results
TestNG Reports Processing: START
Looking for TestNG results report in workspace using pattern: **/testng/testng-results.xml
Saving reports...
Processing '/x1/jenkins/jenkins-home/jobs/ACE-trunk/builds/2014-02-18_18-35-29/testng/testng-results-1.xml'
Processing '/x1/jenkins/jenkins-home/jobs/ACE-trunk/builds/2014-02-18_18-35-29/testng/testng-results-10.xml'
Processing '/x1/jenkins/jenkins-home/jobs/ACE-trunk/builds/2014-02-18_18-35-29/testng/testng-results-11.xml'
Processing '/x1/jenkins/jenkins-home/jobs/ACE-trunk/builds/2014-02-18_18-35-29/testng/testng-results-12.xml'
Processing '/x1/jenkins/jenkins-home/jobs/ACE-trunk/builds/2014-02-18_18-35-29/testng/testng-results-13.xml'
Processing '/x1/jenkins/jenkins-home/jobs/ACE-trunk/builds/2014-02-18_18-35-29/testng/testng-results-14.xml'
Processing '/x1/jenkins/jenkins-home/jobs/ACE-trunk/builds/2014-02-18_18-35-29/testng/testng-results-2.xml'
Processing '/x1/jenkins/jenkins-home/jobs/ACE-trunk/builds/2014-02-18_18-35-29/testng/testng-results-3.xml'
Processing '/x1/jenkins/jenkins-home/jobs/ACE-trunk/builds/2014-02-18_18-35-29/testng/testng-results-4.xml'
Processing '/x1/jenkins/jenkins-home/jobs/ACE-trunk/builds/2014-02-18_18-35-29/testng/testng-results-5.xml'
Processing '/x1/jenkins/jenkins-home/jobs/ACE-trunk/builds/2014-02-18_18-35-29/testng/testng-results-6.xml'
Processing '/x1/jenkins/jenkins-home/jobs/ACE-trunk/builds/2014-02-18_18-35-29/testng/testng-results-7.xml'
Processing '/x1/jenkins/jenkins-home/jobs/ACE-trunk/builds/2014-02-18_18-35-29/testng/testng-results-8.xml'
Processing '/x1/jenkins/jenkins-home/jobs/ACE-trunk/builds/2014-02-18_18-35-29/testng/testng-results-9.xml'
Processing '/x1/jenkins/jenkins-home/jobs/ACE-trunk/builds/2014-02-18_18-35-29/testng/testng-results.xml'
TestNG Reports Processing: FINISH

Jenkins build is back to normal : ACE-trunk #202

Posted by Apache Jenkins Server <je...@builds.apache.org>.
See <https://builds.apache.org/job/ACE-trunk/202/changes>


Build failed in Jenkins: ACE-trunk #201

Posted by Apache Jenkins Server <je...@builds.apache.org>.
See <https://builds.apache.org/job/ACE-trunk/201/changes>

Changes:

[Jan Willem Janssen] ACE-456 - fixed failing itest:

- added missing workspace bundle + configuration;
- added additional assertion on createWorkspace to ensure that
  we've got a valid redirect. Otherwise, obscure NPEs will be
  thrown later in the test(s).

[marrs] ACE-460 Applied the patch. Thanks Herko.

[Jan Willem Janssen] ACE-461 - added additional concurrency tests for LogStoreImpl:

- also fixed Java7-style generics.

------------------------------------------
[...truncated 2721 lines...]
   [testng] 	at java.util.concurrent.ThreadPoolExecutor$Worker.run(ThreadPoolExecutor.java:908)
   [testng] 	at java.lang.Thread.run(Thread.java:662)
   [testng] java.io.IOException: Could not obtain a lock for the store 1 of target g3
   [testng] 	at org.apache.ace.log.server.store.impl.LogStoreImpl.obtainLock(LogStoreImpl.java:471)
   [testng] 	at org.apache.ace.log.server.store.impl.LogStoreImpl.put(LogStoreImpl.java:188)
   [testng] 	at org.apache.ace.log.server.store.impl.ServerLogStoreTester$1.run(ServerLogStoreTester.java:224)
   [testng] 	at java.util.concurrent.ThreadPoolExecutor$Worker.runTask(ThreadPoolExecutor.java:886)
   [testng] 	at java.util.concurrent.ThreadPoolExecutor$Worker.run(ThreadPoolExecutor.java:908)
   [testng] 	at java.lang.Thread.run(Thread.java:662)
   [testng] java.io.IOException: Could not obtain a lock for the store 1 of target g3
   [testng] 	at org.apache.ace.log.server.store.impl.LogStoreImpl.obtainLock(LogStoreImpl.java:471)
   [testng] 	at org.apache.ace.log.server.store.impl.LogStoreImpl.put(LogStoreImpl.java:188)
   [testng] 	at org.apache.ace.log.server.store.impl.ServerLogStoreTester$1.run(ServerLogStoreTester.java:224)
   [testng] 	at java.util.concurrent.ThreadPoolExecutor$Worker.runTask(ThreadPoolExecutor.java:886)
   [testng] 	at java.util.concurrent.ThreadPoolExecutor$Worker.run(ThreadPoolExecutor.java:908)
   [testng] 	at java.lang.Thread.run(Thread.java:662)
   [testng] java.io.IOException: Could not obtain a lock for the store 1 of target g3
   [testng] 	at org.apache.ace.log.server.store.impl.LogStoreImpl.obtainLock(LogStoreImpl.java:471)
   [testng] 	at org.apache.ace.log.server.store.impl.LogStoreImpl.put(LogStoreImpl.java:188)
   [testng] 	at org.apache.ace.log.server.store.impl.ServerLogStoreTester$1.run(ServerLogStoreTester.java:224)
   [testng] 	at java.util.concurrent.ThreadPoolExecutor$Worker.runTask(ThreadPoolExecutor.java:886)
   [testng] 	at java.util.concurrent.ThreadPoolExecutor$Worker.run(ThreadPoolExecutor.java:908)
   [testng] 	at java.lang.Thread.run(Thread.java:662)
   [testng] java.io.IOException: Could not obtain a lock for the store 1 of target g3
   [testng] 	at org.apache.ace.log.server.store.impl.LogStoreImpl.obtainLock(LogStoreImpl.java:471)
   [testng] 	at org.apache.ace.log.server.store.impl.LogStoreImpl.put(LogStoreImpl.java:188)
   [testng] 	at org.apache.ace.log.server.store.impl.ServerLogStoreTester$1.run(ServerLogStoreTester.java:224)
   [testng] 	at java.util.concurrent.ThreadPoolExecutor$Worker.runTask(ThreadPoolExecutor.java:886)
   [testng] 	at java.util.concurrent.ThreadPoolExecutor$Worker.run(ThreadPoolExecutor.java:908)
   [testng] 	at java.lang.Thread.run(Thread.java:662)
   [testng] java.io.IOException: Could not obtain a lock for the store 1 of target g3
   [testng] 	at org.apache.ace.log.server.store.impl.LogStoreImpl.obtainLock(LogStoreImpl.java:471)
   [testng] 	at org.apache.ace.log.server.store.impl.LogStoreImpl.put(LogStoreImpl.java:188)
   [testng] 	at org.apache.ace.log.server.store.impl.ServerLogStoreTester$1.run(ServerLogStoreTester.java:224)
   [testng] 	at java.util.concurrent.ThreadPoolExecutor$Worker.runTask(ThreadPoolExecutor.java:886)
   [testng] 	at java.util.concurrent.ThreadPoolExecutor$Worker.run(ThreadPoolExecutor.java:908)
   [testng] 	at java.lang.Thread.run(Thread.java:662)
   [testng] java.io.IOException: Could not obtain a lock for the store 1 of target g3
   [testng] 	at org.apache.ace.log.server.store.impl.LogStoreImpl.obtainLock(LogStoreImpl.java:471)
   [testng] 	at org.apache.ace.log.server.store.impl.LogStoreImpl.put(LogStoreImpl.java:188)
   [testng] 	at org.apache.ace.log.server.store.impl.ServerLogStoreTester$1.run(ServerLogStoreTester.java:224)
   [testng] 	at java.util.concurrent.ThreadPoolExecutor$Worker.runTask(ThreadPoolExecutor.java:886)
   [testng] 	at java.util.concurrent.ThreadPoolExecutor$Worker.run(ThreadPoolExecutor.java:908)
   [testng] 	at java.lang.Thread.run(Thread.java:662)
   [testng] java.io.IOException: Could not obtain a lock for the store 1 of target g3
   [testng] 	at org.apache.ace.log.server.store.impl.LogStoreImpl.obtainLock(LogStoreImpl.java:471)
   [testng] 	at org.apache.ace.log.server.store.impl.LogStoreImpl.put(LogStoreImpl.java:188)
   [testng] 	at org.apache.ace.log.server.store.impl.ServerLogStoreTester$1.run(ServerLogStoreTester.java:224)
   [testng] 	at java.util.concurrent.ThreadPoolExecutor$Worker.runTask(ThreadPoolExecutor.java:886)
   [testng] 	at java.util.concurrent.ThreadPoolExecutor$Worker.run(ThreadPoolExecutor.java:908)
   [testng] 	at java.lang.Thread.run(Thread.java:662)
   [testng] java.io.IOException: Could not obtain a lock for the store 1 of target g3
   [testng] 	at org.apache.ace.log.server.store.impl.LogStoreImpl.obtainLock(LogStoreImpl.java:471)
   [testng] 	at org.apache.ace.log.server.store.impl.LogStoreImpl.put(LogStoreImpl.java:188)
   [testng] 	at org.apache.ace.log.server.store.impl.ServerLogStoreTester$1.run(ServerLogStoreTester.java:224)
   [testng] 	at java.util.concurrent.ThreadPoolExecutor$Worker.runTask(ThreadPoolExecutor.java:886)
   [testng] 	at java.util.concurrent.ThreadPoolExecutor$Worker.run(ThreadPoolExecutor.java:908)
   [testng] 	at java.lang.Thread.run(Thread.java:662)
   [testng] java.io.IOException: Could not obtain a lock for the store 1 of target g3
   [testng] 	at org.apache.ace.log.server.store.impl.LogStoreImpl.obtainLock(LogStoreImpl.java:471)
   [testng] 	at org.apache.ace.log.server.store.impl.LogStoreImpl.put(LogStoreImpl.java:188)
   [testng] 	at org.apache.ace.log.server.store.impl.ServerLogStoreTester$1.run(ServerLogStoreTester.java:224)
   [testng] 	at java.util.concurrent.ThreadPoolExecutor$Worker.runTask(ThreadPoolExecutor.java:886)
   [testng] 	at java.util.concurrent.ThreadPoolExecutor$Worker.run(ThreadPoolExecutor.java:908)
   [testng] 	at java.lang.Thread.run(Thread.java:662)
   [testng] java.io.IOException: Could not obtain a lock for the store 1 of target g3
   [testng] 	at org.apache.ace.log.server.store.impl.LogStoreImpl.obtainLock(LogStoreImpl.java:471)
   [testng] 	at org.apache.ace.log.server.store.impl.LogStoreImpl.put(LogStoreImpl.java:188)
   [testng] 	at org.apache.ace.log.server.store.impl.ServerLogStoreTester$1.run(ServerLogStoreTester.java:224)
   [testng] 	at java.util.concurrent.ThreadPoolExecutor$Worker.runTask(ThreadPoolExecutor.java:886)
   [testng] 	at java.util.concurrent.ThreadPoolExecutor$Worker.run(ThreadPoolExecutor.java:908)
   [testng] 	at java.lang.Thread.run(Thread.java:662)
   [testng] java.io.IOException: Could not obtain a lock for the store 2 of target g3
   [testng] 	at org.apache.ace.log.server.store.impl.LogStoreImpl.obtainLock(LogStoreImpl.java:471)
   [testng] 	at org.apache.ace.log.server.store.impl.LogStoreImpl.put(LogStoreImpl.java:188)
   [testng] 	at org.apache.ace.log.server.store.impl.ServerLogStoreTester$1.run(ServerLogStoreTester.java:224)
   [testng] 	at java.util.concurrent.ThreadPoolExecutor$Worker.runTask(ThreadPoolExecutor.java:886)
   [testng] 	at java.util.concurrent.ThreadPoolExecutor$Worker.run(ThreadPoolExecutor.java:908)
   [testng] 	at java.lang.Thread.run(Thread.java:662)
   [testng] java.io.IOException: Could not obtain a lock for the store 2 of target g3
   [testng] 	at org.apache.ace.log.server.store.impl.LogStoreImpl.obtainLock(LogStoreImpl.java:471)
   [testng] 	at org.apache.ace.log.server.store.impl.LogStoreImpl.put(LogStoreImpl.java:188)
   [testng] 	at org.apache.ace.log.server.store.impl.ServerLogStoreTester$1.run(ServerLogStoreTester.java:224)
   [testng] 	at java.util.concurrent.ThreadPoolExecutor$Worker.runTask(ThreadPoolExecutor.java:886)
   [testng] 	at java.util.concurrent.ThreadPoolExecutor$Worker.run(ThreadPoolExecutor.java:908)
   [testng] 	at java.lang.Thread.run(Thread.java:662)
   [testng] java.io.IOException: Could not obtain a lock for the store 2 of target g3
   [testng] 	at org.apache.ace.log.server.store.impl.LogStoreImpl.obtainLock(LogStoreImpl.java:471)
   [testng] 	at org.apache.ace.log.server.store.impl.LogStoreImpl.put(LogStoreImpl.java:188)
   [testng] 	at org.apache.ace.log.server.store.impl.ServerLogStoreTester$1.run(ServerLogStoreTester.java:224)
   [testng] 	at java.util.concurrent.ThreadPoolExecutor$Worker.runTask(ThreadPoolExecutor.java:886)
   [testng] 	at java.util.concurrent.ThreadPoolExecutor$Worker.run(ThreadPoolExecutor.java:908)
   [testng] 	at java.lang.Thread.run(Thread.java:662)
   [testng] java.io.IOException: Could not obtain a lock for the store 2 of target g3
   [testng] 	at org.apache.ace.log.server.store.impl.LogStoreImpl.obtainLock(LogStoreImpl.java:471)
   [testng] 	at org.apache.ace.log.server.store.impl.LogStoreImpl.put(LogStoreImpl.java:188)
   [testng] 	at org.apache.ace.log.server.store.impl.ServerLogStoreTester$1.run(ServerLogStoreTester.java:224)
   [testng] 	at java.util.concurrent.ThreadPoolExecutor$Worker.runTask(ThreadPoolExecutor.java:886)
   [testng] 	at java.util.concurrent.ThreadPoolExecutor$Worker.run(ThreadPoolExecutor.java:908)
   [testng] 	at java.lang.Thread.run(Thread.java:662)
   [testng] java.io.IOException: Could not obtain a lock for the store 2 of target g3
   [testng] 	at org.apache.ace.log.server.store.impl.LogStoreImpl.obtainLock(LogStoreImpl.java:471)
   [testng] 	at org.apache.ace.log.server.store.impl.LogStoreImpl.put(LogStoreImpl.java:188)
   [testng] 	at org.apache.ace.log.server.store.impl.ServerLogStoreTester$1.run(ServerLogStoreTester.java:224)
   [testng] 	at java.util.concurrent.ThreadPoolExecutor$Worker.runTask(ThreadPoolExecutor.java:886)
   [testng] 	at java.util.concurrent.ThreadPoolExecutor$Worker.run(ThreadPoolExecutor.java:908)
   [testng] 	at java.lang.Thread.run(Thread.java:662)
   [testng] java.io.IOException: Could not obtain a lock for the store 2 of target g3
   [testng] 	at org.apache.ace.log.server.store.impl.LogStoreImpl.obtainLock(LogStoreImpl.java:471)
   [testng] 	at org.apache.ace.log.server.store.impl.LogStoreImpl.put(LogStoreImpl.java:188)
   [testng] 	at org.apache.ace.log.server.store.impl.ServerLogStoreTester$1.run(ServerLogStoreTester.java:224)
   [testng] 	at java.util.concurrent.ThreadPoolExecutor$Worker.runTask(ThreadPoolExecutor.java:886)
   [testng] 	at java.util.concurrent.ThreadPoolExecutor$Worker.run(ThreadPoolExecutor.java:908)
   [testng] 	at java.lang.Thread.run(Thread.java:662)
   [testng] java.io.IOException: Could not obtain a lock for the store 2 of target g3
   [testng] 	at org.apache.ace.log.server.store.impl.LogStoreImpl.obtainLock(LogStoreImpl.java:471)
   [testng] 	at org.apache.ace.log.server.store.impl.LogStoreImpl.put(LogStoreImpl.java:188)
   [testng] 	at org.apache.ace.log.server.store.impl.ServerLogStoreTester$1.run(ServerLogStoreTester.java:224)
   [testng] 	at java.util.concurrent.ThreadPoolExecutor$Worker.runTask(ThreadPoolExecutor.java:886)
   [testng] 	at java.util.concurrent.ThreadPoolExecutor$Worker.run(ThreadPoolExecutor.java:908)
   [testng] 	at java.lang.Thread.run(Thread.java:662)
   [testng] java.io.IOException: Could not obtain a lock for the store 2 of target g3
   [testng] 	at org.apache.ace.log.server.store.impl.LogStoreImpl.obtainLock(LogStoreImpl.java:471)
   [testng] 	at org.apache.ace.log.server.store.impl.LogStoreImpl.put(LogStoreImpl.java:188)
   [testng] 	at org.apache.ace.log.server.store.impl.ServerLogStoreTester$1.run(ServerLogStoreTester.java:224)
   [testng] 	at java.util.concurrent.ThreadPoolExecutor$Worker.runTask(ThreadPoolExecutor.java:886)
   [testng] 	at java.util.concurrent.ThreadPoolExecutor$Worker.run(ThreadPoolExecutor.java:908)
   [testng] 	at java.lang.Thread.run(Thread.java:662)
   [testng] java.io.IOException: Could not obtain a lock for the store 2 of target g3
   [testng] 	at org.apache.ace.log.server.store.impl.LogStoreImpl.obtainLock(LogStoreImpl.java:471)
   [testng] 	at org.apache.ace.log.server.store.impl.LogStoreImpl.put(LogStoreImpl.java:188)
   [testng] 	at org.apache.ace.log.server.store.impl.ServerLogStoreTester$1.run(ServerLogStoreTester.java:224)
   [testng] 	at java.util.concurrent.ThreadPoolExecutor$Worker.runTask(ThreadPoolExecutor.java:886)
   [testng] 	at java.util.concurrent.ThreadPoolExecutor$Worker.run(ThreadPoolExecutor.java:908)
   [testng] 	at java.lang.Thread.run(Thread.java:662)
   [testng] java.io.IOException: Could not obtain a lock for the store 2 of target g3
   [testng] 	at org.apache.ace.log.server.store.impl.LogStoreImpl.obtainLock(LogStoreImpl.java:471)
   [testng] 	at org.apache.ace.log.server.store.impl.LogStoreImpl.put(LogStoreImpl.java:188)
   [testng] 	at org.apache.ace.log.server.store.impl.ServerLogStoreTester$1.run(ServerLogStoreTester.java:224)
   [testng] 	at java.util.concurrent.ThreadPoolExecutor$Worker.runTask(ThreadPoolExecutor.java:886)
   [testng] 	at java.util.concurrent.ThreadPoolExecutor$Worker.run(ThreadPoolExecutor.java:908)
   [testng] 	at java.lang.Thread.run(Thread.java:662)
   [testng] java.io.IOException: Could not obtain a lock for the store 2 of target g3
   [testng] 	at org.apache.ace.log.server.store.impl.LogStoreImpl.obtainLock(LogStoreImpl.java:471)
   [testng] 	at org.apache.ace.log.server.store.impl.LogStoreImpl.put(LogStoreImpl.java:188)
   [testng] 	at org.apache.ace.log.server.store.impl.ServerLogStoreTester$1.run(ServerLogStoreTester.java:224)
   [testng] 	at java.util.concurrent.ThreadPoolExecutor$Worker.runTask(ThreadPoolExecutor.java:886)
   [testng] 	at java.util.concurrent.ThreadPoolExecutor$Worker.run(ThreadPoolExecutor.java:908)
   [testng] 	at java.lang.Thread.run(Thread.java:662)
   [testng] java.io.IOException: Could not obtain a lock for the store 2 of target g3
   [testng] 	at org.apache.ace.log.server.store.impl.LogStoreImpl.obtainLock(LogStoreImpl.java:471)
   [testng] 	at org.apache.ace.log.server.store.impl.LogStoreImpl.put(LogStoreImpl.java:188)
   [testng] 	at org.apache.ace.log.server.store.impl.ServerLogStoreTester$1.run(ServerLogStoreTester.java:224)
   [testng] 	at java.util.concurrent.ThreadPoolExecutor$Worker.runTask(ThreadPoolExecutor.java:886)
   [testng] 	at java.util.concurrent.ThreadPoolExecutor$Worker.run(ThreadPoolExecutor.java:908)
   [testng] 	at java.lang.Thread.run(Thread.java:662)
   [testng] java.io.IOException: Could not obtain a lock for the store 3 of target g3
   [testng] 	at org.apache.ace.log.server.store.impl.LogStoreImpl.obtainLock(LogStoreImpl.java:471)
   [testng] 	at org.apache.ace.log.server.store.impl.LogStoreImpl.put(LogStoreImpl.java:188)
   [testng] 	at org.apache.ace.log.server.store.impl.ServerLogStoreTester$1.run(ServerLogStoreTester.java:224)
   [testng] 	at java.util.concurrent.ThreadPoolExecutor$Worker.runTask(ThreadPoolExecutor.java:886)
   [testng] 	at java.util.concurrent.ThreadPoolExecutor$Worker.run(ThreadPoolExecutor.java:908)
   [testng] 	at java.lang.Thread.run(Thread.java:662)
   [testng] java.io.IOException: Could not obtain a lock for the store 3 of target g3
   [testng] 	at org.apache.ace.log.server.store.impl.LogStoreImpl.obtainLock(LogStoreImpl.java:471)
   [testng] 	at org.apache.ace.log.server.store.impl.LogStoreImpl.put(LogStoreImpl.java:188)
   [testng] 	at org.apache.ace.log.server.store.impl.ServerLogStoreTester$1.run(ServerLogStoreTester.java:224)
   [testng] 	at java.util.concurrent.ThreadPoolExecutor$Worker.runTask(ThreadPoolExecutor.java:886)
   [testng] 	at java.util.concurrent.ThreadPoolExecutor$Worker.run(ThreadPoolExecutor.java:908)
   [testng] 	at java.lang.Thread.run(Thread.java:662)
   [testng] java.io.IOException: Could not obtain a lock for the store 3 of target g3
   [testng] 	at org.apache.ace.log.server.store.impl.LogStoreImpl.obtainLock(LogStoreImpl.java:471)
   [testng] 	at org.apache.ace.log.server.store.impl.LogStoreImpl.put(LogStoreImpl.java:188)
   [testng] 	at org.apache.ace.log.server.store.impl.ServerLogStoreTester$1.run(ServerLogStoreTester.java:224)
   [testng] 	at java.util.concurrent.ThreadPoolExecutor$Worker.runTask(ThreadPoolExecutor.java:886)
   [testng] 	at java.util.concurrent.ThreadPoolExecutor$Worker.run(ThreadPoolExecutor.java:908)
   [testng] 	at java.lang.Thread.run(Thread.java:662)
   [testng] java.io.IOException: Could not obtain a lock for the store 5 of target g3
   [testng] 	at org.apache.ace.log.server.store.impl.LogStoreImpl.obtainLock(LogStoreImpl.java:471)
   [testng] 	at org.apache.ace.log.server.store.impl.LogStoreImpl.put(LogStoreImpl.java:188)
   [testng] 	at org.apache.ace.log.server.store.impl.ServerLogStoreTester$1.run(ServerLogStoreTester.java:224)
   [testng] 	at java.util.concurrent.ThreadPoolExecutor$Worker.runTask(ThreadPoolExecutor.java:886)
   [testng] 	at java.util.concurrent.ThreadPoolExecutor$Worker.run(ThreadPoolExecutor.java:908)
   [testng] 	at java.lang.Thread.run(Thread.java:662)
   [testng] java.io.IOException: Could not obtain a lock for the store 5 of target g3
   [testng] 	at org.apache.ace.log.server.store.impl.LogStoreImpl.obtainLock(LogStoreImpl.java:471)
   [testng] 	at org.apache.ace.log.server.store.impl.LogStoreImpl.put(LogStoreImpl.java:188)
   [testng] 	at org.apache.ace.log.server.store.impl.ServerLogStoreTester$1.run(ServerLogStoreTester.java:224)
   [testng] 	at java.util.concurrent.ThreadPoolExecutor$Worker.runTask(ThreadPoolExecutor.java:886)
   [testng] 	at java.util.concurrent.ThreadPoolExecutor$Worker.run(ThreadPoolExecutor.java:908)
   [testng] 	at java.lang.Thread.run(Thread.java:662)
   [testng] java.io.IOException: Could not obtain a lock for the store 5 of target g3
   [testng] 	at org.apache.ace.log.server.store.impl.LogStoreImpl.obtainLock(LogStoreImpl.java:471)
   [testng] 	at org.apache.ace.log.server.store.impl.LogStoreImpl.put(LogStoreImpl.java:188)
   [testng] 	at org.apache.ace.log.server.store.impl.ServerLogStoreTester$1.run(ServerLogStoreTester.java:224)
   [testng] 	at java.util.concurrent.ThreadPoolExecutor$Worker.runTask(ThreadPoolExecutor.java:886)
   [testng] 	at java.util.concurrent.ThreadPoolExecutor$Worker.run(ThreadPoolExecutor.java:908)
   [testng] 	at java.lang.Thread.run(Thread.java:662)
   [testng] java.io.IOException: Could not obtain a lock for the store 5 of target g3
   [testng] 	at org.apache.ace.log.server.store.impl.LogStoreImpl.obtainLock(LogStoreImpl.java:471)
   [testng] 	at org.apache.ace.log.server.store.impl.LogStoreImpl.put(LogStoreImpl.java:188)
   [testng] 	at org.apache.ace.log.server.store.impl.ServerLogStoreTester$1.run(ServerLogStoreTester.java:224)
   [testng] 	at java.util.concurrent.ThreadPoolExecutor$Worker.runTask(ThreadPoolExecutor.java:886)
   [testng] 	at java.util.concurrent.ThreadPoolExecutor$Worker.run(ThreadPoolExecutor.java:908)
   [testng] 	at java.lang.Thread.run(Thread.java:662)
   [testng] java.io.IOException: Could not obtain a lock for the store 5 of target g3
   [testng] 	at org.apache.ace.log.server.store.impl.LogStoreImpl.obtainLock(LogStoreImpl.java:471)
   [testng] 	at org.apache.ace.log.server.store.impl.LogStoreImpl.put(LogStoreImpl.java:188)
   [testng] 	at org.apache.ace.log.server.store.impl.ServerLogStoreTester$1.run(ServerLogStoreTester.java:224)
   [testng] 	at java.util.concurrent.ThreadPoolExecutor$Worker.runTask(ThreadPoolExecutor.java:886)
   [testng] 	at java.util.concurrent.ThreadPoolExecutor$Worker.run(ThreadPoolExecutor.java:908)
   [testng] 	at java.lang.Thread.run(Thread.java:662)
   [testng] java.io.IOException: Could not obtain a lock for the store 5 of target g3
   [testng] 	at org.apache.ace.log.server.store.impl.LogStoreImpl.obtainLock(LogStoreImpl.java:471)
   [testng] 	at org.apache.ace.log.server.store.impl.LogStoreImpl.put(LogStoreImpl.java:188)
   [testng] 	at org.apache.ace.log.server.store.impl.ServerLogStoreTester$1.run(ServerLogStoreTester.java:224)
   [testng] 	at java.util.concurrent.ThreadPoolExecutor$Worker.runTask(ThreadPoolExecutor.java:886)
   [testng] 	at java.util.concurrent.ThreadPoolExecutor$Worker.run(ThreadPoolExecutor.java:908)
   [testng] 	at java.lang.Thread.run(Thread.java:662)
   [testng] 
   [testng] ===============================================
   [testng] Ant suite
   [testng] Total tests run: 27, Failures: 1, Skips: 0
   [testng] ===============================================
   [testng] 

BUILD FAILED
/zonestorage/hudson_solaris/home/hudson/hudson-slave/workspace/ACE-trunk/cnf/build.xml:39: The following error occurred while executing this line:
/zonestorage/hudson_solaris/home/hudson/hudson-slave/workspace/ACE-trunk/cnf/build.xml:47: The tests failed.

Total time: 7 minutes 17 seconds
Build step 'Invoke Ant' marked build as failure
Recording test results
TestNG Reports Processing: START
Looking for TestNG results report in workspace using pattern: **/testng/testng-results.xml
Saving reports...
Processing '/x1/jenkins/jenkins-home/jobs/ACE-trunk/builds/2014-02-25_14-35-32/testng/testng-results-1.xml'
Processing '/x1/jenkins/jenkins-home/jobs/ACE-trunk/builds/2014-02-25_14-35-32/testng/testng-results-10.xml'
Processing '/x1/jenkins/jenkins-home/jobs/ACE-trunk/builds/2014-02-25_14-35-32/testng/testng-results-2.xml'
Processing '/x1/jenkins/jenkins-home/jobs/ACE-trunk/builds/2014-02-25_14-35-32/testng/testng-results-3.xml'
Processing '/x1/jenkins/jenkins-home/jobs/ACE-trunk/builds/2014-02-25_14-35-32/testng/testng-results-4.xml'
Processing '/x1/jenkins/jenkins-home/jobs/ACE-trunk/builds/2014-02-25_14-35-32/testng/testng-results-5.xml'
Processing '/x1/jenkins/jenkins-home/jobs/ACE-trunk/builds/2014-02-25_14-35-32/testng/testng-results-6.xml'
Processing '/x1/jenkins/jenkins-home/jobs/ACE-trunk/builds/2014-02-25_14-35-32/testng/testng-results-7.xml'
Processing '/x1/jenkins/jenkins-home/jobs/ACE-trunk/builds/2014-02-25_14-35-32/testng/testng-results-8.xml'
Processing '/x1/jenkins/jenkins-home/jobs/ACE-trunk/builds/2014-02-25_14-35-32/testng/testng-results-9.xml'
Processing '/x1/jenkins/jenkins-home/jobs/ACE-trunk/builds/2014-02-25_14-35-32/testng/testng-results.xml'
Failed Tests/Configs found. Marking build as UNSTABLE.
TestNG Reports Processing: FINISH

Build failed in Jenkins: ACE-trunk #200

Posted by Apache Jenkins Server <je...@builds.apache.org>.
See <https://builds.apache.org/job/ACE-trunk/200/changes>

Changes:

[marrs] ACE-461 Committed a fix (and did some reformatting), plus a test case.

------------------------------------------
[...truncated 1173 lines...]
    [javac] Note: Recompile with -Xlint:unchecked for details.
     [copy] Copying 2 files to /zonestorage/hudson_solaris/home/hudson/hudson-slave/workspace/ACE-trunk/org.apache.ace.scheduler/bin

build:

compileTests:
    [mkdir] Created dir: /zonestorage/hudson_solaris/home/hudson/hudson-slave/workspace/ACE-trunk/org.apache.ace.scheduler/bin_test
    [javac] Compiling 2 source files to /zonestorage/hudson_solaris/home/hudson/hudson-slave/workspace/ACE-trunk/org.apache.ace.scheduler/bin_test
    [javac] /zonestorage/hudson_solaris/home/hudson/hudson-slave/workspace/ACE-trunk/org.apache.ace.scheduler/test/org/apache/ace/scheduler/ExecuterTest.java
    [javac] /zonestorage/hudson_solaris/home/hudson/hudson-slave/workspace/ACE-trunk/org.apache.ace.scheduler/test/org/apache/ace/scheduler/SchedulerTest.java

testng:
    [mkdir] Created dir: /zonestorage/hudson_solaris/home/hudson/hudson-slave/workspace/ACE-trunk/org.apache.ace.scheduler/generated/testng
   [testng] [TestNG] Running:
   [testng]   Ant suite
   [testng] 
   [testng] 
   [testng] ===============================================
   [testng] Ant suite
   [testng] Total tests run: 10, Failures: 0, Skips: 0
   [testng] ===============================================
   [testng] 

template.init:
     [echo] Enter project org.apache.ace.repository

init:

dependencies:

compile:
    [javac] Compiling 17 source files to /zonestorage/hudson_solaris/home/hudson/hudson-slave/workspace/ACE-trunk/org.apache.ace.repository/bin
    [javac] /zonestorage/hudson_solaris/home/hudson/hudson-slave/workspace/ACE-trunk/org.apache.ace.repository/src/org/apache/ace/repository/Repository.java
    [javac] /zonestorage/hudson_solaris/home/hudson/hudson-slave/workspace/ACE-trunk/org.apache.ace.repository/src/org/apache/ace/repository/RepositoryReplication.java
    [javac] /zonestorage/hudson_solaris/home/hudson/hudson-slave/workspace/ACE-trunk/org.apache.ace.repository/src/org/apache/ace/repository/ext/BackupRepository.java
    [javac] /zonestorage/hudson_solaris/home/hudson/hudson-slave/workspace/ACE-trunk/org.apache.ace.repository/src/org/apache/ace/repository/ext/CachedRepository.java
    [javac] /zonestorage/hudson_solaris/home/hudson/hudson-slave/workspace/ACE-trunk/org.apache.ace.repository/src/org/apache/ace/repository/ext/impl/CachedRepositoryImpl.java
    [javac] /zonestorage/hudson_solaris/home/hudson/hudson-slave/workspace/ACE-trunk/org.apache.ace.repository/src/org/apache/ace/repository/ext/impl/FilebasedBackupRepository.java
    [javac] /zonestorage/hudson_solaris/home/hudson/hudson-slave/workspace/ACE-trunk/org.apache.ace.repository/src/org/apache/ace/repository/ext/impl/RemoteRepository.java
    [javac] /zonestorage/hudson_solaris/home/hudson/hudson-slave/workspace/ACE-trunk/org.apache.ace.repository/src/org/apache/ace/repository/impl/Activator.java
    [javac] /zonestorage/hudson_solaris/home/hudson/hudson-slave/workspace/ACE-trunk/org.apache.ace.repository/src/org/apache/ace/repository/impl/RepositoryFactory.java
    [javac] /zonestorage/hudson_solaris/home/hudson/hudson-slave/workspace/ACE-trunk/org.apache.ace.repository/src/org/apache/ace/repository/impl/RepositoryImpl.java
    [javac] /zonestorage/hudson_solaris/home/hudson/hudson-slave/workspace/ACE-trunk/org.apache.ace.repository/src/org/apache/ace/repository/impl/constants/RepositoryConstants.java
    [javac] /zonestorage/hudson_solaris/home/hudson/hudson-slave/workspace/ACE-trunk/org.apache.ace.repository/src/org/apache/ace/repository/servlet/Activator.java
    [javac] /zonestorage/hudson_solaris/home/hudson/hudson-slave/workspace/ACE-trunk/org.apache.ace.repository/src/org/apache/ace/repository/servlet/RepositoryReplicationServlet.java
    [javac] /zonestorage/hudson_solaris/home/hudson/hudson-slave/workspace/ACE-trunk/org.apache.ace.repository/src/org/apache/ace/repository/servlet/RepositoryServlet.java
    [javac] /zonestorage/hudson_solaris/home/hudson/hudson-slave/workspace/ACE-trunk/org.apache.ace.repository/src/org/apache/ace/repository/servlet/RepositoryServletBase.java
    [javac] /zonestorage/hudson_solaris/home/hudson/hudson-slave/workspace/ACE-trunk/org.apache.ace.repository/src/org/apache/ace/repository/task/Activator.java
    [javac] /zonestorage/hudson_solaris/home/hudson/hudson-slave/workspace/ACE-trunk/org.apache.ace.repository/src/org/apache/ace/repository/task/RepositoryReplicationTask.java
     [copy] Copying 5 files to /zonestorage/hudson_solaris/home/hudson/hudson-slave/workspace/ACE-trunk/org.apache.ace.repository/bin

build:

compileTests:
    [mkdir] Created dir: /zonestorage/hudson_solaris/home/hudson/hudson-slave/workspace/ACE-trunk/org.apache.ace.repository/bin_test
    [javac] Compiling 1 source file to /zonestorage/hudson_solaris/home/hudson/hudson-slave/workspace/ACE-trunk/org.apache.ace.repository/bin_test
    [javac] /zonestorage/hudson_solaris/home/hudson/hudson-slave/workspace/ACE-trunk/org.apache.ace.repository/test/org/apache/ace/repository/impl/RepositoryImplTest.java

testng:
    [mkdir] Created dir: /zonestorage/hudson_solaris/home/hudson/hudson-slave/workspace/ACE-trunk/org.apache.ace.repository/generated/testng
   [testng] [TestNG] Running:
   [testng]   Ant suite
   [testng] 
   [testng] 
   [testng] ===============================================
   [testng] Ant suite
   [testng] Total tests run: 19, Failures: 0, Skips: 0
   [testng] ===============================================
   [testng] 

template.init:
     [echo] Enter project org.apache.ace.deployment

init:

dependencies:

compile:
    [javac] Compiling 35 source files to /zonestorage/hudson_solaris/home/hudson/hudson-slave/workspace/ACE-trunk/org.apache.ace.deployment/bin
    [javac] /zonestorage/hudson_solaris/home/hudson/hudson-slave/workspace/ACE-trunk/org.apache.ace.deployment/src/org/apache/ace/deployment/Deployment.java
    [javac] /zonestorage/hudson_solaris/home/hudson/hudson-slave/workspace/ACE-trunk/org.apache.ace.deployment/src/org/apache/ace/deployment/deploymentadmin/Activator.java
    [javac] /zonestorage/hudson_solaris/home/hudson/hudson-slave/workspace/ACE-trunk/org.apache.ace.deployment/src/org/apache/ace/deployment/deploymentadmin/DeploymentAdminDeployer.java
    [javac] /zonestorage/hudson_solaris/home/hudson/hudson-slave/workspace/ACE-trunk/org.apache.ace.deployment/src/org/apache/ace/deployment/processor/DeploymentProcessor.java
    [javac] /zonestorage/hudson_solaris/home/hudson/hudson-slave/workspace/ACE-trunk/org.apache.ace.deployment/src/org/apache/ace/deployment/provider/ArtifactData.java
    [javac] /zonestorage/hudson_solaris/home/hudson/hudson-slave/workspace/ACE-trunk/org.apache.ace.deployment/src/org/apache/ace/deployment/provider/DeploymentProvider.java
    [javac] /zonestorage/hudson_solaris/home/hudson/hudson-slave/workspace/ACE-trunk/org.apache.ace.deployment/src/org/apache/ace/deployment/provider/OverloadedException.java
    [javac] /zonestorage/hudson_solaris/home/hudson/hudson-slave/workspace/ACE-trunk/org.apache.ace.deployment/src/org/apache/ace/deployment/provider/filebased/Activator.java
    [javac] /zonestorage/hudson_solaris/home/hudson/hudson-slave/workspace/ACE-trunk/org.apache.ace.deployment/src/org/apache/ace/deployment/provider/filebased/FileBasedProvider.java
    [javac] /zonestorage/hudson_solaris/home/hudson/hudson-slave/workspace/ACE-trunk/org.apache.ace.deployment/src/org/apache/ace/deployment/provider/impl/ArtifactDataImpl.java
    [javac] /zonestorage/hudson_solaris/home/hudson/hudson-slave/workspace/ACE-trunk/org.apache.ace.deployment/src/org/apache/ace/deployment/provider/repositorybased/Activator.java
    [javac] /zonestorage/hudson_solaris/home/hudson/hudson-slave/workspace/ACE-trunk/org.apache.ace.deployment/src/org/apache/ace/deployment/provider/repositorybased/BaseRepositoryHandler.java
    [javac] /zonestorage/hudson_solaris/home/hudson/hudson-slave/workspace/ACE-trunk/org.apache.ace.deployment/src/org/apache/ace/deployment/provider/repositorybased/DeploymentArtifactCollector.java
    [javac] /zonestorage/hudson_solaris/home/hudson/hudson-slave/workspace/ACE-trunk/org.apache.ace.deployment/src/org/apache/ace/deployment/provider/repositorybased/DeploymentPackageVersionCollector.java
    [javac] /zonestorage/hudson_solaris/home/hudson/hudson-slave/workspace/ACE-trunk/org.apache.ace.deployment/src/org/apache/ace/deployment/provider/repositorybased/LRUMap.java
    [javac] /zonestorage/hudson_solaris/home/hudson/hudson-slave/workspace/ACE-trunk/org.apache.ace.deployment/src/org/apache/ace/deployment/provider/repositorybased/RepositoryBasedProvider.java
    [javac] /zonestorage/hudson_solaris/home/hudson/hudson-slave/workspace/ACE-trunk/org.apache.ace.deployment/src/org/apache/ace/deployment/service/DeploymentService.java
    [javac] /zonestorage/hudson_solaris/home/hudson/hudson-slave/workspace/ACE-trunk/org.apache.ace.deployment/src/org/apache/ace/deployment/service/impl/Activator.java
    [javac] /zonestorage/hudson_solaris/home/hudson/hudson-slave/workspace/ACE-trunk/org.apache.ace.deployment/src/org/apache/ace/deployment/service/impl/DeploymentServiceImpl.java
    [javac] /zonestorage/hudson_solaris/home/hudson/hudson-slave/workspace/ACE-trunk/org.apache.ace.deployment/src/org/apache/ace/deployment/servlet/AceRestException.java
    [javac] /zonestorage/hudson_solaris/home/hudson/hudson-slave/workspace/ACE-trunk/org.apache.ace.deployment/src/org/apache/ace/deployment/servlet/Activator.java
    [javac] /zonestorage/hudson_solaris/home/hudson/hudson-slave/workspace/ACE-trunk/org.apache.ace.deployment/src/org/apache/ace/deployment/servlet/AgentDeploymentServlet.java
    [javac] /zonestorage/hudson_solaris/home/hudson/hudson-slave/workspace/ACE-trunk/org.apache.ace.deployment/src/org/apache/ace/deployment/servlet/ContentRangeResponseWrapper.java
    [javac] /zonestorage/hudson_solaris/home/hudson/hudson-slave/workspace/ACE-trunk/org.apache.ace.deployment/src/org/apache/ace/deployment/servlet/DefaultDeploymentProcessor.java
    [javac] /zonestorage/hudson_solaris/home/hudson/hudson-slave/workspace/ACE-trunk/org.apache.ace.deployment/src/org/apache/ace/deployment/servlet/DeploymentServlet.java
    [javac] /zonestorage/hudson_solaris/home/hudson/hudson-slave/workspace/ACE-trunk/org.apache.ace.deployment/src/org/apache/ace/deployment/servlet/OverloadedFilter.java
    [javac] /zonestorage/hudson_solaris/home/hudson/hudson-slave/workspace/ACE-trunk/org.apache.ace.deployment/src/org/apache/ace/deployment/streamgenerator/StreamGenerator.java
    [javac] /zonestorage/hudson_solaris/home/hudson/hudson-slave/workspace/ACE-trunk/org.apache.ace.deployment/src/org/apache/ace/deployment/streamgenerator/impl/Activator.java
    [javac] /zonestorage/hudson_solaris/home/hudson/hudson-slave/workspace/ACE-trunk/org.apache.ace.deployment/src/org/apache/ace/deployment/streamgenerator/impl/StreamGeneratorImpl.java
    [javac] /zonestorage/hudson_solaris/home/hudson/hudson-slave/workspace/ACE-trunk/org.apache.ace.deployment/src/org/apache/ace/deployment/task/Activator.java
    [javac] /zonestorage/hudson_solaris/home/hudson/hudson-slave/workspace/ACE-trunk/org.apache.ace.deployment/src/org/apache/ace/deployment/task/DeploymentCheckTask.java
    [javac] /zonestorage/hudson_solaris/home/hudson/hudson-slave/workspace/ACE-trunk/org.apache.ace.deployment/src/org/apache/ace/deployment/task/DeploymentUpdateTask.java
    [javac] /zonestorage/hudson_solaris/home/hudson/hudson-slave/workspace/ACE-trunk/org.apache.ace.deployment/src/org/apache/ace/deployment/util/test/BundleStreamGenerator.java
    [javac] /zonestorage/hudson_solaris/home/hudson/hudson-slave/workspace/ACE-trunk/org.apache.ace.deployment/src/org/apache/ace/deployment/util/test/TestData.java
    [javac] /zonestorage/hudson_solaris/home/hudson/hudson-slave/workspace/ACE-trunk/org.apache.ace.deployment/src/org/apache/ace/deployment/util/test/TestProvider.java
    [javac] Note: Some input files use unchecked or unsafe operations.
    [javac] Note: Recompile with -Xlint:unchecked for details.
     [copy] Copying 7 files to /zonestorage/hudson_solaris/home/hudson/hudson-slave/workspace/ACE-trunk/org.apache.ace.deployment/bin

build:

compileTests:
    [mkdir] Created dir: /zonestorage/hudson_solaris/home/hudson/hudson-slave/workspace/ACE-trunk/org.apache.ace.deployment/bin_test
    [javac] Compiling 11 source files to /zonestorage/hudson_solaris/home/hudson/hudson-slave/workspace/ACE-trunk/org.apache.ace.deployment/bin_test
    [javac] /zonestorage/hudson_solaris/home/hudson/hudson-slave/workspace/ACE-trunk/org.apache.ace.deployment/test/org/apache/ace/deployment/DeploymentTest.java
    [javac] /zonestorage/hudson_solaris/home/hudson/hudson-slave/workspace/ACE-trunk/org.apache.ace.deployment/test/org/apache/ace/deployment/provider/filebased/FileBasedProviderTest.java
    [javac] /zonestorage/hudson_solaris/home/hudson/hudson-slave/workspace/ACE-trunk/org.apache.ace.deployment/test/org/apache/ace/deployment/provider/repositorybased/BaseRepositoryHandlerTest.java
    [javac] /zonestorage/hudson_solaris/home/hudson/hudson-slave/workspace/ACE-trunk/org.apache.ace.deployment/test/org/apache/ace/deployment/provider/repositorybased/CacheTest.java
    [javac] /zonestorage/hudson_solaris/home/hudson/hudson-slave/workspace/ACE-trunk/org.apache.ace.deployment/test/org/apache/ace/deployment/provider/repositorybased/MockDeploymentRepository.java
    [javac] /zonestorage/hudson_solaris/home/hudson/hudson-slave/workspace/ACE-trunk/org.apache.ace.deployment/test/org/apache/ace/deployment/provider/repositorybased/RepositoryBasedProviderConcurrencyTest.java
    [javac] /zonestorage/hudson_solaris/home/hudson/hudson-slave/workspace/ACE-trunk/org.apache.ace.deployment/test/org/apache/ace/deployment/provider/repositorybased/RepositoryBasedProviderPerformanceTest.java
    [javac] /zonestorage/hudson_solaris/home/hudson/hudson-slave/workspace/ACE-trunk/org.apache.ace.deployment/test/org/apache/ace/deployment/provider/repositorybased/RepositoryBasedProviderTest.java
    [javac] /zonestorage/hudson_solaris/home/hudson/hudson-slave/workspace/ACE-trunk/org.apache.ace.deployment/test/org/apache/ace/deployment/service/impl/DeploymentServiceImplTest.java
    [javac] /zonestorage/hudson_solaris/home/hudson/hudson-slave/workspace/ACE-trunk/org.apache.ace.deployment/test/org/apache/ace/deployment/servlet/DeploymentServletTest.java
    [javac] /zonestorage/hudson_solaris/home/hudson/hudson-slave/workspace/ACE-trunk/org.apache.ace.deployment/test/org/apache/ace/deployment/streamgenerator/impl/StreamTest.java

testng:
    [mkdir] Created dir: /zonestorage/hudson_solaris/home/hudson/hudson-slave/workspace/ACE-trunk/org.apache.ace.deployment/generated/testng
   [testng] [TestNG] Running:
   [testng]   Ant suite
   [testng] 
   [testng] Feb 25, 2014 11:50:33 AM org.ops4j.pax.swissbox.tinybundles.core.metadata.RawBuilder$1 run
   [testng] INFO: Copy thread finished.
   [testng] 
   [testng] ===============================================
   [testng] Ant suite
   [testng] Total tests run: 76, Failures: 0, Skips: 0
   [testng] ===============================================
   [testng] 

template.init:
     [echo] Enter project org.apache.ace.http

init:

dependencies:

compile:
    [javac] Compiling 4 source files to /zonestorage/hudson_solaris/home/hudson/hudson-slave/workspace/ACE-trunk/org.apache.ace.http/bin
    [javac] /zonestorage/hudson_solaris/home/hudson/hudson-slave/workspace/ACE-trunk/org.apache.ace.http/src/org/apache/ace/http/listener/Activator.java
    [javac] /zonestorage/hudson_solaris/home/hudson/hudson-slave/workspace/ACE-trunk/org.apache.ace.http/src/org/apache/ace/http/listener/constants/HttpConstants.java
    [javac] /zonestorage/hudson_solaris/home/hudson/hudson-slave/workspace/ACE-trunk/org.apache.ace.http/src/org/apache/ace/http/redirector/Activator.java
    [javac] /zonestorage/hudson_solaris/home/hudson/hudson-slave/workspace/ACE-trunk/org.apache.ace.http/src/org/apache/ace/http/redirector/RedirectServlet.java
     [copy] Copying 1 file to /zonestorage/hudson_solaris/home/hudson/hudson-slave/workspace/ACE-trunk/org.apache.ace.http/bin

build:

compileTests:
    [mkdir] Created dir: /zonestorage/hudson_solaris/home/hudson/hudson-slave/workspace/ACE-trunk/org.apache.ace.http/bin_test

testng:

template.init:
     [echo] Enter project org.apache.ace.log

init:

dependencies:

compile:
    [javac] Compiling 24 source files to /zonestorage/hudson_solaris/home/hudson/hudson-slave/workspace/ACE-trunk/org.apache.ace.log/bin
    [javac] /zonestorage/hudson_solaris/home/hudson/hudson-slave/workspace/ACE-trunk/org.apache.ace.log/src/org/apache/ace/log/Log.java
    [javac] /zonestorage/hudson_solaris/home/hudson/hudson-slave/workspace/ACE-trunk/org.apache.ace.log/src/org/apache/ace/log/LogSync.java
    [javac] /zonestorage/hudson_solaris/home/hudson/hudson-slave/workspace/ACE-trunk/org.apache.ace.log/src/org/apache/ace/log/listener/Activator.java
    [javac] /zonestorage/hudson_solaris/home/hudson/hudson-slave/workspace/ACE-trunk/org.apache.ace.log/src/org/apache/ace/log/listener/ListenerImpl.java
    [javac] /zonestorage/hudson_solaris/home/hudson/hudson-slave/workspace/ACE-trunk/org.apache.ace.log/src/org/apache/ace/log/listener/LogCache.java
    [javac] /zonestorage/hudson_solaris/home/hudson/hudson-slave/workspace/ACE-trunk/org.apache.ace.log/src/org/apache/ace/log/listener/LogProxy.java
    [javac] /zonestorage/hudson_solaris/home/hudson/hudson-slave/workspace/ACE-trunk/org.apache.ace.log/src/org/apache/ace/log/listener/LogTracker.java
    [javac] /zonestorage/hudson_solaris/home/hudson/hudson-slave/workspace/ACE-trunk/org.apache.ace.log/src/org/apache/ace/log/server/servlet/Activator.java
    [javac] /zonestorage/hudson_solaris/home/hudson/hudson-slave/workspace/ACE-trunk/org.apache.ace.log/src/org/apache/ace/log/server/servlet/LogServlet.java
    [javac] /zonestorage/hudson_solaris/home/hudson/hudson-slave/workspace/ACE-trunk/org.apache.ace.log/src/org/apache/ace/log/server/store/LogStore.java
    [javac] /zonestorage/hudson_solaris/home/hudson/hudson-slave/workspace/ACE-trunk/org.apache.ace.log/src/org/apache/ace/log/server/store/impl/Activator.java
    [javac] /zonestorage/hudson_solaris/home/hudson/hudson-slave/workspace/ACE-trunk/org.apache.ace.log/src/org/apache/ace/log/server/store/impl/LogStoreImpl.java
    [javac] /zonestorage/hudson_solaris/home/hudson/hudson-slave/workspace/ACE-trunk/org.apache.ace.log/src/org/apache/ace/log/server/store/mongo/Activator.java
    [javac] /zonestorage/hudson_solaris/home/hudson/hudson-slave/workspace/ACE-trunk/org.apache.ace.log/src/org/apache/ace/log/server/store/mongo/MongoLogStore.java
    [javac] /zonestorage/hudson_solaris/home/hudson/hudson-slave/workspace/ACE-trunk/org.apache.ace.log/src/org/apache/ace/log/server/task/Activator.java
    [javac] /zonestorage/hudson_solaris/home/hudson/hudson-slave/workspace/ACE-trunk/org.apache.ace.log/src/org/apache/ace/log/server/task/LogSyncTask.java
    [javac] /zonestorage/hudson_solaris/home/hudson/hudson-slave/workspace/ACE-trunk/org.apache.ace.log/src/org/apache/ace/log/target/Activator.java
    [javac] /zonestorage/hudson_solaris/home/hudson/hudson-slave/workspace/ACE-trunk/org.apache.ace.log/src/org/apache/ace/log/target/LogConfigurator.java
    [javac] /zonestorage/hudson_solaris/home/hudson/hudson-slave/workspace/ACE-trunk/org.apache.ace.log/src/org/apache/ace/log/target/LogImpl.java
    [javac] /zonestorage/hudson_solaris/home/hudson/hudson-slave/workspace/ACE-trunk/org.apache.ace.log/src/org/apache/ace/log/target/LogSyncConfigurator.java
    [javac] /zonestorage/hudson_solaris/home/hudson/hudson-slave/workspace/ACE-trunk/org.apache.ace.log/src/org/apache/ace/log/target/store/LogStore.java
    [javac] /zonestorage/hudson_solaris/home/hudson/hudson-slave/workspace/ACE-trunk/org.apache.ace.log/src/org/apache/ace/log/target/store/impl/Activator.java
    [javac] /zonestorage/hudson_solaris/home/hudson/hudson-slave/workspace/ACE-trunk/org.apache.ace.log/src/org/apache/ace/log/target/store/impl/LogStoreImpl.java
    [javac] /zonestorage/hudson_solaris/home/hudson/hudson-slave/workspace/ACE-trunk/org.apache.ace.log/src/org/apache/ace/log/target/task/LogSyncTask.java
    [javac] Note: Some input files use unchecked or unsafe operations.
    [javac] Note: Recompile with -Xlint:unchecked for details.
     [copy] Copying 3 files to /zonestorage/hudson_solaris/home/hudson/hudson-slave/workspace/ACE-trunk/org.apache.ace.log/bin
     [copy] Copied 1 empty directory to 1 empty directory under /zonestorage/hudson_solaris/home/hudson/hudson-slave/workspace/ACE-trunk/org.apache.ace.log/bin

build:

compileTests:
    [mkdir] Created dir: /zonestorage/hudson_solaris/home/hudson/hudson-slave/workspace/ACE-trunk/org.apache.ace.log/bin_test
    [javac] Compiling 9 source files to /zonestorage/hudson_solaris/home/hudson/hudson-slave/workspace/ACE-trunk/org.apache.ace.log/bin_test
    [javac] /zonestorage/hudson_solaris/home/hudson/hudson-slave/workspace/ACE-trunk/org.apache.ace.log/test/org/apache/ace/log/LogDescriptorTest.java
    [javac] /zonestorage/hudson_solaris/home/hudson/hudson-slave/workspace/ACE-trunk/org.apache.ace.log/test/org/apache/ace/log/LogEventTest.java
    [javac] /zonestorage/hudson_solaris/home/hudson/hudson-slave/workspace/ACE-trunk/org.apache.ace.log/test/org/apache/ace/log/listener/LogTest.java
    [javac] /zonestorage/hudson_solaris/home/hudson/hudson-slave/workspace/ACE-trunk/org.apache.ace.log/test/org/apache/ace/log/listener/MockLog.java
    [javac] /zonestorage/hudson_solaris/home/hudson/hudson-slave/workspace/ACE-trunk/org.apache.ace.log/test/org/apache/ace/log/server/servlet/LogServletTest.java
    [javac] /zonestorage/hudson_solaris/home/hudson/hudson-slave/workspace/ACE-trunk/org.apache.ace.log/test/org/apache/ace/log/server/store/impl/ServerLogStoreTester.java
    [javac] /zonestorage/hudson_solaris/home/hudson/hudson-slave/workspace/ACE-trunk/org.apache.ace.log/test/org/apache/ace/log/server/task/LogTaskTest.java
    [javac] /zonestorage/hudson_solaris/home/hudson/hudson-slave/workspace/ACE-trunk/org.apache.ace.log/test/org/apache/ace/log/target/store/impl/GatewayLogStoreTest.java
    [javac] /zonestorage/hudson_solaris/home/hudson/hudson-slave/workspace/ACE-trunk/org.apache.ace.log/test/org/apache/ace/log/target/task/LogSyncTaskTest.java
    [javac] /zonestorage/hudson_solaris/home/hudson/hudson-slave/workspace/ACE-trunk/org.apache.ace.log/test/org/apache/ace/log/server/store/impl/ServerLogStoreTester.java:221: illegal start of type
    [javac]                             List<Event> list = new ArrayList<>();
    [javac]                                                              ^
    [javac] 1 error

BUILD FAILED
/zonestorage/hudson_solaris/home/hudson/hudson-slave/workspace/ACE-trunk/cnf/build.xml:39: The following error occurred while executing this line:
/zonestorage/hudson_solaris/home/hudson/hudson-slave/workspace/ACE-trunk/cnf/build-template.xml:106: Compile failed; see the compiler error output for details.

Total time: 6 minutes 24 seconds
Build step 'Invoke Ant' marked build as failure
Recording test results
TestNG Reports Processing: START
Looking for TestNG results report in workspace using pattern: **/testng/testng-results.xml
Saving reports...
Processing '/x1/jenkins/jenkins-home/jobs/ACE-trunk/builds/2014-02-25_11-35-38/testng/testng-results-1.xml'
Processing '/x1/jenkins/jenkins-home/jobs/ACE-trunk/builds/2014-02-25_11-35-38/testng/testng-results-2.xml'
Processing '/x1/jenkins/jenkins-home/jobs/ACE-trunk/builds/2014-02-25_11-35-38/testng/testng-results-3.xml'
Processing '/x1/jenkins/jenkins-home/jobs/ACE-trunk/builds/2014-02-25_11-35-38/testng/testng-results-4.xml'
Processing '/x1/jenkins/jenkins-home/jobs/ACE-trunk/builds/2014-02-25_11-35-38/testng/testng-results-5.xml'
Processing '/x1/jenkins/jenkins-home/jobs/ACE-trunk/builds/2014-02-25_11-35-38/testng/testng-results-6.xml'
Processing '/x1/jenkins/jenkins-home/jobs/ACE-trunk/builds/2014-02-25_11-35-38/testng/testng-results-7.xml'
Processing '/x1/jenkins/jenkins-home/jobs/ACE-trunk/builds/2014-02-25_11-35-38/testng/testng-results-8.xml'
Processing '/x1/jenkins/jenkins-home/jobs/ACE-trunk/builds/2014-02-25_11-35-38/testng/testng-results-9.xml'
Processing '/x1/jenkins/jenkins-home/jobs/ACE-trunk/builds/2014-02-25_11-35-38/testng/testng-results.xml'
TestNG Reports Processing: FINISH

Build failed in Jenkins: ACE-trunk #199

Posted by Apache Jenkins Server <je...@builds.apache.org>.
See <https://builds.apache.org/job/ACE-trunk/199/changes>

Changes:

[marrs] ACE-347 Removed the old launcher project, as it is no longer used.

------------------------------------------
[...truncated 3792 lines...]
  [bndtest]  * Mon Feb 24 09:53:01 GMT+00:00 2014 - BundleEvent STARTED - 24 - null
  [bndtest]  * Mon Feb 24 09:53:01 GMT+00:00 2014 - BundleEvent STARTED - 23 - null
  [bndtest]  * Mon Feb 24 09:53:01 GMT+00:00 2014 - BundleEvent STARTED - 22 - null
  [bndtest]  * Mon Feb 24 09:53:01 GMT+00:00 2014 - BundleEvent STARTED - 21 - null
  [bndtest]  * Mon Feb 24 09:53:01 GMT+00:00 2014 - ServiceEvent REGISTERED - 21 - null
  [bndtest]  * Mon Feb 24 09:53:01 GMT+00:00 2014 - BundleEvent STARTED - 20 - null
  [bndtest]  * Mon Feb 24 09:53:01 GMT+00:00 2014 - ServiceEvent REGISTERED - 20 - null
  [bndtest]  * Mon Feb 24 09:53:01 GMT+00:00 2014 - BundleEvent STARTED - 19 - null
  [bndtest]  * Mon Feb 24 09:53:01 GMT+00:00 2014 - BundleEvent STARTED - 18 - null
  [bndtest]  * Mon Feb 24 09:53:01 GMT+00:00 2014 - Unable to register servlet with endpoint 'null' - 18 - null
  [bndtest]  * Mon Feb 24 09:53:01 GMT+00:00 2014 - BundleEvent STARTED - 17 - null
  [bndtest]  * Mon Feb 24 09:53:01 GMT+00:00 2014 - BundleEvent STARTED - 16 - null
  [bndtest]  * Mon Feb 24 09:53:01 GMT+00:00 2014 - ServiceEvent REGISTERED - 16 - null
  [bndtest]  * Mon Feb 24 09:53:01 GMT+00:00 2014 - ServiceEvent REGISTERED - 16 - null
  [bndtest]  * Mon Feb 24 09:53:01 GMT+00:00 2014 - ServiceEvent REGISTERED - 16 - null
  [bndtest]  * Mon Feb 24 09:53:01 GMT+00:00 2014 - ServiceEvent REGISTERED - 16 - null
  [bndtest]  * Mon Feb 24 09:53:01 GMT+00:00 2014 - ServiceEvent REGISTERED - 16 - null
  [bndtest]  * Mon Feb 24 09:53:01 GMT+00:00 2014 - ServiceEvent REGISTERED - 7 - null
  [bndtest]  * Mon Feb 24 09:53:01 GMT+00:00 2014 - ServiceEvent REGISTERED - 7 - null
  [bndtest]  * Mon Feb 24 09:53:01 GMT+00:00 2014 - ServiceEvent REGISTERED - 16 - null
  [bndtest]  * Mon Feb 24 09:53:01 GMT+00:00 2014 - BundleEvent STARTED - 15 - null
  [bndtest]  * Mon Feb 24 09:53:01 GMT+00:00 2014 - ServiceEvent REGISTERED - 15 - null
  [bndtest]  * Mon Feb 24 09:53:01 GMT+00:00 2014 - ServiceEvent REGISTERED - 15 - null
  [bndtest]  * Mon Feb 24 09:53:01 GMT+00:00 2014 - BundleEvent STARTED - 14 - null
  [bndtest]  * Mon Feb 24 09:53:01 GMT+00:00 2014 - ServiceEvent REGISTERED - 14 - null
  [bndtest]  * Mon Feb 24 09:53:01 GMT+00:00 2014 - ServiceEvent REGISTERED - 14 - null
  [bndtest]  * Mon Feb 24 09:53:01 GMT+00:00 2014 - ServiceEvent REGISTERED - 14 - null
  [bndtest]  * Mon Feb 24 09:53:01 GMT+00:00 2014 - ServiceEvent REGISTERED - 14 - null
  [bndtest]  * Mon Feb 24 09:53:01 GMT+00:00 2014 - BundleEvent STARTED - 13 - null
  [bndtest]  * Mon Feb 24 09:53:01 GMT+00:00 2014 - ServiceEvent REGISTERED - 13 - null
  [bndtest]  * Mon Feb 24 09:53:01 GMT+00:00 2014 - ServiceEvent REGISTERED - 13 - null
  [bndtest]  * [0] 32 - org.apache.felix.framework 4.2.1
  [bndtest]  * [1] 32 - osgi.cmpn 4.3.1.201210102024
  [bndtest]  * [2] 32 - com.sun.jersey.client 1.13.0
  [bndtest]  * [3] 32 - com.sun.jersey.core 1.13.0
  [bndtest]  * [4] 32 - org.apache.felix.dependencymanager 3.1.0
  [bndtest]  * [5] 32 - org.apache.felix.configadmin 1.8.0
  [bndtest]  * [6] 32 - org.apache.felix.eventadmin 1.2.14
  [bndtest]  * [7] 32 - org.apache.felix.http.jetty 2.2.2
  [bndtest]  * [8] 32 - org.apache.felix.dependencymanager.shell 3.0.1
  [bndtest]  * [9] 32 - org.apache.felix.deploymentadmin 0.9.5
  [bndtest]  * [10] 32 - org.apache.felix.prefs 1.0.4
  [bndtest]  * [11] 32 - org.apache.felix.useradmin 1.0.3
  [bndtest]  * [12] 32 - org.apache.felix.useradmin.filestore 1.0.2
  [bndtest]  * [13] 32 - org.apache.felix.log 1.0.1
  [bndtest]  * [14] 32 - org.apache.felix.gogo.command 0.12.0
  [bndtest]  * [15] 32 - org.apache.felix.gogo.runtime 0.10.0
  [bndtest]  * [16] 32 - org.apache.felix.gogo.shell 0.10.0
  [bndtest]  * [17] 32 - org.apache.ace.test 1.0.0
  [bndtest]  * [18] 32 - org.apache.ace.http.listener 1.0.0
  [bndtest]  * [19] 32 - org.apache.ace.authentication.api 1.0.0
  [bndtest]  * [20] 32 - org.apache.ace.connectionfactory 1.0.0
  [bndtest]  * [21] 32 - org.apache.ace.scheduler.impl 1.0.0
  [bndtest]  * [22] 32 - org.apache.ace.scheduler.api 1.0.0
  [bndtest]  * [23] 32 - org.apache.ace.deployment.provider.api 1.0.0
  [bndtest]  * [24] 32 - org.apache.ace.discovery.api 1.0.0
  [bndtest]  * [25] 32 - org.apache.ace.discovery.property 1.0.0
  [bndtest]  * [26] 32 - org.apache.ace.identification.api 1.0.0
  [bndtest]  * [27] 32 - org.apache.ace.identification.property 1.0.0
  [bndtest]  * [28] 32 - org.apache.ace.deployment.api 1.0.0
  [bndtest]  * [29] 32 - org.apache.ace.deployment.deploymentadmin 1.0.0
  [bndtest]  * [30] 32 - org.apache.ace.deployment.servlet 1.0.0
  [bndtest]  * [31] 32 - org.apache.ace.deployment.streamgenerator 1.0.0
  [bndtest]  * [32] 32 - org.apache.ace.deployment.provider.base 1.0.0
  [bndtest]  * [33] 32 - org.apache.ace.range.api 1.0.0
  [bndtest]  * [34] 32 - org.apache.ace.log.api 1.0.0
  [bndtest]  * [35] 32 - org.apache.ace.log.server.store.api 1.0.0
  [bndtest]  * [36] 32 - org.apache.ace.log.server.store.file 1.0.0
  [bndtest]  * [37] 32 - org.apache.ace.repository.api 1.0.0
  [bndtest]  * [38] 32 - org.apache.ace.repository.impl 1.0.0
  [bndtest]  * [39] 32 - org.apache.ace.repository.servlet 1.0.0
  [bndtest]  * [40] 32 - org.apache.ace.obr.metadata 1.0.0
  [bndtest]  * [41] 32 - org.apache.ace.obr.servlet 1.0.0
  [bndtest]  * [42] 32 - org.apache.ace.obr.storage 1.0.0
  [bndtest]  * [43] 32 - org.apache.ace.client.repository.api 1.0.0
  [bndtest]  * [44] 32 - org.apache.ace.client.repository.helper.base 1.0.0
  [bndtest]  * [45] 32 - org.apache.ace.client.repository.helper.bundle 1.0.0
  [bndtest]  * [46] 32 - org.apache.ace.client.repository.helper.configuration 1.0.0
  [bndtest]  * [47] 32 - org.apache.ace.client.repository.impl 1.0.0
  [bndtest]  * [48] 32 - org.apache.ace.deployment.provider.repositorybased 1.0.0
  [bndtest]  * [49] 2 - org.apache.ace.client.rest 1.0.0
  [bndtest]  * [50] 32 - org.apache.ace.feedback.common 1.0.0
  [bndtest]  * [51] 32 - org.apache.ace.client.rest.itest 1.0.0
  [bndtest] Log:
  [bndtest]  * Mon Feb 24 09:53:02 GMT+00:00 2014 - ServiceEvent REGISTERED - 38 - null
  [bndtest]  * Mon Feb 24 09:53:02 GMT+00:00 2014 - ServiceEvent REGISTERED - 38 - null
  [bndtest]  * Mon Feb 24 09:53:02 GMT+00:00 2014 - ServiceEvent REGISTERED - 38 - null
  [bndtest]  * Mon Feb 24 09:53:02 GMT+00:00 2014 - ServiceEvent REGISTERED - 38 - null
  [bndtest]  * Mon Feb 24 09:53:02 GMT+00:00 2014 - ServiceEvent REGISTERED - 38 - null
  [bndtest]  * Mon Feb 24 09:53:02 GMT+00:00 2014 - ServiceEvent REGISTERED - 36 - null
  [bndtest]  * Mon Feb 24 09:53:02 GMT+00:00 2014 - ServiceEvent REGISTERED - 27 - null
  [bndtest]  * Mon Feb 24 09:53:02 GMT+00:00 2014 - ServiceEvent REGISTERED - 25 - null
  [bndtest]  * Mon Feb 24 09:53:02 GMT+00:00 2014 - ServiceEvent REGISTERED - 30 - null
  [bndtest]  * Mon Feb 24 09:53:02 GMT+00:00 2014 - ServiceEvent REGISTERED - 31 - null
  [bndtest]  * Mon Feb 24 09:53:02 GMT+00:00 2014 - ServiceEvent REGISTERED - 48 - null
  [bndtest]  * Mon Feb 24 09:53:02 GMT+00:00 2014 - ServiceEvent REGISTERED - 42 - null
  [bndtest]  * Mon Feb 24 09:53:02 GMT+00:00 2014 - ServiceEvent REGISTERED - 41 - null
  [bndtest]  * Mon Feb 24 09:53:02 GMT+00:00 2014 - ServiceEvent REGISTERED - 39 - null
  [bndtest]  * Mon Feb 24 09:53:02 GMT+00:00 2014 - ServiceEvent REGISTERED - 0 - null
  [bndtest]  * Mon Feb 24 09:53:02 GMT+00:00 2014 - ServiceEvent REGISTERED - 0 - null
  [bndtest]  * Mon Feb 24 09:53:02 GMT+00:00 2014 - BundleEvent STARTED - 51 - null
  [bndtest]  * Mon Feb 24 09:53:02 GMT+00:00 2014 - BundleEvent STARTED - 50 - null
  [bndtest]  * Mon Feb 24 09:53:02 GMT+00:00 2014 - BundleEvent STARTED - 48 - null
  [bndtest]  * Mon Feb 24 09:53:02 GMT+00:00 2014 - ServiceEvent REGISTERED - 48 - null
  [bndtest]  * Mon Feb 24 09:53:02 GMT+00:00 2014 - BundleEvent STARTED - 47 - null
  [bndtest]  * Mon Feb 24 09:53:02 GMT+00:00 2014 - ServiceEvent REGISTERED - 47 - null
  [bndtest]  * Mon Feb 24 09:53:02 GMT+00:00 2014 - BundleEvent STARTED - 46 - null
  [bndtest]  * Mon Feb 24 09:53:02 GMT+00:00 2014 - ServiceEvent REGISTERED - 46 - null
  [bndtest]  * Mon Feb 24 09:53:02 GMT+00:00 2014 - BundleEvent STARTED - 45 - null
  [bndtest]  * Mon Feb 24 09:53:02 GMT+00:00 2014 - ServiceEvent REGISTERED - 45 - null
  [bndtest]  * Mon Feb 24 09:53:02 GMT+00:00 2014 - ServiceEvent REGISTERED - 45 - null
  [bndtest]  * Mon Feb 24 09:53:02 GMT+00:00 2014 - ServiceEvent REGISTERED - 45 - null
  [bndtest]  * Mon Feb 24 09:53:02 GMT+00:00 2014 - BundleEvent STARTED - 44 - null
  [bndtest]  * Mon Feb 24 09:53:02 GMT+00:00 2014 - BundleEvent STARTED - 43 - null
  [bndtest]  * Mon Feb 24 09:53:02 GMT+00:00 2014 - BundleEvent STARTED - 42 - null
  [bndtest]  * Mon Feb 24 09:53:02 GMT+00:00 2014 - ServiceEvent REGISTERED - 42 - null
  [bndtest]  * Mon Feb 24 09:53:02 GMT+00:00 2014 - BundleEvent STARTED - 41 - null
  [bndtest]  * Mon Feb 24 09:53:02 GMT+00:00 2014 - ServiceEvent REGISTERED - 41 - null
  [bndtest]  * Mon Feb 24 09:53:02 GMT+00:00 2014 - BundleEvent STARTED - 40 - null
  [bndtest]  * Mon Feb 24 09:53:02 GMT+00:00 2014 - ServiceEvent REGISTERED - 40 - null
  [bndtest]  * Mon Feb 24 09:53:02 GMT+00:00 2014 - BundleEvent STARTED - 39 - null
  [bndtest]  * Mon Feb 24 09:53:02 GMT+00:00 2014 - ServiceEvent REGISTERED - 39 - null
  [bndtest]  * Mon Feb 24 09:53:02 GMT+00:00 2014 - ServiceEvent REGISTERED - 39 - null
  [bndtest]  * Mon Feb 24 09:53:02 GMT+00:00 2014 - BundleEvent STARTED - 38 - null
  [bndtest]  * Mon Feb 24 09:53:02 GMT+00:00 2014 - ServiceEvent REGISTERED - 38 - null
  [bndtest]  * Mon Feb 24 09:53:02 GMT+00:00 2014 - BundleEvent STARTED - 37 - null
  [bndtest]  * Mon Feb 24 09:53:02 GMT+00:00 2014 - BundleEvent STARTED - 36 - null
  [bndtest]  * Mon Feb 24 09:53:02 GMT+00:00 2014 - ServiceEvent REGISTERED - 36 - null
  [bndtest]  * Mon Feb 24 09:53:02 GMT+00:00 2014 - BundleEvent STARTED - 35 - null
  [bndtest]  * Mon Feb 24 09:53:02 GMT+00:00 2014 - BundleEvent STARTED - 34 - null
  [bndtest]  * Mon Feb 24 09:53:02 GMT+00:00 2014 - BundleEvent STARTED - 33 - null
  [bndtest]  * Mon Feb 24 09:53:02 GMT+00:00 2014 - BundleEvent STARTED - 32 - null
  [bndtest]  * Mon Feb 24 09:53:02 GMT+00:00 2014 - BundleEvent STARTED - 31 - null
  [bndtest]  * Mon Feb 24 09:53:02 GMT+00:00 2014 - BundleEvent STARTED - 30 - null
  [bndtest]  * Mon Feb 24 09:53:02 GMT+00:00 2014 - ServiceEvent REGISTERED - 30 - null
  [bndtest]  * Mon Feb 24 09:53:02 GMT+00:00 2014 - ServiceEvent REGISTERED - 30 - null
  [bndtest]  * Mon Feb 24 09:53:02 GMT+00:00 2014 - ServiceEvent REGISTERED - 30 - null
  [bndtest]  * Mon Feb 24 09:53:02 GMT+00:00 2014 - BundleEvent STARTED - 29 - null
  [bndtest]  * Mon Feb 24 09:53:02 GMT+00:00 2014 - ServiceEvent REGISTERED - 29 - null
  [bndtest]  * Mon Feb 24 09:53:02 GMT+00:00 2014 - BundleEvent STARTED - 28 - null
  [bndtest]  * Mon Feb 24 09:53:02 GMT+00:00 2014 - BundleEvent STARTED - 27 - null
  [bndtest]  * Mon Feb 24 09:53:02 GMT+00:00 2014 - ServiceEvent REGISTERED - 27 - null
  [bndtest]  * Mon Feb 24 09:53:02 GMT+00:00 2014 - ServiceEvent REGISTERED - 27 - null
  [bndtest]  * Mon Feb 24 09:53:02 GMT+00:00 2014 - ServiceEvent MODIFIED - 7 - null
  [bndtest]  * Mon Feb 24 09:53:01 GMT+00:00 2014 - BundleEvent STARTED - 26 - null
  [bndtest]  * Mon Feb 24 09:53:01 GMT+00:00 2014 - BundleEvent STARTED - 25 - null
  [bndtest]  * Mon Feb 24 09:53:01 GMT+00:00 2014 - ServiceEvent REGISTERED - 25 - null
  [bndtest]  * Mon Feb 24 09:53:01 GMT+00:00 2014 - Started Jetty 7.6.13.v20130916 at port(s) HTTP:8080 on context path / - 7 - null
  [bndtest]  * Mon Feb 24 09:53:01 GMT+00:00 2014 - ServiceEvent REGISTERED - 25 - null
  [bndtest]  * Mon Feb 24 09:53:01 GMT+00:00 2014 - BundleEvent STARTED - 24 - null
  [bndtest]  * Mon Feb 24 09:53:01 GMT+00:00 2014 - BundleEvent STARTED - 23 - null
  [bndtest]  * Mon Feb 24 09:53:01 GMT+00:00 2014 - BundleEvent STARTED - 22 - null
  [bndtest]  * Mon Feb 24 09:53:01 GMT+00:00 2014 - BundleEvent STARTED - 21 - null
  [bndtest]  * Mon Feb 24 09:53:01 GMT+00:00 2014 - ServiceEvent REGISTERED - 21 - null
  [bndtest]  * Mon Feb 24 09:53:01 GMT+00:00 2014 - BundleEvent STARTED - 20 - null
  [bndtest]  * Mon Feb 24 09:53:01 GMT+00:00 2014 - ServiceEvent REGISTERED - 20 - null
  [bndtest]  * Mon Feb 24 09:53:01 GMT+00:00 2014 - BundleEvent STARTED - 19 - null
  [bndtest]  * Mon Feb 24 09:53:01 GMT+00:00 2014 - BundleEvent STARTED - 18 - null
  [bndtest]  * Mon Feb 24 09:53:01 GMT+00:00 2014 - Unable to register servlet with endpoint 'null' - 18 - null
  [bndtest]  * Mon Feb 24 09:53:01 GMT+00:00 2014 - BundleEvent STARTED - 17 - null
  [bndtest]  * Mon Feb 24 09:53:01 GMT+00:00 2014 - BundleEvent STARTED - 16 - null
  [bndtest]  * Mon Feb 24 09:53:01 GMT+00:00 2014 - ServiceEvent REGISTERED - 16 - null
  [bndtest]  * Mon Feb 24 09:53:01 GMT+00:00 2014 - ServiceEvent REGISTERED - 16 - null
  [bndtest]  * Mon Feb 24 09:53:01 GMT+00:00 2014 - ServiceEvent REGISTERED - 16 - null
  [bndtest]  * Mon Feb 24 09:53:01 GMT+00:00 2014 - ServiceEvent REGISTERED - 16 - null
  [bndtest]  * Mon Feb 24 09:53:01 GMT+00:00 2014 - ServiceEvent REGISTERED - 16 - null
  [bndtest]  * Mon Feb 24 09:53:01 GMT+00:00 2014 - ServiceEvent REGISTERED - 7 - null
  [bndtest]  * Mon Feb 24 09:53:01 GMT+00:00 2014 - ServiceEvent REGISTERED - 7 - null
  [bndtest]  * Mon Feb 24 09:53:01 GMT+00:00 2014 - ServiceEvent REGISTERED - 16 - null
  [bndtest]  * Mon Feb 24 09:53:01 GMT+00:00 2014 - BundleEvent STARTED - 15 - null
  [bndtest]  * Mon Feb 24 09:53:01 GMT+00:00 2014 - ServiceEvent REGISTERED - 15 - null
  [bndtest]  * Mon Feb 24 09:53:01 GMT+00:00 2014 - ServiceEvent REGISTERED - 15 - null
  [bndtest]  * Mon Feb 24 09:53:01 GMT+00:00 2014 - BundleEvent STARTED - 14 - null
  [bndtest]  * Mon Feb 24 09:53:01 GMT+00:00 2014 - ServiceEvent REGISTERED - 14 - null
  [bndtest]  * Mon Feb 24 09:53:01 GMT+00:00 2014 - ServiceEvent REGISTERED - 14 - null
  [bndtest]  * Mon Feb 24 09:53:01 GMT+00:00 2014 - ServiceEvent REGISTERED - 14 - null
  [bndtest]  * Mon Feb 24 09:53:01 GMT+00:00 2014 - ServiceEvent REGISTERED - 14 - null
  [bndtest]  * Mon Feb 24 09:53:01 GMT+00:00 2014 - BundleEvent STARTED - 13 - null
  [bndtest]  * Mon Feb 24 09:53:01 GMT+00:00 2014 - ServiceEvent REGISTERED - 13 - null
  [bndtest]  * Mon Feb 24 09:53:01 GMT+00:00 2014 - ServiceEvent REGISTERED - 13 - null
  [bndtest] Tests run  : 5
  [bndtest] Passed     : 0
  [bndtest] Errors     : 5
  [bndtest] Failures   : 0
  [bndtest] 5 Error(s)
  [bndtest] Tests failed
  [bndtest] 	at aQute.bnd.ant.TestTask.executeProject(TestTask.java:78)
  [bndtest] 	at aQute.bnd.ant.TestTask.execute(TestTask.java:49)
  [bndtest] 	at org.apache.tools.ant.UnknownElement.execute(UnknownElement.java:291)
  [bndtest] 	at sun.reflect.GeneratedMethodAccessor4.invoke(Unknown Source)
  [bndtest] 	at sun.reflect.DelegatingMethodAccessorImpl.invoke(DelegatingMethodAccessorImpl.java:25)
  [bndtest] 	at java.lang.reflect.Method.invoke(Method.java:597)
  [bndtest] 	at org.apache.tools.ant.dispatch.DispatchUtils.execute(DispatchUtils.java:106)
  [bndtest] 	at org.apache.tools.ant.Task.perform(Task.java:348)
  [bndtest] 	at org.apache.tools.ant.Target.execute(Target.java:390)
  [bndtest] 	at org.apache.tools.ant.Target.performTasks(Target.java:411)
  [bndtest] 	at org.apache.tools.ant.Project.executeSortedTargets(Project.java:1399)
  [bndtest] 	at org.apache.tools.ant.helper.SingleCheckExecutor.executeTargets(SingleCheckExecutor.java:38)
  [bndtest] 	at org.apache.tools.ant.Project.executeTargets(Project.java:1251)
  [bndtest] 	at org.apache.tools.ant.taskdefs.Ant.execute(Ant.java:442)
  [bndtest] 	at org.apache.tools.ant.taskdefs.SubAnt.execute(SubAnt.java:302)
  [bndtest] 	at org.apache.tools.ant.taskdefs.SubAnt.execute(SubAnt.java:221)
  [bndtest] 	at org.apache.tools.ant.UnknownElement.execute(UnknownElement.java:291)
  [bndtest] 	at sun.reflect.GeneratedMethodAccessor4.invoke(Unknown Source)
  [bndtest] 	at sun.reflect.DelegatingMethodAccessorImpl.invoke(DelegatingMethodAccessorImpl.java:25)
  [bndtest] 	at java.lang.reflect.Method.invoke(Method.java:597)
  [bndtest] 	at org.apache.tools.ant.dispatch.DispatchUtils.execute(DispatchUtils.java:106)
  [bndtest] 	at org.apache.tools.ant.Task.perform(Task.java:348)
  [bndtest] 	at org.apache.tools.ant.Target.execute(Target.java:390)
  [bndtest] 	at org.apache.tools.ant.Target.performTasks(Target.java:411)
  [bndtest] 	at org.apache.tools.ant.Project.executeSortedTargets(Project.java:1399)
  [bndtest] 	at org.apache.tools.ant.Project.executeTarget(Project.java:1368)
  [bndtest] 	at org.apache.tools.ant.helper.DefaultExecutor.executeTargets(DefaultExecutor.java:41)
  [bndtest] 	at org.apache.tools.ant.Project.executeTargets(Project.java:1251)
  [bndtest] 	at org.apache.tools.ant.Main.runBuild(Main.java:809)
  [bndtest] 	at org.apache.tools.ant.Main.startAnt(Main.java:217)
  [bndtest] 	at org.apache.tools.ant.launch.Launcher.run(Launcher.java:280)
  [bndtest] 	at org.apache.tools.ant.launch.Launcher.main(Launcher.java:109)

BUILD FAILED
/zonestorage/hudson_solaris/home/hudson/hudson-slave/workspace/ACE-trunk/cnf/build.xml:55: The following error occurred while executing this line:
/zonestorage/hudson_solaris/home/hudson/hudson-slave/workspace/ACE-trunk/cnf/build-template.xml:67: Tests failed

Total time: 11 minutes 46 seconds
Build step 'Invoke Ant' marked build as failure
Recording test results
TestNG Reports Processing: START
Looking for TestNG results report in workspace using pattern: **/testng/testng-results.xml
Saving reports...
Processing '/x1/jenkins/jenkins-home/jobs/ACE-trunk/builds/2014-02-24_09-39-20/testng/testng-results-1.xml'
Processing '/x1/jenkins/jenkins-home/jobs/ACE-trunk/builds/2014-02-24_09-39-20/testng/testng-results-10.xml'
Processing '/x1/jenkins/jenkins-home/jobs/ACE-trunk/builds/2014-02-24_09-39-20/testng/testng-results-11.xml'
Processing '/x1/jenkins/jenkins-home/jobs/ACE-trunk/builds/2014-02-24_09-39-20/testng/testng-results-12.xml'
Processing '/x1/jenkins/jenkins-home/jobs/ACE-trunk/builds/2014-02-24_09-39-20/testng/testng-results-13.xml'
Processing '/x1/jenkins/jenkins-home/jobs/ACE-trunk/builds/2014-02-24_09-39-20/testng/testng-results-14.xml'
Processing '/x1/jenkins/jenkins-home/jobs/ACE-trunk/builds/2014-02-24_09-39-20/testng/testng-results-15.xml'
Processing '/x1/jenkins/jenkins-home/jobs/ACE-trunk/builds/2014-02-24_09-39-20/testng/testng-results-16.xml'
Processing '/x1/jenkins/jenkins-home/jobs/ACE-trunk/builds/2014-02-24_09-39-20/testng/testng-results-17.xml'
Processing '/x1/jenkins/jenkins-home/jobs/ACE-trunk/builds/2014-02-24_09-39-20/testng/testng-results-18.xml'
Processing '/x1/jenkins/jenkins-home/jobs/ACE-trunk/builds/2014-02-24_09-39-20/testng/testng-results-2.xml'
Processing '/x1/jenkins/jenkins-home/jobs/ACE-trunk/builds/2014-02-24_09-39-20/testng/testng-results-3.xml'
Processing '/x1/jenkins/jenkins-home/jobs/ACE-trunk/builds/2014-02-24_09-39-20/testng/testng-results-4.xml'
Processing '/x1/jenkins/jenkins-home/jobs/ACE-trunk/builds/2014-02-24_09-39-20/testng/testng-results-5.xml'
Processing '/x1/jenkins/jenkins-home/jobs/ACE-trunk/builds/2014-02-24_09-39-20/testng/testng-results-6.xml'
Processing '/x1/jenkins/jenkins-home/jobs/ACE-trunk/builds/2014-02-24_09-39-20/testng/testng-results-7.xml'
Processing '/x1/jenkins/jenkins-home/jobs/ACE-trunk/builds/2014-02-24_09-39-20/testng/testng-results-8.xml'
Processing '/x1/jenkins/jenkins-home/jobs/ACE-trunk/builds/2014-02-24_09-39-20/testng/testng-results-9.xml'
Processing '/x1/jenkins/jenkins-home/jobs/ACE-trunk/builds/2014-02-24_09-39-20/testng/testng-results.xml'
TestNG Reports Processing: FINISH

Build failed in Jenkins: ACE-trunk #198

Posted by Apache Jenkins Server <je...@builds.apache.org>.
See <https://builds.apache.org/job/ACE-trunk/198/changes>

Changes:

[marrs] ACE-456 fixed the CI build, forgot another dependency

------------------------------------------
[...truncated 3810 lines...]
  [bndtest]  * Tue Feb 18 23:47:34 GMT+00:00 2014 - BundleEvent STARTED - 24 - null
  [bndtest]  * Tue Feb 18 23:47:34 GMT+00:00 2014 - BundleEvent STARTED - 23 - null
  [bndtest]  * Tue Feb 18 23:47:34 GMT+00:00 2014 - BundleEvent STARTED - 22 - null
  [bndtest]  * Tue Feb 18 23:47:34 GMT+00:00 2014 - BundleEvent STARTED - 21 - null
  [bndtest]  * Tue Feb 18 23:47:34 GMT+00:00 2014 - ServiceEvent REGISTERED - 21 - null
  [bndtest]  * Tue Feb 18 23:47:34 GMT+00:00 2014 - BundleEvent STARTED - 20 - null
  [bndtest]  * Tue Feb 18 23:47:34 GMT+00:00 2014 - ServiceEvent REGISTERED - 20 - null
  [bndtest]  * Tue Feb 18 23:47:34 GMT+00:00 2014 - BundleEvent STARTED - 19 - null
  [bndtest]  * Tue Feb 18 23:47:34 GMT+00:00 2014 - BundleEvent STARTED - 18 - null
  [bndtest]  * Tue Feb 18 23:47:34 GMT+00:00 2014 - Unable to register servlet with endpoint 'null' - 18 - null
  [bndtest]  * Tue Feb 18 23:47:34 GMT+00:00 2014 - BundleEvent STARTED - 17 - null
  [bndtest]  * Tue Feb 18 23:47:34 GMT+00:00 2014 - BundleEvent STARTED - 16 - null
  [bndtest]  * Tue Feb 18 23:47:34 GMT+00:00 2014 - ServiceEvent REGISTERED - 16 - null
  [bndtest]  * Tue Feb 18 23:47:34 GMT+00:00 2014 - ServiceEvent REGISTERED - 16 - null
  [bndtest]  * Tue Feb 18 23:47:34 GMT+00:00 2014 - ServiceEvent REGISTERED - 16 - null
  [bndtest]  * Tue Feb 18 23:47:34 GMT+00:00 2014 - ServiceEvent REGISTERED - 16 - null
  [bndtest]  * Tue Feb 18 23:47:34 GMT+00:00 2014 - ServiceEvent REGISTERED - 16 - null
  [bndtest]  * Tue Feb 18 23:47:34 GMT+00:00 2014 - ServiceEvent REGISTERED - 7 - null
  [bndtest]  * Tue Feb 18 23:47:34 GMT+00:00 2014 - ServiceEvent REGISTERED - 16 - null
  [bndtest]  * Tue Feb 18 23:47:34 GMT+00:00 2014 - ServiceEvent REGISTERED - 7 - null
  [bndtest]  * Tue Feb 18 23:47:34 GMT+00:00 2014 - BundleEvent STARTED - 15 - null
  [bndtest]  * Tue Feb 18 23:47:34 GMT+00:00 2014 - ServiceEvent REGISTERED - 15 - null
  [bndtest]  * Tue Feb 18 23:47:34 GMT+00:00 2014 - ServiceEvent REGISTERED - 15 - null
  [bndtest]  * Tue Feb 18 23:47:34 GMT+00:00 2014 - BundleEvent STARTED - 14 - null
  [bndtest]  * Tue Feb 18 23:47:34 GMT+00:00 2014 - ServiceEvent REGISTERED - 14 - null
  [bndtest]  * Tue Feb 18 23:47:34 GMT+00:00 2014 - ServiceEvent REGISTERED - 14 - null
  [bndtest]  * Tue Feb 18 23:47:34 GMT+00:00 2014 - ServiceEvent REGISTERED - 14 - null
  [bndtest]  * Tue Feb 18 23:47:34 GMT+00:00 2014 - ServiceEvent REGISTERED - 14 - null
  [bndtest]  * Tue Feb 18 23:47:34 GMT+00:00 2014 - BundleEvent STARTED - 13 - null
  [bndtest]  * Tue Feb 18 23:47:34 GMT+00:00 2014 - ServiceEvent REGISTERED - 13 - null
  [bndtest]  * Tue Feb 18 23:47:34 GMT+00:00 2014 - ServiceEvent REGISTERED - 13 - null
  [bndtest]  * [0] 32 - org.apache.felix.framework 4.2.1
  [bndtest]  * [1] 32 - osgi.cmpn 4.3.1.201210102024
  [bndtest]  * [2] 32 - com.sun.jersey.client 1.13.0
  [bndtest]  * [3] 32 - com.sun.jersey.core 1.13.0
  [bndtest]  * [4] 32 - org.apache.felix.dependencymanager 3.1.0
  [bndtest]  * [5] 32 - org.apache.felix.configadmin 1.8.0
  [bndtest]  * [6] 32 - org.apache.felix.eventadmin 1.2.14
  [bndtest]  * [7] 32 - org.apache.felix.http.jetty 2.2.2
  [bndtest]  * [8] 32 - org.apache.felix.dependencymanager.shell 3.0.1
  [bndtest]  * [9] 32 - org.apache.felix.deploymentadmin 0.9.5
  [bndtest]  * [10] 32 - org.apache.felix.prefs 1.0.4
  [bndtest]  * [11] 32 - org.apache.felix.useradmin 1.0.3
  [bndtest]  * [12] 32 - org.apache.felix.useradmin.filestore 1.0.2
  [bndtest]  * [13] 32 - org.apache.felix.log 1.0.1
  [bndtest]  * [14] 32 - org.apache.felix.gogo.command 0.12.0
  [bndtest]  * [15] 32 - org.apache.felix.gogo.runtime 0.10.0
  [bndtest]  * [16] 32 - org.apache.felix.gogo.shell 0.10.0
  [bndtest]  * [17] 32 - org.apache.ace.test 1.0.0
  [bndtest]  * [18] 32 - org.apache.ace.http.listener 1.0.0
  [bndtest]  * [19] 32 - org.apache.ace.authentication.api 1.0.0
  [bndtest]  * [20] 32 - org.apache.ace.connectionfactory 1.0.0
  [bndtest]  * [21] 32 - org.apache.ace.scheduler.impl 1.0.0
  [bndtest]  * [22] 32 - org.apache.ace.scheduler.api 1.0.0
  [bndtest]  * [23] 32 - org.apache.ace.deployment.provider.api 1.0.0
  [bndtest]  * [24] 32 - org.apache.ace.discovery.api 1.0.0
  [bndtest]  * [25] 32 - org.apache.ace.discovery.property 1.0.0
  [bndtest]  * [26] 32 - org.apache.ace.identification.api 1.0.0
  [bndtest]  * [27] 32 - org.apache.ace.identification.property 1.0.0
  [bndtest]  * [28] 32 - org.apache.ace.deployment.api 1.0.0
  [bndtest]  * [29] 32 - org.apache.ace.deployment.deploymentadmin 1.0.0
  [bndtest]  * [30] 32 - org.apache.ace.deployment.servlet 1.0.0
  [bndtest]  * [31] 32 - org.apache.ace.deployment.streamgenerator 1.0.0
  [bndtest]  * [32] 32 - org.apache.ace.deployment.provider.base 1.0.0
  [bndtest]  * [33] 32 - org.apache.ace.range.api 1.0.0
  [bndtest]  * [34] 32 - org.apache.ace.log.api 1.0.0
  [bndtest]  * [35] 32 - org.apache.ace.log.server.store.api 1.0.0
  [bndtest]  * [36] 32 - org.apache.ace.log.server.store.file 1.0.0
  [bndtest]  * [37] 32 - org.apache.ace.repository.api 1.0.0
  [bndtest]  * [38] 32 - org.apache.ace.repository.impl 1.0.0
  [bndtest]  * [39] 32 - org.apache.ace.repository.servlet 1.0.0
  [bndtest]  * [40] 32 - org.apache.ace.obr.metadata 1.0.0
  [bndtest]  * [41] 32 - org.apache.ace.obr.servlet 1.0.0
  [bndtest]  * [42] 32 - org.apache.ace.obr.storage 1.0.0
  [bndtest]  * [43] 32 - org.apache.ace.client.repository.api 1.0.0
  [bndtest]  * [44] 32 - org.apache.ace.client.repository.helper.base 1.0.0
  [bndtest]  * [45] 32 - org.apache.ace.client.repository.helper.bundle 1.0.0
  [bndtest]  * [46] 32 - org.apache.ace.client.repository.helper.configuration 1.0.0
  [bndtest]  * [47] 32 - org.apache.ace.client.repository.impl 1.0.0
  [bndtest]  * [48] 32 - org.apache.ace.deployment.provider.repositorybased 1.0.0
  [bndtest]  * [49] 2 - org.apache.ace.client.rest 1.0.0
  [bndtest]  * [50] 32 - org.apache.ace.feedback.common 1.0.0
  [bndtest]  * [51] 32 - org.apache.ace.client.rest.itest 1.0.0
  [bndtest] Log:
  [bndtest]  * Tue Feb 18 23:47:34 GMT+00:00 2014 - ServiceEvent REGISTERED - 38 - null
  [bndtest]  * Tue Feb 18 23:47:34 GMT+00:00 2014 - ServiceEvent REGISTERED - 38 - null
  [bndtest]  * Tue Feb 18 23:47:34 GMT+00:00 2014 - ServiceEvent REGISTERED - 38 - null
  [bndtest]  * Tue Feb 18 23:47:34 GMT+00:00 2014 - ServiceEvent REGISTERED - 38 - null
  [bndtest]  * Tue Feb 18 23:47:34 GMT+00:00 2014 - ServiceEvent REGISTERED - 38 - null
  [bndtest]  * Tue Feb 18 23:47:34 GMT+00:00 2014 - ServiceEvent REGISTERED - 36 - null
  [bndtest]  * Tue Feb 18 23:47:34 GMT+00:00 2014 - ServiceEvent REGISTERED - 27 - null
  [bndtest]  * Tue Feb 18 23:47:34 GMT+00:00 2014 - ServiceEvent REGISTERED - 25 - null
  [bndtest]  * Tue Feb 18 23:47:34 GMT+00:00 2014 - ServiceEvent REGISTERED - 30 - null
  [bndtest]  * Tue Feb 18 23:47:34 GMT+00:00 2014 - ServiceEvent REGISTERED - 31 - null
  [bndtest]  * Tue Feb 18 23:47:34 GMT+00:00 2014 - ServiceEvent REGISTERED - 48 - null
  [bndtest]  * Tue Feb 18 23:47:34 GMT+00:00 2014 - ServiceEvent REGISTERED - 41 - null
  [bndtest]  * Tue Feb 18 23:47:34 GMT+00:00 2014 - ServiceEvent REGISTERED - 42 - null
  [bndtest]  * Tue Feb 18 23:47:34 GMT+00:00 2014 - ServiceEvent REGISTERED - 39 - null
  [bndtest]  * Tue Feb 18 23:47:34 GMT+00:00 2014 - ServiceEvent REGISTERED - 0 - null
  [bndtest]  * Tue Feb 18 23:47:34 GMT+00:00 2014 - ServiceEvent REGISTERED - 0 - null
  [bndtest]  * Tue Feb 18 23:47:34 GMT+00:00 2014 - BundleEvent STARTED - 51 - null
  [bndtest]  * Tue Feb 18 23:47:34 GMT+00:00 2014 - BundleEvent STARTED - 50 - null
  [bndtest]  * Tue Feb 18 23:47:34 GMT+00:00 2014 - BundleEvent STARTED - 48 - null
  [bndtest]  * Tue Feb 18 23:47:34 GMT+00:00 2014 - ServiceEvent REGISTERED - 48 - null
  [bndtest]  * Tue Feb 18 23:47:34 GMT+00:00 2014 - BundleEvent STARTED - 47 - null
  [bndtest]  * Tue Feb 18 23:47:34 GMT+00:00 2014 - ServiceEvent REGISTERED - 47 - null
  [bndtest]  * Tue Feb 18 23:47:34 GMT+00:00 2014 - BundleEvent STARTED - 46 - null
  [bndtest]  * Tue Feb 18 23:47:34 GMT+00:00 2014 - ServiceEvent REGISTERED - 46 - null
  [bndtest]  * Tue Feb 18 23:47:34 GMT+00:00 2014 - BundleEvent STARTED - 45 - null
  [bndtest]  * Tue Feb 18 23:47:34 GMT+00:00 2014 - ServiceEvent REGISTERED - 45 - null
  [bndtest]  * Tue Feb 18 23:47:34 GMT+00:00 2014 - ServiceEvent REGISTERED - 45 - null
  [bndtest]  * Tue Feb 18 23:47:34 GMT+00:00 2014 - ServiceEvent REGISTERED - 45 - null
  [bndtest]  * Tue Feb 18 23:47:34 GMT+00:00 2014 - BundleEvent STARTED - 44 - null
  [bndtest]  * Tue Feb 18 23:47:34 GMT+00:00 2014 - BundleEvent STARTED - 43 - null
  [bndtest]  * Tue Feb 18 23:47:34 GMT+00:00 2014 - BundleEvent STARTED - 42 - null
  [bndtest]  * Tue Feb 18 23:47:34 GMT+00:00 2014 - ServiceEvent REGISTERED - 42 - null
  [bndtest]  * Tue Feb 18 23:47:34 GMT+00:00 2014 - BundleEvent STARTED - 41 - null
  [bndtest]  * Tue Feb 18 23:47:34 GMT+00:00 2014 - ServiceEvent REGISTERED - 41 - null
  [bndtest]  * Tue Feb 18 23:47:34 GMT+00:00 2014 - BundleEvent STARTED - 40 - null
  [bndtest]  * Tue Feb 18 23:47:34 GMT+00:00 2014 - ServiceEvent REGISTERED - 40 - null
  [bndtest]  * Tue Feb 18 23:47:34 GMT+00:00 2014 - BundleEvent STARTED - 39 - null
  [bndtest]  * Tue Feb 18 23:47:34 GMT+00:00 2014 - ServiceEvent REGISTERED - 39 - null
  [bndtest]  * Tue Feb 18 23:47:34 GMT+00:00 2014 - ServiceEvent REGISTERED - 39 - null
  [bndtest]  * Tue Feb 18 23:47:34 GMT+00:00 2014 - BundleEvent STARTED - 38 - null
  [bndtest]  * Tue Feb 18 23:47:34 GMT+00:00 2014 - ServiceEvent REGISTERED - 38 - null
  [bndtest]  * Tue Feb 18 23:47:34 GMT+00:00 2014 - BundleEvent STARTED - 37 - null
  [bndtest]  * Tue Feb 18 23:47:34 GMT+00:00 2014 - BundleEvent STARTED - 36 - null
  [bndtest]  * Tue Feb 18 23:47:34 GMT+00:00 2014 - ServiceEvent REGISTERED - 36 - null
  [bndtest]  * Tue Feb 18 23:47:34 GMT+00:00 2014 - BundleEvent STARTED - 35 - null
  [bndtest]  * Tue Feb 18 23:47:34 GMT+00:00 2014 - BundleEvent STARTED - 34 - null
  [bndtest]  * Tue Feb 18 23:47:34 GMT+00:00 2014 - BundleEvent STARTED - 33 - null
  [bndtest]  * Tue Feb 18 23:47:34 GMT+00:00 2014 - BundleEvent STARTED - 32 - null
  [bndtest]  * Tue Feb 18 23:47:34 GMT+00:00 2014 - BundleEvent STARTED - 31 - null
  [bndtest]  * Tue Feb 18 23:47:34 GMT+00:00 2014 - BundleEvent STARTED - 30 - null
  [bndtest]  * Tue Feb 18 23:47:34 GMT+00:00 2014 - ServiceEvent REGISTERED - 30 - null
  [bndtest]  * Tue Feb 18 23:47:34 GMT+00:00 2014 - ServiceEvent REGISTERED - 30 - null
  [bndtest]  * Tue Feb 18 23:47:34 GMT+00:00 2014 - ServiceEvent REGISTERED - 30 - null
  [bndtest]  * Tue Feb 18 23:47:34 GMT+00:00 2014 - BundleEvent STARTED - 29 - null
  [bndtest]  * Tue Feb 18 23:47:34 GMT+00:00 2014 - ServiceEvent REGISTERED - 29 - null
  [bndtest]  * Tue Feb 18 23:47:34 GMT+00:00 2014 - BundleEvent STARTED - 28 - null
  [bndtest]  * Tue Feb 18 23:47:34 GMT+00:00 2014 - BundleEvent STARTED - 27 - null
  [bndtest]  * Tue Feb 18 23:47:34 GMT+00:00 2014 - ServiceEvent REGISTERED - 27 - null
  [bndtest]  * Tue Feb 18 23:47:34 GMT+00:00 2014 - ServiceEvent REGISTERED - 27 - null
  [bndtest]  * Tue Feb 18 23:47:34 GMT+00:00 2014 - BundleEvent STARTED - 26 - null
  [bndtest]  * Tue Feb 18 23:47:34 GMT+00:00 2014 - BundleEvent STARTED - 25 - null
  [bndtest]  * Tue Feb 18 23:47:34 GMT+00:00 2014 - ServiceEvent REGISTERED - 25 - null
  [bndtest]  * Tue Feb 18 23:47:34 GMT+00:00 2014 - ServiceEvent MODIFIED - 7 - null
  [bndtest]  * Tue Feb 18 23:47:34 GMT+00:00 2014 - ServiceEvent REGISTERED - 25 - null
  [bndtest]  * Tue Feb 18 23:47:34 GMT+00:00 2014 - Started Jetty 7.6.13.v20130916 at port(s) HTTP:8080 on context path / - 7 - null
  [bndtest]  * Tue Feb 18 23:47:34 GMT+00:00 2014 - BundleEvent STARTED - 24 - null
  [bndtest]  * Tue Feb 18 23:47:34 GMT+00:00 2014 - BundleEvent STARTED - 23 - null
  [bndtest]  * Tue Feb 18 23:47:34 GMT+00:00 2014 - BundleEvent STARTED - 22 - null
  [bndtest]  * Tue Feb 18 23:47:34 GMT+00:00 2014 - BundleEvent STARTED - 21 - null
  [bndtest]  * Tue Feb 18 23:47:34 GMT+00:00 2014 - ServiceEvent REGISTERED - 21 - null
  [bndtest]  * Tue Feb 18 23:47:34 GMT+00:00 2014 - BundleEvent STARTED - 20 - null
  [bndtest]  * Tue Feb 18 23:47:34 GMT+00:00 2014 - ServiceEvent REGISTERED - 20 - null
  [bndtest]  * Tue Feb 18 23:47:34 GMT+00:00 2014 - BundleEvent STARTED - 19 - null
  [bndtest]  * Tue Feb 18 23:47:34 GMT+00:00 2014 - BundleEvent STARTED - 18 - null
  [bndtest] Tests run  : 5
  [bndtest] Passed     : 0
  [bndtest] Errors     : 5
  [bndtest] Failures   : 0
  [bndtest]  * Tue Feb 18 23:47:34 GMT+00:00 2014 - Unable to register servlet with endpoint 'null' - 18 - null
  [bndtest]  * Tue Feb 18 23:47:34 GMT+00:00 2014 - BundleEvent STARTED - 17 - null
  [bndtest]  * Tue Feb 18 23:47:34 GMT+00:00 2014 - BundleEvent STARTED - 16 - null
  [bndtest]  * Tue Feb 18 23:47:34 GMT+00:00 2014 - ServiceEvent REGISTERED - 16 - null
  [bndtest]  * Tue Feb 18 23:47:34 GMT+00:00 2014 - ServiceEvent REGISTERED - 16 - null
  [bndtest]  * Tue Feb 18 23:47:34 GMT+00:00 2014 - ServiceEvent REGISTERED - 16 - null
  [bndtest]  * Tue Feb 18 23:47:34 GMT+00:00 2014 - ServiceEvent REGISTERED - 16 - null
  [bndtest]  * Tue Feb 18 23:47:34 GMT+00:00 2014 - ServiceEvent REGISTERED - 16 - null
  [bndtest]  * Tue Feb 18 23:47:34 GMT+00:00 2014 - ServiceEvent REGISTERED - 7 - null
  [bndtest]  * Tue Feb 18 23:47:34 GMT+00:00 2014 - ServiceEvent REGISTERED - 16 - null
  [bndtest]  * Tue Feb 18 23:47:34 GMT+00:00 2014 - ServiceEvent REGISTERED - 7 - null
  [bndtest]  * Tue Feb 18 23:47:34 GMT+00:00 2014 - BundleEvent STARTED - 15 - null
  [bndtest]  * Tue Feb 18 23:47:34 GMT+00:00 2014 - ServiceEvent REGISTERED - 15 - null
  [bndtest]  * Tue Feb 18 23:47:34 GMT+00:00 2014 - ServiceEvent REGISTERED - 15 - null
  [bndtest]  * Tue Feb 18 23:47:34 GMT+00:00 2014 - BundleEvent STARTED - 14 - null
  [bndtest]  * Tue Feb 18 23:47:34 GMT+00:00 2014 - ServiceEvent REGISTERED - 14 - null
  [bndtest]  * Tue Feb 18 23:47:34 GMT+00:00 2014 - ServiceEvent REGISTERED - 14 - null
  [bndtest]  * Tue Feb 18 23:47:34 GMT+00:00 2014 - ServiceEvent REGISTERED - 14 - null
  [bndtest]  * Tue Feb 18 23:47:34 GMT+00:00 2014 - ServiceEvent REGISTERED - 14 - null
  [bndtest]  * Tue Feb 18 23:47:34 GMT+00:00 2014 - BundleEvent STARTED - 13 - null
  [bndtest]  * Tue Feb 18 23:47:34 GMT+00:00 2014 - ServiceEvent REGISTERED - 13 - null
  [bndtest]  * Tue Feb 18 23:47:34 GMT+00:00 2014 - ServiceEvent REGISTERED - 13 - null
  [bndtest] 5 Error(s)
  [bndtest] Tests failed
  [bndtest] 	at aQute.bnd.ant.TestTask.executeProject(TestTask.java:78)
  [bndtest] 	at aQute.bnd.ant.TestTask.execute(TestTask.java:49)
  [bndtest] 	at org.apache.tools.ant.UnknownElement.execute(UnknownElement.java:291)
  [bndtest] 	at sun.reflect.GeneratedMethodAccessor4.invoke(Unknown Source)
  [bndtest] 	at sun.reflect.DelegatingMethodAccessorImpl.invoke(DelegatingMethodAccessorImpl.java:25)
  [bndtest] 	at java.lang.reflect.Method.invoke(Method.java:597)
  [bndtest] 	at org.apache.tools.ant.dispatch.DispatchUtils.execute(DispatchUtils.java:106)
  [bndtest] 	at org.apache.tools.ant.Task.perform(Task.java:348)
  [bndtest] 	at org.apache.tools.ant.Target.execute(Target.java:390)
  [bndtest] 	at org.apache.tools.ant.Target.performTasks(Target.java:411)
  [bndtest] 	at org.apache.tools.ant.Project.executeSortedTargets(Project.java:1399)
  [bndtest] 	at org.apache.tools.ant.helper.SingleCheckExecutor.executeTargets(SingleCheckExecutor.java:38)
  [bndtest] 	at org.apache.tools.ant.Project.executeTargets(Project.java:1251)
  [bndtest] 	at org.apache.tools.ant.taskdefs.Ant.execute(Ant.java:442)
  [bndtest] 	at org.apache.tools.ant.taskdefs.SubAnt.execute(SubAnt.java:302)
  [bndtest] 	at org.apache.tools.ant.taskdefs.SubAnt.execute(SubAnt.java:221)
  [bndtest] 	at org.apache.tools.ant.UnknownElement.execute(UnknownElement.java:291)
  [bndtest] 	at sun.reflect.GeneratedMethodAccessor4.invoke(Unknown Source)
  [bndtest] 	at sun.reflect.DelegatingMethodAccessorImpl.invoke(DelegatingMethodAccessorImpl.java:25)
  [bndtest] 	at java.lang.reflect.Method.invoke(Method.java:597)
  [bndtest] 	at org.apache.tools.ant.dispatch.DispatchUtils.execute(DispatchUtils.java:106)
  [bndtest] 	at org.apache.tools.ant.Task.perform(Task.java:348)
  [bndtest] 	at org.apache.tools.ant.Target.execute(Target.java:390)
  [bndtest] 	at org.apache.tools.ant.Target.performTasks(Target.java:411)
  [bndtest] 	at org.apache.tools.ant.Project.executeSortedTargets(Project.java:1399)
  [bndtest] 	at org.apache.tools.ant.Project.executeTarget(Project.java:1368)
  [bndtest] 	at org.apache.tools.ant.helper.DefaultExecutor.executeTargets(DefaultExecutor.java:41)
  [bndtest] 	at org.apache.tools.ant.Project.executeTargets(Project.java:1251)
  [bndtest] 	at org.apache.tools.ant.Main.runBuild(Main.java:809)
  [bndtest] 	at org.apache.tools.ant.Main.startAnt(Main.java:217)
  [bndtest] 	at org.apache.tools.ant.launch.Launcher.run(Launcher.java:280)
  [bndtest] 	at org.apache.tools.ant.launch.Launcher.main(Launcher.java:109)

BUILD FAILED
/zonestorage/hudson_solaris/home/hudson/hudson-slave/workspace/ACE-trunk/cnf/build.xml:55: The following error occurred while executing this line:
/zonestorage/hudson_solaris/home/hudson/hudson-slave/workspace/ACE-trunk/cnf/build-template.xml:67: Tests failed

Total time: 12 minutes 49 seconds
Build step 'Invoke Ant' marked build as failure
Recording test results
TestNG Reports Processing: START
Looking for TestNG results report in workspace using pattern: **/testng/testng-results.xml
Saving reports...
Processing '/x1/jenkins/jenkins-home/jobs/ACE-trunk/builds/2014-02-18_23-33-26/testng/testng-results-1.xml'
Processing '/x1/jenkins/jenkins-home/jobs/ACE-trunk/builds/2014-02-18_23-33-26/testng/testng-results-10.xml'
Processing '/x1/jenkins/jenkins-home/jobs/ACE-trunk/builds/2014-02-18_23-33-26/testng/testng-results-11.xml'
Processing '/x1/jenkins/jenkins-home/jobs/ACE-trunk/builds/2014-02-18_23-33-26/testng/testng-results-12.xml'
Processing '/x1/jenkins/jenkins-home/jobs/ACE-trunk/builds/2014-02-18_23-33-26/testng/testng-results-13.xml'
Processing '/x1/jenkins/jenkins-home/jobs/ACE-trunk/builds/2014-02-18_23-33-26/testng/testng-results-14.xml'
Processing '/x1/jenkins/jenkins-home/jobs/ACE-trunk/builds/2014-02-18_23-33-26/testng/testng-results-15.xml'
Processing '/x1/jenkins/jenkins-home/jobs/ACE-trunk/builds/2014-02-18_23-33-26/testng/testng-results-16.xml'
Processing '/x1/jenkins/jenkins-home/jobs/ACE-trunk/builds/2014-02-18_23-33-26/testng/testng-results-17.xml'
Processing '/x1/jenkins/jenkins-home/jobs/ACE-trunk/builds/2014-02-18_23-33-26/testng/testng-results-18.xml'
Processing '/x1/jenkins/jenkins-home/jobs/ACE-trunk/builds/2014-02-18_23-33-26/testng/testng-results-2.xml'
Processing '/x1/jenkins/jenkins-home/jobs/ACE-trunk/builds/2014-02-18_23-33-26/testng/testng-results-3.xml'
Processing '/x1/jenkins/jenkins-home/jobs/ACE-trunk/builds/2014-02-18_23-33-26/testng/testng-results-4.xml'
Processing '/x1/jenkins/jenkins-home/jobs/ACE-trunk/builds/2014-02-18_23-33-26/testng/testng-results-5.xml'
Processing '/x1/jenkins/jenkins-home/jobs/ACE-trunk/builds/2014-02-18_23-33-26/testng/testng-results-6.xml'
Processing '/x1/jenkins/jenkins-home/jobs/ACE-trunk/builds/2014-02-18_23-33-26/testng/testng-results-7.xml'
Processing '/x1/jenkins/jenkins-home/jobs/ACE-trunk/builds/2014-02-18_23-33-26/testng/testng-results-8.xml'
Processing '/x1/jenkins/jenkins-home/jobs/ACE-trunk/builds/2014-02-18_23-33-26/testng/testng-results-9.xml'
Processing '/x1/jenkins/jenkins-home/jobs/ACE-trunk/builds/2014-02-18_23-33-26/testng/testng-results.xml'
TestNG Reports Processing: FINISH