You are viewing a plain text version of this content. The canonical link for it is here.
Posted to dev@lucene.apache.org by Policeman Jenkins Server <je...@thetaphi.de> on 2018/03/28 06:04:58 UTC
[JENKINS] Lucene-Solr-BadApples-master-Linux (32bit/jdk1.8.0_162) -
Build # 15 - Still Unstable!
Build: https://jenkins.thetaphi.de/job/Lucene-Solr-BadApples-master-Linux/15/
Java: 32bit/jdk1.8.0_162 -client -XX:+UseSerialGC
5 tests failed.
FAILED: org.apache.solr.cloud.DeleteReplicaTest.deleteReplicaOnIndexing
Error Message:
Time out waiting for LIR state get removed
Stack Trace:
java.util.concurrent.TimeoutException: Time out waiting for LIR state get removed
at __randomizedtesting.SeedInfo.seed([79CAD9B151692749:B1F53EF2F4ED6A]:0)
at org.apache.solr.util.TimeOut.waitFor(TimeOut.java:66)
at org.apache.solr.cloud.DeleteReplicaTest.deleteReplicaOnIndexing(DeleteReplicaTest.java:331)
at sun.reflect.NativeMethodAccessorImpl.invoke0(Native Method)
at sun.reflect.NativeMethodAccessorImpl.invoke(NativeMethodAccessorImpl.java:62)
at sun.reflect.DelegatingMethodAccessorImpl.invoke(DelegatingMethodAccessorImpl.java:43)
at java.lang.reflect.Method.invoke(Method.java:498)
at com.carrotsearch.randomizedtesting.RandomizedRunner.invoke(RandomizedRunner.java:1737)
at com.carrotsearch.randomizedtesting.RandomizedRunner$8.evaluate(RandomizedRunner.java:934)
at com.carrotsearch.randomizedtesting.RandomizedRunner$9.evaluate(RandomizedRunner.java:970)
at com.carrotsearch.randomizedtesting.RandomizedRunner$10.evaluate(RandomizedRunner.java:984)
at com.carrotsearch.randomizedtesting.rules.SystemPropertiesRestoreRule$1.evaluate(SystemPropertiesRestoreRule.java:57)
at org.apache.lucene.util.TestRuleSetupTeardownChained$1.evaluate(TestRuleSetupTeardownChained.java:49)
at org.apache.lucene.util.AbstractBeforeAfterRule$1.evaluate(AbstractBeforeAfterRule.java:45)
at org.apache.lucene.util.TestRuleThreadAndTestName$1.evaluate(TestRuleThreadAndTestName.java:48)
at org.apache.lucene.util.TestRuleIgnoreAfterMaxFailures$1.evaluate(TestRuleIgnoreAfterMaxFailures.java:64)
at org.apache.lucene.util.TestRuleMarkFailure$1.evaluate(TestRuleMarkFailure.java:47)
at com.carrotsearch.randomizedtesting.rules.StatementAdapter.evaluate(StatementAdapter.java:36)
at com.carrotsearch.randomizedtesting.ThreadLeakControl$StatementRunner.run(ThreadLeakControl.java:368)
at com.carrotsearch.randomizedtesting.ThreadLeakControl.forkTimeoutingTask(ThreadLeakControl.java:817)
at com.carrotsearch.randomizedtesting.ThreadLeakControl$3.evaluate(ThreadLeakControl.java:468)
at com.carrotsearch.randomizedtesting.RandomizedRunner.runSingleTest(RandomizedRunner.java:943)
at com.carrotsearch.randomizedtesting.RandomizedRunner$5.evaluate(RandomizedRunner.java:829)
at com.carrotsearch.randomizedtesting.RandomizedRunner$6.evaluate(RandomizedRunner.java:879)
at com.carrotsearch.randomizedtesting.RandomizedRunner$7.evaluate(RandomizedRunner.java:890)
at com.carrotsearch.randomizedtesting.rules.StatementAdapter.evaluate(StatementAdapter.java:36)
at com.carrotsearch.randomizedtesting.rules.SystemPropertiesRestoreRule$1.evaluate(SystemPropertiesRestoreRule.java:57)
at org.apache.lucene.util.AbstractBeforeAfterRule$1.evaluate(AbstractBeforeAfterRule.java:45)
at com.carrotsearch.randomizedtesting.rules.StatementAdapter.evaluate(StatementAdapter.java:36)
at org.apache.lucene.util.TestRuleStoreClassName$1.evaluate(TestRuleStoreClassName.java:41)
at com.carrotsearch.randomizedtesting.rules.NoShadowingOrOverridesOnMethodsRule$1.evaluate(NoShadowingOrOverridesOnMethodsRule.java:40)
at com.carrotsearch.randomizedtesting.rules.NoShadowingOrOverridesOnMethodsRule$1.evaluate(NoShadowingOrOverridesOnMethodsRule.java:40)
at com.carrotsearch.randomizedtesting.rules.StatementAdapter.evaluate(StatementAdapter.java:36)
at com.carrotsearch.randomizedtesting.rules.StatementAdapter.evaluate(StatementAdapter.java:36)
at com.carrotsearch.randomizedtesting.rules.StatementAdapter.evaluate(StatementAdapter.java:36)
at org.apache.lucene.util.TestRuleAssertionsRequired$1.evaluate(TestRuleAssertionsRequired.java:53)
at org.apache.lucene.util.TestRuleMarkFailure$1.evaluate(TestRuleMarkFailure.java:47)
at org.apache.lucene.util.TestRuleIgnoreAfterMaxFailures$1.evaluate(TestRuleIgnoreAfterMaxFailures.java:64)
at org.apache.lucene.util.TestRuleIgnoreTestSuites$1.evaluate(TestRuleIgnoreTestSuites.java:54)
at com.carrotsearch.randomizedtesting.rules.StatementAdapter.evaluate(StatementAdapter.java:36)
at com.carrotsearch.randomizedtesting.ThreadLeakControl$StatementRunner.run(ThreadLeakControl.java:368)
at java.lang.Thread.run(Thread.java:748)
FAILED: org.apache.solr.cloud.DeleteReplicaTest.deleteReplicaOnIndexing
Error Message:
Time out waiting for LIR state get removed
Stack Trace:
java.util.concurrent.TimeoutException: Time out waiting for LIR state get removed
at __randomizedtesting.SeedInfo.seed([79CAD9B151692749:B1F53EF2F4ED6A]:0)
at org.apache.solr.util.TimeOut.waitFor(TimeOut.java:66)
at org.apache.solr.cloud.DeleteReplicaTest.deleteReplicaOnIndexing(DeleteReplicaTest.java:331)
at sun.reflect.NativeMethodAccessorImpl.invoke0(Native Method)
at sun.reflect.NativeMethodAccessorImpl.invoke(NativeMethodAccessorImpl.java:62)
at sun.reflect.DelegatingMethodAccessorImpl.invoke(DelegatingMethodAccessorImpl.java:43)
at java.lang.reflect.Method.invoke(Method.java:498)
at com.carrotsearch.randomizedtesting.RandomizedRunner.invoke(RandomizedRunner.java:1737)
at com.carrotsearch.randomizedtesting.RandomizedRunner$8.evaluate(RandomizedRunner.java:934)
at com.carrotsearch.randomizedtesting.RandomizedRunner$9.evaluate(RandomizedRunner.java:970)
at com.carrotsearch.randomizedtesting.RandomizedRunner$10.evaluate(RandomizedRunner.java:984)
at com.carrotsearch.randomizedtesting.rules.SystemPropertiesRestoreRule$1.evaluate(SystemPropertiesRestoreRule.java:57)
at org.apache.lucene.util.TestRuleSetupTeardownChained$1.evaluate(TestRuleSetupTeardownChained.java:49)
at org.apache.lucene.util.AbstractBeforeAfterRule$1.evaluate(AbstractBeforeAfterRule.java:45)
at org.apache.lucene.util.TestRuleThreadAndTestName$1.evaluate(TestRuleThreadAndTestName.java:48)
at org.apache.lucene.util.TestRuleIgnoreAfterMaxFailures$1.evaluate(TestRuleIgnoreAfterMaxFailures.java:64)
at org.apache.lucene.util.TestRuleMarkFailure$1.evaluate(TestRuleMarkFailure.java:47)
at com.carrotsearch.randomizedtesting.rules.StatementAdapter.evaluate(StatementAdapter.java:36)
at com.carrotsearch.randomizedtesting.ThreadLeakControl$StatementRunner.run(ThreadLeakControl.java:368)
at com.carrotsearch.randomizedtesting.ThreadLeakControl.forkTimeoutingTask(ThreadLeakControl.java:817)
at com.carrotsearch.randomizedtesting.ThreadLeakControl$3.evaluate(ThreadLeakControl.java:468)
at com.carrotsearch.randomizedtesting.RandomizedRunner.runSingleTest(RandomizedRunner.java:943)
at com.carrotsearch.randomizedtesting.RandomizedRunner$5.evaluate(RandomizedRunner.java:829)
at com.carrotsearch.randomizedtesting.RandomizedRunner$6.evaluate(RandomizedRunner.java:879)
at com.carrotsearch.randomizedtesting.RandomizedRunner$7.evaluate(RandomizedRunner.java:890)
at com.carrotsearch.randomizedtesting.rules.StatementAdapter.evaluate(StatementAdapter.java:36)
at com.carrotsearch.randomizedtesting.rules.SystemPropertiesRestoreRule$1.evaluate(SystemPropertiesRestoreRule.java:57)
at org.apache.lucene.util.AbstractBeforeAfterRule$1.evaluate(AbstractBeforeAfterRule.java:45)
at com.carrotsearch.randomizedtesting.rules.StatementAdapter.evaluate(StatementAdapter.java:36)
at org.apache.lucene.util.TestRuleStoreClassName$1.evaluate(TestRuleStoreClassName.java:41)
at com.carrotsearch.randomizedtesting.rules.NoShadowingOrOverridesOnMethodsRule$1.evaluate(NoShadowingOrOverridesOnMethodsRule.java:40)
at com.carrotsearch.randomizedtesting.rules.NoShadowingOrOverridesOnMethodsRule$1.evaluate(NoShadowingOrOverridesOnMethodsRule.java:40)
at com.carrotsearch.randomizedtesting.rules.StatementAdapter.evaluate(StatementAdapter.java:36)
at com.carrotsearch.randomizedtesting.rules.StatementAdapter.evaluate(StatementAdapter.java:36)
at com.carrotsearch.randomizedtesting.rules.StatementAdapter.evaluate(StatementAdapter.java:36)
at org.apache.lucene.util.TestRuleAssertionsRequired$1.evaluate(TestRuleAssertionsRequired.java:53)
at org.apache.lucene.util.TestRuleMarkFailure$1.evaluate(TestRuleMarkFailure.java:47)
at org.apache.lucene.util.TestRuleIgnoreAfterMaxFailures$1.evaluate(TestRuleIgnoreAfterMaxFailures.java:64)
at org.apache.lucene.util.TestRuleIgnoreTestSuites$1.evaluate(TestRuleIgnoreTestSuites.java:54)
at com.carrotsearch.randomizedtesting.rules.StatementAdapter.evaluate(StatementAdapter.java:36)
at com.carrotsearch.randomizedtesting.ThreadLeakControl$StatementRunner.run(ThreadLeakControl.java:368)
at java.lang.Thread.run(Thread.java:748)
FAILED: org.apache.solr.cloud.autoscaling.TriggerIntegrationTest.testEventQueue
Error Message:
action wasn't interrupted
Stack Trace:
java.lang.AssertionError: action wasn't interrupted
at __randomizedtesting.SeedInfo.seed([79CAD9B151692749:B07F9B1F580EE1BC]:0)
at org.junit.Assert.fail(Assert.java:93)
at org.junit.Assert.assertTrue(Assert.java:43)
at org.apache.solr.cloud.autoscaling.TriggerIntegrationTest.testEventQueue(TriggerIntegrationTest.java:752)
at sun.reflect.NativeMethodAccessorImpl.invoke0(Native Method)
at sun.reflect.NativeMethodAccessorImpl.invoke(NativeMethodAccessorImpl.java:62)
at sun.reflect.DelegatingMethodAccessorImpl.invoke(DelegatingMethodAccessorImpl.java:43)
at java.lang.reflect.Method.invoke(Method.java:498)
at com.carrotsearch.randomizedtesting.RandomizedRunner.invoke(RandomizedRunner.java:1737)
at com.carrotsearch.randomizedtesting.RandomizedRunner$8.evaluate(RandomizedRunner.java:934)
at com.carrotsearch.randomizedtesting.RandomizedRunner$9.evaluate(RandomizedRunner.java:970)
at com.carrotsearch.randomizedtesting.RandomizedRunner$10.evaluate(RandomizedRunner.java:984)
at com.carrotsearch.randomizedtesting.rules.SystemPropertiesRestoreRule$1.evaluate(SystemPropertiesRestoreRule.java:57)
at org.apache.lucene.util.TestRuleSetupTeardownChained$1.evaluate(TestRuleSetupTeardownChained.java:49)
at org.apache.lucene.util.AbstractBeforeAfterRule$1.evaluate(AbstractBeforeAfterRule.java:45)
at org.apache.lucene.util.TestRuleThreadAndTestName$1.evaluate(TestRuleThreadAndTestName.java:48)
at org.apache.lucene.util.TestRuleIgnoreAfterMaxFailures$1.evaluate(TestRuleIgnoreAfterMaxFailures.java:64)
at org.apache.lucene.util.TestRuleMarkFailure$1.evaluate(TestRuleMarkFailure.java:47)
at com.carrotsearch.randomizedtesting.rules.StatementAdapter.evaluate(StatementAdapter.java:36)
at com.carrotsearch.randomizedtesting.ThreadLeakControl$StatementRunner.run(ThreadLeakControl.java:368)
at com.carrotsearch.randomizedtesting.ThreadLeakControl.forkTimeoutingTask(ThreadLeakControl.java:817)
at com.carrotsearch.randomizedtesting.ThreadLeakControl$3.evaluate(ThreadLeakControl.java:468)
at com.carrotsearch.randomizedtesting.RandomizedRunner.runSingleTest(RandomizedRunner.java:943)
at com.carrotsearch.randomizedtesting.RandomizedRunner$5.evaluate(RandomizedRunner.java:829)
at com.carrotsearch.randomizedtesting.RandomizedRunner$6.evaluate(RandomizedRunner.java:879)
at com.carrotsearch.randomizedtesting.RandomizedRunner$7.evaluate(RandomizedRunner.java:890)
at com.carrotsearch.randomizedtesting.rules.StatementAdapter.evaluate(StatementAdapter.java:36)
at com.carrotsearch.randomizedtesting.rules.SystemPropertiesRestoreRule$1.evaluate(SystemPropertiesRestoreRule.java:57)
at org.apache.lucene.util.AbstractBeforeAfterRule$1.evaluate(AbstractBeforeAfterRule.java:45)
at com.carrotsearch.randomizedtesting.rules.StatementAdapter.evaluate(StatementAdapter.java:36)
at org.apache.lucene.util.TestRuleStoreClassName$1.evaluate(TestRuleStoreClassName.java:41)
at com.carrotsearch.randomizedtesting.rules.NoShadowingOrOverridesOnMethodsRule$1.evaluate(NoShadowingOrOverridesOnMethodsRule.java:40)
at com.carrotsearch.randomizedtesting.rules.NoShadowingOrOverridesOnMethodsRule$1.evaluate(NoShadowingOrOverridesOnMethodsRule.java:40)
at com.carrotsearch.randomizedtesting.rules.StatementAdapter.evaluate(StatementAdapter.java:36)
at com.carrotsearch.randomizedtesting.rules.StatementAdapter.evaluate(StatementAdapter.java:36)
at com.carrotsearch.randomizedtesting.rules.StatementAdapter.evaluate(StatementAdapter.java:36)
at org.apache.lucene.util.TestRuleAssertionsRequired$1.evaluate(TestRuleAssertionsRequired.java:53)
at org.apache.lucene.util.TestRuleMarkFailure$1.evaluate(TestRuleMarkFailure.java:47)
at org.apache.lucene.util.TestRuleIgnoreAfterMaxFailures$1.evaluate(TestRuleIgnoreAfterMaxFailures.java:64)
at org.apache.lucene.util.TestRuleIgnoreTestSuites$1.evaluate(TestRuleIgnoreTestSuites.java:54)
at com.carrotsearch.randomizedtesting.rules.StatementAdapter.evaluate(StatementAdapter.java:36)
at com.carrotsearch.randomizedtesting.ThreadLeakControl$StatementRunner.run(ThreadLeakControl.java:368)
at java.lang.Thread.run(Thread.java:748)
FAILED: org.apache.solr.cloud.autoscaling.TriggerIntegrationTest.testEventQueue
Error Message:
action wasn't interrupted
Stack Trace:
java.lang.AssertionError: action wasn't interrupted
at __randomizedtesting.SeedInfo.seed([79CAD9B151692749:B07F9B1F580EE1BC]:0)
at org.junit.Assert.fail(Assert.java:93)
at org.junit.Assert.assertTrue(Assert.java:43)
at org.apache.solr.cloud.autoscaling.TriggerIntegrationTest.testEventQueue(TriggerIntegrationTest.java:752)
at sun.reflect.NativeMethodAccessorImpl.invoke0(Native Method)
at sun.reflect.NativeMethodAccessorImpl.invoke(NativeMethodAccessorImpl.java:62)
at sun.reflect.DelegatingMethodAccessorImpl.invoke(DelegatingMethodAccessorImpl.java:43)
at java.lang.reflect.Method.invoke(Method.java:498)
at com.carrotsearch.randomizedtesting.RandomizedRunner.invoke(RandomizedRunner.java:1737)
at com.carrotsearch.randomizedtesting.RandomizedRunner$8.evaluate(RandomizedRunner.java:934)
at com.carrotsearch.randomizedtesting.RandomizedRunner$9.evaluate(RandomizedRunner.java:970)
at com.carrotsearch.randomizedtesting.RandomizedRunner$10.evaluate(RandomizedRunner.java:984)
at com.carrotsearch.randomizedtesting.rules.SystemPropertiesRestoreRule$1.evaluate(SystemPropertiesRestoreRule.java:57)
at org.apache.lucene.util.TestRuleSetupTeardownChained$1.evaluate(TestRuleSetupTeardownChained.java:49)
at org.apache.lucene.util.AbstractBeforeAfterRule$1.evaluate(AbstractBeforeAfterRule.java:45)
at org.apache.lucene.util.TestRuleThreadAndTestName$1.evaluate(TestRuleThreadAndTestName.java:48)
at org.apache.lucene.util.TestRuleIgnoreAfterMaxFailures$1.evaluate(TestRuleIgnoreAfterMaxFailures.java:64)
at org.apache.lucene.util.TestRuleMarkFailure$1.evaluate(TestRuleMarkFailure.java:47)
at com.carrotsearch.randomizedtesting.rules.StatementAdapter.evaluate(StatementAdapter.java:36)
at com.carrotsearch.randomizedtesting.ThreadLeakControl$StatementRunner.run(ThreadLeakControl.java:368)
at com.carrotsearch.randomizedtesting.ThreadLeakControl.forkTimeoutingTask(ThreadLeakControl.java:817)
at com.carrotsearch.randomizedtesting.ThreadLeakControl$3.evaluate(ThreadLeakControl.java:468)
at com.carrotsearch.randomizedtesting.RandomizedRunner.runSingleTest(RandomizedRunner.java:943)
at com.carrotsearch.randomizedtesting.RandomizedRunner$5.evaluate(RandomizedRunner.java:829)
at com.carrotsearch.randomizedtesting.RandomizedRunner$6.evaluate(RandomizedRunner.java:879)
at com.carrotsearch.randomizedtesting.RandomizedRunner$7.evaluate(RandomizedRunner.java:890)
at com.carrotsearch.randomizedtesting.rules.StatementAdapter.evaluate(StatementAdapter.java:36)
at com.carrotsearch.randomizedtesting.rules.SystemPropertiesRestoreRule$1.evaluate(SystemPropertiesRestoreRule.java:57)
at org.apache.lucene.util.AbstractBeforeAfterRule$1.evaluate(AbstractBeforeAfterRule.java:45)
at com.carrotsearch.randomizedtesting.rules.StatementAdapter.evaluate(StatementAdapter.java:36)
at org.apache.lucene.util.TestRuleStoreClassName$1.evaluate(TestRuleStoreClassName.java:41)
at com.carrotsearch.randomizedtesting.rules.NoShadowingOrOverridesOnMethodsRule$1.evaluate(NoShadowingOrOverridesOnMethodsRule.java:40)
at com.carrotsearch.randomizedtesting.rules.NoShadowingOrOverridesOnMethodsRule$1.evaluate(NoShadowingOrOverridesOnMethodsRule.java:40)
at com.carrotsearch.randomizedtesting.rules.StatementAdapter.evaluate(StatementAdapter.java:36)
at com.carrotsearch.randomizedtesting.rules.StatementAdapter.evaluate(StatementAdapter.java:36)
at com.carrotsearch.randomizedtesting.rules.StatementAdapter.evaluate(StatementAdapter.java:36)
at org.apache.lucene.util.TestRuleAssertionsRequired$1.evaluate(TestRuleAssertionsRequired.java:53)
at org.apache.lucene.util.TestRuleMarkFailure$1.evaluate(TestRuleMarkFailure.java:47)
at org.apache.lucene.util.TestRuleIgnoreAfterMaxFailures$1.evaluate(TestRuleIgnoreAfterMaxFailures.java:64)
at org.apache.lucene.util.TestRuleIgnoreTestSuites$1.evaluate(TestRuleIgnoreTestSuites.java:54)
at com.carrotsearch.randomizedtesting.rules.StatementAdapter.evaluate(StatementAdapter.java:36)
at com.carrotsearch.randomizedtesting.ThreadLeakControl$StatementRunner.run(ThreadLeakControl.java:368)
at java.lang.Thread.run(Thread.java:748)
FAILED: org.apache.solr.cloud.autoscaling.TriggerIntegrationTest.testNodeMarkersRegistration
Error Message:
Path /autoscaling/nodeAdded/127.0.0.1:38589_solr wasn't created
Stack Trace:
java.lang.AssertionError: Path /autoscaling/nodeAdded/127.0.0.1:38589_solr wasn't created
at __randomizedtesting.SeedInfo.seed([79CAD9B151692749:617051BD5F5CEAA6]:0)
at org.junit.Assert.fail(Assert.java:93)
at org.junit.Assert.assertTrue(Assert.java:43)
at org.apache.solr.cloud.autoscaling.TriggerIntegrationTest.testNodeMarkersRegistration(TriggerIntegrationTest.java:978)
at sun.reflect.NativeMethodAccessorImpl.invoke0(Native Method)
at sun.reflect.NativeMethodAccessorImpl.invoke(NativeMethodAccessorImpl.java:62)
at sun.reflect.DelegatingMethodAccessorImpl.invoke(DelegatingMethodAccessorImpl.java:43)
at java.lang.reflect.Method.invoke(Method.java:498)
at com.carrotsearch.randomizedtesting.RandomizedRunner.invoke(RandomizedRunner.java:1737)
at com.carrotsearch.randomizedtesting.RandomizedRunner$8.evaluate(RandomizedRunner.java:934)
at com.carrotsearch.randomizedtesting.RandomizedRunner$9.evaluate(RandomizedRunner.java:970)
at com.carrotsearch.randomizedtesting.RandomizedRunner$10.evaluate(RandomizedRunner.java:984)
at com.carrotsearch.randomizedtesting.rules.SystemPropertiesRestoreRule$1.evaluate(SystemPropertiesRestoreRule.java:57)
at org.apache.lucene.util.TestRuleSetupTeardownChained$1.evaluate(TestRuleSetupTeardownChained.java:49)
at org.apache.lucene.util.AbstractBeforeAfterRule$1.evaluate(AbstractBeforeAfterRule.java:45)
at org.apache.lucene.util.TestRuleThreadAndTestName$1.evaluate(TestRuleThreadAndTestName.java:48)
at org.apache.lucene.util.TestRuleIgnoreAfterMaxFailures$1.evaluate(TestRuleIgnoreAfterMaxFailures.java:64)
at org.apache.lucene.util.TestRuleMarkFailure$1.evaluate(TestRuleMarkFailure.java:47)
at com.carrotsearch.randomizedtesting.rules.StatementAdapter.evaluate(StatementAdapter.java:36)
at com.carrotsearch.randomizedtesting.ThreadLeakControl$StatementRunner.run(ThreadLeakControl.java:368)
at com.carrotsearch.randomizedtesting.ThreadLeakControl.forkTimeoutingTask(ThreadLeakControl.java:817)
at com.carrotsearch.randomizedtesting.ThreadLeakControl$3.evaluate(ThreadLeakControl.java:468)
at com.carrotsearch.randomizedtesting.RandomizedRunner.runSingleTest(RandomizedRunner.java:943)
at com.carrotsearch.randomizedtesting.RandomizedRunner$5.evaluate(RandomizedRunner.java:829)
at com.carrotsearch.randomizedtesting.RandomizedRunner$6.evaluate(RandomizedRunner.java:879)
at com.carrotsearch.randomizedtesting.RandomizedRunner$7.evaluate(RandomizedRunner.java:890)
at com.carrotsearch.randomizedtesting.rules.StatementAdapter.evaluate(StatementAdapter.java:36)
at com.carrotsearch.randomizedtesting.rules.SystemPropertiesRestoreRule$1.evaluate(SystemPropertiesRestoreRule.java:57)
at org.apache.lucene.util.AbstractBeforeAfterRule$1.evaluate(AbstractBeforeAfterRule.java:45)
at com.carrotsearch.randomizedtesting.rules.StatementAdapter.evaluate(StatementAdapter.java:36)
at org.apache.lucene.util.TestRuleStoreClassName$1.evaluate(TestRuleStoreClassName.java:41)
at com.carrotsearch.randomizedtesting.rules.NoShadowingOrOverridesOnMethodsRule$1.evaluate(NoShadowingOrOverridesOnMethodsRule.java:40)
at com.carrotsearch.randomizedtesting.rules.NoShadowingOrOverridesOnMethodsRule$1.evaluate(NoShadowingOrOverridesOnMethodsRule.java:40)
at com.carrotsearch.randomizedtesting.rules.StatementAdapter.evaluate(StatementAdapter.java:36)
at com.carrotsearch.randomizedtesting.rules.StatementAdapter.evaluate(StatementAdapter.java:36)
at com.carrotsearch.randomizedtesting.rules.StatementAdapter.evaluate(StatementAdapter.java:36)
at org.apache.lucene.util.TestRuleAssertionsRequired$1.evaluate(TestRuleAssertionsRequired.java:53)
at org.apache.lucene.util.TestRuleMarkFailure$1.evaluate(TestRuleMarkFailure.java:47)
at org.apache.lucene.util.TestRuleIgnoreAfterMaxFailures$1.evaluate(TestRuleIgnoreAfterMaxFailures.java:64)
at org.apache.lucene.util.TestRuleIgnoreTestSuites$1.evaluate(TestRuleIgnoreTestSuites.java:54)
at com.carrotsearch.randomizedtesting.rules.StatementAdapter.evaluate(StatementAdapter.java:36)
at com.carrotsearch.randomizedtesting.ThreadLeakControl$StatementRunner.run(ThreadLeakControl.java:368)
at java.lang.Thread.run(Thread.java:748)
Build Log:
[...truncated 1843 lines...]
[junit4] JVM J0: stdout was not empty, see: /home/jenkins/workspace/Lucene-Solr-BadApples-master-Linux/lucene/build/core/test/temp/junit4-J0-20180328_042334_1793422916654828028024.sysout
[junit4] >>> JVM J0 emitted unexpected output (verbatim) ----
[junit4] codec: FastCompressingStoredFields, pf: RAMOnly, dvf: Asserting
[junit4] <<< JVM J0: EOF ----
[...truncated 12021 lines...]
[junit4] Suite: org.apache.solr.cloud.DeleteReplicaTest
[junit4] 2> Creating dataDir: /home/jenkins/workspace/Lucene-Solr-BadApples-master-Linux/solr/build/solr-core/test/J0/temp/solr.cloud.DeleteReplicaTest_79CAD9B151692749-001/init-core-data-001
[junit4] 2> 1763642 INFO (SUITE-DeleteReplicaTest-seed#[79CAD9B151692749]-worker) [ ] o.a.s.SolrTestCaseJ4 Using PointFields (NUMERIC_POINTS_SYSPROP=true) w/NUMERIC_DOCVALUES_SYSPROP=true
[junit4] 2> 1763644 INFO (SUITE-DeleteReplicaTest-seed#[79CAD9B151692749]-worker) [ ] o.a.s.SolrTestCaseJ4 Randomized ssl (true) and clientAuth (true) via: @org.apache.solr.util.RandomizeSSL(reason=, ssl=NaN, value=NaN, clientAuth=NaN)
[junit4] 2> 1763649 INFO (SUITE-DeleteReplicaTest-seed#[79CAD9B151692749]-worker) [ ] o.a.s.SolrTestCaseJ4 SecureRandom sanity checks: test.solr.allowed.securerandom=null & java.security.egd=file:/dev/./urandom
[junit4] 2> 1763650 INFO (SUITE-DeleteReplicaTest-seed#[79CAD9B151692749]-worker) [ ] o.a.s.c.MiniSolrCloudCluster Starting cluster of 4 servers in /home/jenkins/workspace/Lucene-Solr-BadApples-master-Linux/solr/build/solr-core/test/J0/temp/solr.cloud.DeleteReplicaTest_79CAD9B151692749-001/tempDir-001
[junit4] 2> 1763650 INFO (SUITE-DeleteReplicaTest-seed#[79CAD9B151692749]-worker) [ ] o.a.s.c.ZkTestServer STARTING ZK TEST SERVER
[junit4] 2> 1763650 INFO (Thread-7151) [ ] o.a.s.c.ZkTestServer client port:0.0.0.0/0.0.0.0:0
[junit4] 2> 1763650 INFO (Thread-7151) [ ] o.a.s.c.ZkTestServer Starting server
[junit4] 2> 1763658 ERROR (Thread-7151) [ ] o.a.z.s.ZooKeeperServer ZKShutdownHandler is not registered, so ZooKeeper server won't take any action on ERROR or SHUTDOWN server state changes
[junit4] 2> 1763750 INFO (SUITE-DeleteReplicaTest-seed#[79CAD9B151692749]-worker) [ ] o.a.s.c.ZkTestServer start zk server on port:42151
[junit4] 2> 1763753 INFO (zkConnectionManagerCallback-3144-thread-1) [ ] o.a.s.c.c.ConnectionManager zkClient has connected
[junit4] 2> 1763757 INFO (jetty-launcher-3141-thread-1) [ ] o.e.j.s.Server jetty-9.4.8.v20171121, build timestamp: 2017-11-21T14:27:37-07:00, git hash: 82b8fb23f757335bb3329d540ce37a2a2615f0a8
[junit4] 2> 1763757 INFO (jetty-launcher-3141-thread-2) [ ] o.e.j.s.Server jetty-9.4.8.v20171121, build timestamp: 2017-11-21T14:27:37-07:00, git hash: 82b8fb23f757335bb3329d540ce37a2a2615f0a8
[junit4] 2> 1763757 INFO (jetty-launcher-3141-thread-4) [ ] o.e.j.s.Server jetty-9.4.8.v20171121, build timestamp: 2017-11-21T14:27:37-07:00, git hash: 82b8fb23f757335bb3329d540ce37a2a2615f0a8
[junit4] 2> 1763760 INFO (jetty-launcher-3141-thread-3) [ ] o.e.j.s.Server jetty-9.4.8.v20171121, build timestamp: 2017-11-21T14:27:37-07:00, git hash: 82b8fb23f757335bb3329d540ce37a2a2615f0a8
[junit4] 2> 1763768 INFO (jetty-launcher-3141-thread-4) [ ] o.e.j.s.session DefaultSessionIdManager workerName=node0
[junit4] 2> 1763768 INFO (jetty-launcher-3141-thread-4) [ ] o.e.j.s.session No SessionScavenger set, using defaults
[junit4] 2> 1763768 INFO (jetty-launcher-3141-thread-4) [ ] o.e.j.s.session Scavenging every 600000ms
[junit4] 2> 1763769 INFO (jetty-launcher-3141-thread-4) [ ] o.e.j.s.h.ContextHandler Started o.e.j.s.ServletContextHandler@19a40bd{/solr,null,AVAILABLE}
[junit4] 2> 1763773 INFO (jetty-launcher-3141-thread-2) [ ] o.e.j.s.session DefaultSessionIdManager workerName=node0
[junit4] 2> 1763774 INFO (jetty-launcher-3141-thread-2) [ ] o.e.j.s.session No SessionScavenger set, using defaults
[junit4] 2> 1763774 INFO (jetty-launcher-3141-thread-2) [ ] o.e.j.s.session Scavenging every 600000ms
[junit4] 2> 1763774 INFO (jetty-launcher-3141-thread-2) [ ] o.e.j.s.h.ContextHandler Started o.e.j.s.ServletContextHandler@5ae7ec{/solr,null,AVAILABLE}
[junit4] 2> 1763775 INFO (jetty-launcher-3141-thread-4) [ ] o.e.j.s.AbstractConnector Started ServerConnector@8a820e{SSL,[ssl, http/1.1]}{127.0.0.1:39687}
[junit4] 2> 1763775 INFO (jetty-launcher-3141-thread-4) [ ] o.e.j.s.Server Started @1763810ms
[junit4] 2> 1763775 INFO (jetty-launcher-3141-thread-4) [ ] o.a.s.c.s.e.JettySolrRunner Jetty properties: {hostContext=/solr, hostPort=39687}
[junit4] 2> 1763775 ERROR (jetty-launcher-3141-thread-4) [ ] o.a.s.u.StartupLoggingUtils Missing Java Option solr.log.dir. Logging may be missing or incomplete.
[junit4] 2> 1763775 INFO (jetty-launcher-3141-thread-4) [ ] o.a.s.s.SolrDispatchFilter Using logger factory org.apache.logging.slf4j.Log4jLoggerFactory
[junit4] 2> 1763775 INFO (jetty-launcher-3141-thread-4) [ ] o.a.s.s.SolrDispatchFilter ___ _ Welcome to Apache Solr? version 8.0.0
[junit4] 2> 1763775 INFO (jetty-launcher-3141-thread-4) [ ] o.a.s.s.SolrDispatchFilter / __| ___| |_ _ Starting in cloud mode on port null
[junit4] 2> 1763775 INFO (jetty-launcher-3141-thread-4) [ ] o.a.s.s.SolrDispatchFilter \__ \/ _ \ | '_| Install dir: null
[junit4] 2> 1763775 INFO (jetty-launcher-3141-thread-4) [ ] o.a.s.s.SolrDispatchFilter |___/\___/_|_| Start time: 2018-03-28T05:19:13.206Z
[junit4] 2> 1763795 INFO (jetty-launcher-3141-thread-2) [ ] o.e.j.s.AbstractConnector Started ServerConnector@1ed8a31{SSL,[ssl, http/1.1]}{127.0.0.1:37029}
[junit4] 2> 1763795 INFO (jetty-launcher-3141-thread-1) [ ] o.e.j.s.session DefaultSessionIdManager workerName=node0
[junit4] 2> 1763795 INFO (jetty-launcher-3141-thread-1) [ ] o.e.j.s.session No SessionScavenger set, using defaults
[junit4] 2> 1763795 INFO (jetty-launcher-3141-thread-2) [ ] o.e.j.s.Server Started @1763830ms
[junit4] 2> 1763795 INFO (jetty-launcher-3141-thread-1) [ ] o.e.j.s.session Scavenging every 660000ms
[junit4] 2> 1763795 INFO (jetty-launcher-3141-thread-2) [ ] o.a.s.c.s.e.JettySolrRunner Jetty properties: {hostContext=/solr, hostPort=37029}
[junit4] 2> 1763795 ERROR (jetty-launcher-3141-thread-2) [ ] o.a.s.u.StartupLoggingUtils Missing Java Option solr.log.dir. Logging may be missing or incomplete.
[junit4] 2> 1763795 INFO (jetty-launcher-3141-thread-1) [ ] o.e.j.s.h.ContextHandler Started o.e.j.s.ServletContextHandler@70f44b{/solr,null,AVAILABLE}
[junit4] 2> 1763795 INFO (jetty-launcher-3141-thread-2) [ ] o.a.s.s.SolrDispatchFilter Using logger factory org.apache.logging.slf4j.Log4jLoggerFactory
[junit4] 2> 1763795 INFO (zkConnectionManagerCallback-3146-thread-1) [ ] o.a.s.c.c.ConnectionManager zkClient has connected
[junit4] 2> 1763795 INFO (jetty-launcher-3141-thread-2) [ ] o.a.s.s.SolrDispatchFilter ___ _ Welcome to Apache Solr? version 8.0.0
[junit4] 2> 1763795 INFO (jetty-launcher-3141-thread-2) [ ] o.a.s.s.SolrDispatchFilter / __| ___| |_ _ Starting in cloud mode on port null
[junit4] 2> 1763795 INFO (jetty-launcher-3141-thread-2) [ ] o.a.s.s.SolrDispatchFilter \__ \/ _ \ | '_| Install dir: null
[junit4] 2> 1763795 INFO (jetty-launcher-3141-thread-2) [ ] o.a.s.s.SolrDispatchFilter |___/\___/_|_| Start time: 2018-03-28T05:19:13.226Z
[junit4] 2> 1763796 INFO (jetty-launcher-3141-thread-4) [ ] o.a.s.s.SolrDispatchFilter solr.xml found in ZooKeeper. Loading...
[junit4] 2> 1763796 INFO (jetty-launcher-3141-thread-1) [ ] o.e.j.s.AbstractConnector Started ServerConnector@17d17ac{SSL,[ssl, http/1.1]}{127.0.0.1:45235}
[junit4] 2> 1763796 INFO (jetty-launcher-3141-thread-1) [ ] o.e.j.s.Server Started @1763831ms
[junit4] 2> 1763796 INFO (jetty-launcher-3141-thread-1) [ ] o.a.s.c.s.e.JettySolrRunner Jetty properties: {hostContext=/solr, hostPort=45235}
[junit4] 2> 1763796 ERROR (jetty-launcher-3141-thread-1) [ ] o.a.s.u.StartupLoggingUtils Missing Java Option solr.log.dir. Logging may be missing or incomplete.
[junit4] 2> 1763796 INFO (jetty-launcher-3141-thread-1) [ ] o.a.s.s.SolrDispatchFilter Using logger factory org.apache.logging.slf4j.Log4jLoggerFactory
[junit4] 2> 1763796 INFO (jetty-launcher-3141-thread-1) [ ] o.a.s.s.SolrDispatchFilter ___ _ Welcome to Apache Solr? version 8.0.0
[junit4] 2> 1763796 INFO (jetty-launcher-3141-thread-1) [ ] o.a.s.s.SolrDispatchFilter / __| ___| |_ _ Starting in cloud mode on port null
[junit4] 2> 1763796 INFO (jetty-launcher-3141-thread-1) [ ] o.a.s.s.SolrDispatchFilter \__ \/ _ \ | '_| Install dir: null
[junit4] 2> 1763796 INFO (jetty-launcher-3141-thread-1) [ ] o.a.s.s.SolrDispatchFilter |___/\___/_|_| Start time: 2018-03-28T05:19:13.227Z
[junit4] 2> 1763798 INFO (jetty-launcher-3141-thread-3) [ ] o.e.j.s.session DefaultSessionIdManager workerName=node0
[junit4] 2> 1763798 INFO (zkConnectionManagerCallback-3148-thread-1) [ ] o.a.s.c.c.ConnectionManager zkClient has connected
[junit4] 2> 1763798 INFO (jetty-launcher-3141-thread-3) [ ] o.e.j.s.session No SessionScavenger set, using defaults
[junit4] 2> 1763799 INFO (jetty-launcher-3141-thread-3) [ ] o.e.j.s.session Scavenging every 600000ms
[junit4] 2> 1763799 INFO (jetty-launcher-3141-thread-2) [ ] o.a.s.s.SolrDispatchFilter solr.xml found in ZooKeeper. Loading...
[junit4] 2> 1763805 INFO (zkConnectionManagerCallback-3150-thread-1) [ ] o.a.s.c.c.ConnectionManager zkClient has connected
[junit4] 2> 1763805 INFO (jetty-launcher-3141-thread-3) [ ] o.e.j.s.h.ContextHandler Started o.e.j.s.ServletContextHandler@40537f{/solr,null,AVAILABLE}
[junit4] 2> 1763806 INFO (jetty-launcher-3141-thread-1) [ ] o.a.s.s.SolrDispatchFilter solr.xml found in ZooKeeper. Loading...
[junit4] 2> 1763806 INFO (jetty-launcher-3141-thread-3) [ ] o.e.j.s.AbstractConnector Started ServerConnector@212036{SSL,[ssl, http/1.1]}{127.0.0.1:36769}
[junit4] 2> 1763806 INFO (jetty-launcher-3141-thread-3) [ ] o.e.j.s.Server Started @1763841ms
[junit4] 2> 1763806 INFO (jetty-launcher-3141-thread-3) [ ] o.a.s.c.s.e.JettySolrRunner Jetty properties: {hostContext=/solr, hostPort=36769}
[junit4] 2> 1763806 ERROR (jetty-launcher-3141-thread-3) [ ] o.a.s.u.StartupLoggingUtils Missing Java Option solr.log.dir. Logging may be missing or incomplete.
[junit4] 2> 1763806 INFO (jetty-launcher-3141-thread-3) [ ] o.a.s.s.SolrDispatchFilter Using logger factory org.apache.logging.slf4j.Log4jLoggerFactory
[junit4] 2> 1763807 INFO (jetty-launcher-3141-thread-3) [ ] o.a.s.s.SolrDispatchFilter ___ _ Welcome to Apache Solr? version 8.0.0
[junit4] 2> 1763807 INFO (jetty-launcher-3141-thread-3) [ ] o.a.s.s.SolrDispatchFilter / __| ___| |_ _ Starting in cloud mode on port null
[junit4] 2> 1763807 INFO (jetty-launcher-3141-thread-3) [ ] o.a.s.s.SolrDispatchFilter \__ \/ _ \ | '_| Install dir: null
[junit4] 2> 1763807 INFO (jetty-launcher-3141-thread-3) [ ] o.a.s.s.SolrDispatchFilter |___/\___/_|_| Start time: 2018-03-28T05:19:13.238Z
[junit4] 2> 1763815 INFO (zkConnectionManagerCallback-3153-thread-1) [ ] o.a.s.c.c.ConnectionManager zkClient has connected
[junit4] 2> 1763816 INFO (jetty-launcher-3141-thread-3) [ ] o.a.s.s.SolrDispatchFilter solr.xml found in ZooKeeper. Loading...
[junit4] 2> 1763817 INFO (jetty-launcher-3141-thread-2) [ ] o.a.s.c.ZkContainer Zookeeper client=127.0.0.1:42151/solr
[junit4] 2> 1763819 INFO (jetty-launcher-3141-thread-4) [ ] o.a.s.c.ZkContainer Zookeeper client=127.0.0.1:42151/solr
[junit4] 2> 1763846 INFO (zkConnectionManagerCallback-3160-thread-1) [ ] o.a.s.c.c.ConnectionManager zkClient has connected
[junit4] 2> 1763846 INFO (zkConnectionManagerCallback-3157-thread-1) [ ] o.a.s.c.c.ConnectionManager zkClient has connected
[junit4] 2> 1763848 INFO (zkConnectionManagerCallback-3163-thread-1) [ ] o.a.s.c.c.ConnectionManager zkClient has connected
[junit4] 2> 1763848 INFO (jetty-launcher-3141-thread-1) [ ] o.a.s.c.ZkContainer Zookeeper client=127.0.0.1:42151/solr
[junit4] 2> 1763849 INFO (zkConnectionManagerCallback-3167-thread-1) [ ] o.a.s.c.c.ConnectionManager zkClient has connected
[junit4] 2> 1763849 INFO (zkConnectionManagerCallback-3170-thread-1) [ ] o.a.s.c.c.ConnectionManager zkClient has connected
[junit4] 2> 1763849 INFO (jetty-launcher-3141-thread-3) [ ] o.a.s.c.ZkContainer Zookeeper client=127.0.0.1:42151/solr
[junit4] 2> 1763850 WARN (NIOServerCxn.Factory:0.0.0.0/0.0.0.0:0) [ ] o.a.z.s.NIOServerCnxn Unable to read additional data from client sessionid 0x1008c3010740009, likely client has closed socket
[junit4] 2> 1763850 INFO (zkConnectionManagerCallback-3172-thread-1) [ ] o.a.s.c.c.ConnectionManager zkClient has connected
[junit4] 2> 1763851 INFO (zkConnectionManagerCallback-3174-thread-1) [ ] o.a.s.c.c.ConnectionManager zkClient has connected
[junit4] 2> 1763853 INFO (zkConnectionManagerCallback-3176-thread-1) [ ] o.a.s.c.c.ConnectionManager zkClient has connected
[junit4] 2> 1763891 INFO (jetty-launcher-3141-thread-1) [n:127.0.0.1:45235_solr ] o.a.s.c.Overseer Overseer (id=null) closing
[junit4] 2> 1763894 INFO (jetty-launcher-3141-thread-1) [n:127.0.0.1:45235_solr ] o.a.s.c.OverseerElectionContext I am going to be the leader 127.0.0.1:45235_solr
[junit4] 2> 1763896 INFO (jetty-launcher-3141-thread-1) [n:127.0.0.1:45235_solr ] o.a.s.c.Overseer Overseer (id=72211732100284427-127.0.0.1:45235_solr-n_0000000000) starting
[junit4] 2> 1763908 INFO (zkConnectionManagerCallback-3184-thread-1) [ ] o.a.s.c.c.ConnectionManager zkClient has connected
[junit4] 2> 1763911 INFO (jetty-launcher-3141-thread-1) [n:127.0.0.1:45235_solr ] o.a.s.c.s.i.ZkClientClusterStateProvider Cluster at 127.0.0.1:42151/solr ready
[junit4] 2> 1763915 INFO (jetty-launcher-3141-thread-1) [n:127.0.0.1:45235_solr ] o.a.s.c.ZkController Register node as live in ZooKeeper:/live_nodes/127.0.0.1:45235_solr
[junit4] 2> 1763917 INFO (zkCallback-3183-thread-1) [ ] o.a.s.c.c.ZkStateReader Updated live nodes from ZooKeeper... (0) -> (1)
[junit4] 2> 1763935 INFO (zkCallback-3173-thread-1) [ ] o.a.s.c.c.ZkStateReader Updated live nodes from ZooKeeper... (0) -> (1)
[junit4] 2> 1763958 INFO (jetty-launcher-3141-thread-3) [n:127.0.0.1:36769_solr ] o.a.s.c.c.ZkStateReader Updated live nodes from ZooKeeper... (0) -> (1)
[junit4] 2> 1763964 INFO (jetty-launcher-3141-thread-4) [n:127.0.0.1:39687_solr ] o.a.s.c.c.ZkStateReader Updated live nodes from ZooKeeper... (0) -> (1)
[junit4] 2> 1763965 INFO (jetty-launcher-3141-thread-3) [n:127.0.0.1:36769_solr ] o.a.s.c.Overseer Overseer (id=null) closing
[junit4] 2> 1763967 INFO (jetty-launcher-3141-thread-4) [n:127.0.0.1:39687_solr ] o.a.s.c.Overseer Overseer (id=null) closing
[junit4] 2> 1763968 INFO (jetty-launcher-3141-thread-3) [n:127.0.0.1:36769_solr ] o.a.s.c.TransientSolrCoreCacheDefault Allocating transient cache for 2147483647 transient cores
[junit4] 2> 1763968 INFO (jetty-launcher-3141-thread-3) [n:127.0.0.1:36769_solr ] o.a.s.c.ZkController Register node as live in ZooKeeper:/live_nodes/127.0.0.1:36769_solr
[junit4] 2> 1763969 INFO (jetty-launcher-3141-thread-4) [n:127.0.0.1:39687_solr ] o.a.s.c.TransientSolrCoreCacheDefault Allocating transient cache for 2147483647 transient cores
[junit4] 2> 1763969 INFO (jetty-launcher-3141-thread-4) [n:127.0.0.1:39687_solr ] o.a.s.c.ZkController Register node as live in ZooKeeper:/live_nodes/127.0.0.1:39687_solr
[junit4] 2> 1763969 INFO (zkCallback-3183-thread-1) [ ] o.a.s.c.c.ZkStateReader Updated live nodes from ZooKeeper... (1) -> (2)
[junit4] 2> 1763970 INFO (zkCallback-3183-thread-1) [ ] o.a.s.c.c.ZkStateReader Updated live nodes from ZooKeeper... (2) -> (3)
[junit4] 2> 1763976 INFO (jetty-launcher-3141-thread-2) [n:127.0.0.1:37029_solr ] o.a.s.c.c.ZkStateReader Updated live nodes from ZooKeeper... (0) -> (3)
[junit4] 2> 1763977 INFO (jetty-launcher-3141-thread-2) [n:127.0.0.1:37029_solr ] o.a.s.c.Overseer Overseer (id=null) closing
[junit4] 2> 1764012 INFO (jetty-launcher-3141-thread-2) [n:127.0.0.1:37029_solr ] o.a.s.c.TransientSolrCoreCacheDefault Allocating transient cache for 2147483647 transient cores
[junit4] 2> 1764012 INFO (jetty-launcher-3141-thread-2) [n:127.0.0.1:37029_solr ] o.a.s.c.ZkController Register node as live in ZooKeeper:/live_nodes/127.0.0.1:37029_solr
[junit4] 2> 1764022 INFO (zkCallback-3183-thread-1) [ ] o.a.s.c.c.ZkStateReader Updated live nodes from ZooKeeper... (3) -> (4)
[junit4] 2> 1764030 INFO (zkCallback-3175-thread-1) [ ] o.a.s.c.c.ZkStateReader Updated live nodes from ZooKeeper... (1) -> (4)
[junit4] 2> 1764030 INFO (zkCallback-3162-thread-1) [ ] o.a.s.c.c.ZkStateReader Updated live nodes from ZooKeeper... (1) -> (4)
[junit4] 2> 1764030 INFO (zkCallback-3173-thread-2) [ ] o.a.s.c.c.ZkStateReader Updated live nodes from ZooKeeper... (1) -> (4)
[junit4] 2> 1764050 INFO (zkCallback-3166-thread-1) [ ] o.a.s.c.c.ZkStateReader Updated live nodes from ZooKeeper... (3) -> (4)
[junit4] 2> 1764443 INFO (jetty-launcher-3141-thread-2) [n:127.0.0.1:37029_solr ] o.a.s.m.r.SolrJmxReporter JMX monitoring for 'solr_37029.solr.node' (registry 'solr.node') enabled at server: com.sun.jmx.mbeanserver.JmxMBeanServer@96fdc3
[junit4] 2> 1764454 INFO (jetty-launcher-3141-thread-2) [n:127.0.0.1:37029_solr ] o.a.s.m.r.SolrJmxReporter JMX monitoring for 'solr_37029.solr.jvm' (registry 'solr.jvm') enabled at server: com.sun.jmx.mbeanserver.JmxMBeanServer@96fdc3
[junit4] 2> 1764454 INFO (jetty-launcher-3141-thread-2) [n:127.0.0.1:37029_solr ] o.a.s.m.r.SolrJmxReporter JMX monitoring for 'solr_37029.solr.jetty' (registry 'solr.jetty') enabled at server: com.sun.jmx.mbeanserver.JmxMBeanServer@96fdc3
[junit4] 2> 1764455 INFO (jetty-launcher-3141-thread-2) [n:127.0.0.1:37029_solr ] o.a.s.c.CorePropertiesLocator Found 0 core definitions underneath /home/jenkins/workspace/Lucene-Solr-BadApples-master-Linux/solr/build/solr-core/test/J0/temp/solr.cloud.DeleteReplicaTest_79CAD9B151692749-001/tempDir-001/node2/.
[junit4] 2> 1764459 INFO (zkConnectionManagerCallback-3188-thread-1) [ ] o.a.s.c.c.ConnectionManager zkClient has connected
[junit4] 2> 1764460 INFO (jetty-launcher-3141-thread-2) [n:127.0.0.1:37029_solr ] o.a.s.c.c.ZkStateReader Updated live nodes from ZooKeeper... (0) -> (4)
[junit4] 2> 1764461 INFO (jetty-launcher-3141-thread-2) [n:127.0.0.1:37029_solr ] o.a.s.c.s.i.ZkClientClusterStateProvider Cluster at 127.0.0.1:42151/solr ready
[junit4] 2> 1764911 INFO (jetty-launcher-3141-thread-3) [n:127.0.0.1:36769_solr ] o.a.s.m.r.SolrJmxReporter JMX monitoring for 'solr_36769.solr.node' (registry 'solr.node') enabled at server: com.sun.jmx.mbeanserver.JmxMBeanServer@96fdc3
[junit4] 2> 1764925 INFO (jetty-launcher-3141-thread-3) [n:127.0.0.1:36769_solr ] o.a.s.m.r.SolrJmxReporter JMX monitoring for 'solr_36769.solr.jvm' (registry 'solr.jvm') enabled at server: com.sun.jmx.mbeanserver.JmxMBeanServer@96fdc3
[junit4] 2> 1764925 INFO (jetty-launcher-3141-thread-3) [n:127.0.0.1:36769_solr ] o.a.s.m.r.SolrJmxReporter JMX monitoring for 'solr_36769.solr.jetty' (registry 'solr.jetty') enabled at server: com.sun.jmx.mbeanserver.JmxMBeanServer@96fdc3
[junit4] 2> 1764926 INFO (jetty-launcher-3141-thread-3) [n:127.0.0.1:36769_solr ] o.a.s.c.CorePropertiesLocator Found 0 core definitions underneath /home/jenkins/workspace/Lucene-Solr-BadApples-master-Linux/solr/build/solr-core/test/J0/temp/solr.cloud.DeleteReplicaTest_79CAD9B151692749-001/tempDir-001/node3/.
[junit4] 2> 1764929 INFO (zkConnectionManagerCallback-3192-thread-1) [ ] o.a.s.c.c.ConnectionManager zkClient has connected
[junit4] 2> 1764930 INFO (jetty-launcher-3141-thread-3) [n:127.0.0.1:36769_solr ] o.a.s.c.c.ZkStateReader Updated live nodes from ZooKeeper... (0) -> (4)
[junit4] 2> 1764930 INFO (jetty-launcher-3141-thread-3) [n:127.0.0.1:36769_solr ] o.a.s.c.s.i.ZkClientClusterStateProvider Cluster at 127.0.0.1:42151/solr ready
[junit4] 2> 1765529 INFO (jetty-launcher-3141-thread-4) [n:127.0.0.1:39687_solr ] o.a.s.m.r.SolrJmxReporter JMX monitoring for 'solr_39687.solr.node' (registry 'solr.node') enabled at server: com.sun.jmx.mbeanserver.JmxMBeanServer@96fdc3
[junit4] 2> 1765538 INFO (jetty-launcher-3141-thread-4) [n:127.0.0.1:39687_solr ] o.a.s.m.r.SolrJmxReporter JMX monitoring for 'solr_39687.solr.jvm' (registry 'solr.jvm') enabled at server: com.sun.jmx.mbeanserver.JmxMBeanServer@96fdc3
[junit4] 2> 1765538 INFO (jetty-launcher-3141-thread-4) [n:127.0.0.1:39687_solr ] o.a.s.m.r.SolrJmxReporter JMX monitoring for 'solr_39687.solr.jetty' (registry 'solr.jetty') enabled at server: com.sun.jmx.mbeanserver.JmxMBeanServer@96fdc3
[junit4] 2> 1765539 INFO (jetty-launcher-3141-thread-4) [n:127.0.0.1:39687_solr ] o.a.s.c.CorePropertiesLocator Found 0 core definitions underneath /home/jenkins/workspace/Lucene-Solr-BadApples-master-Linux/solr/build/solr-core/test/J0/temp/solr.cloud.DeleteReplicaTest_79CAD9B151692749-001/tempDir-001/node4/.
[junit4] 2> 1765542 INFO (zkConnectionManagerCallback-3196-thread-1) [ ] o.a.s.c.c.ConnectionManager zkClient has connected
[junit4] 2> 1765544 INFO (jetty-launcher-3141-thread-4) [n:127.0.0.1:39687_solr ] o.a.s.c.c.ZkStateReader Updated live nodes from ZooKeeper... (0) -> (4)
[junit4] 2> 1765544 INFO (jetty-launcher-3141-thread-4) [n:127.0.0.1:39687_solr ] o.a.s.c.s.i.ZkClientClusterStateProvider Cluster at 127.0.0.1:42151/solr ready
[junit4] 2> 1766635 INFO (jetty-launcher-3141-thread-1) [n:127.0.0.1:45235_solr ] o.a.s.m.r.SolrJmxReporter JMX monitoring for 'solr_45235.solr.node' (registry 'solr.node') enabled at server: com.sun.jmx.mbeanserver.JmxMBeanServer@96fdc3
[junit4] 2> 1766644 INFO (jetty-launcher-3141-thread-1) [n:127.0.0.1:45235_solr ] o.a.s.m.r.SolrJmxReporter JMX monitoring for 'solr_45235.solr.jvm' (registry 'solr.jvm') enabled at server: com.sun.jmx.mbeanserver.JmxMBeanServer@96fdc3
[junit4] 2> 1766644 INFO (jetty-launcher-3141-thread-1) [n:127.0.0.1:45235_solr ] o.a.s.m.r.SolrJmxReporter JMX monitoring for 'solr_45235.solr.jetty' (registry 'solr.jetty') enabled at server: com.sun.jmx.mbeanserver.JmxMBeanServer@96fdc3
[junit4] 2> 1766645 INFO (jetty-launcher-3141-thread-1) [n:127.0.0.1:45235_solr ] o.a.s.c.CorePropertiesLocator Found 0 core definitions underneath /home/jenkins/workspace/Lucene-Solr-BadApples-master-Linux/solr/build/solr-core/test/J0/temp/solr.cloud.DeleteReplicaTest_79CAD9B151692749-001/tempDir-001/node1/.
[junit4] 2> 1766701 INFO (zkConnectionManagerCallback-3198-thread-1) [ ] o.a.s.c.c.ConnectionManager zkClient has connected
[junit4] 2> 1766705 INFO (zkConnectionManagerCallback-3202-thread-1) [ ] o.a.s.c.c.ConnectionManager zkClient has connected
[junit4] 2> 1766706 INFO (SUITE-DeleteReplicaTest-seed#[79CAD9B151692749]-worker) [ ] o.a.s.c.c.ZkStateReader Updated live nodes from ZooKeeper... (0) -> (4)
[junit4] 2> 1766707 INFO (SUITE-DeleteReplicaTest-seed#[79CAD9B151692749]-worker) [ ] o.a.s.c.s.i.ZkClientClusterStateProvider Cluster at 127.0.0.1:42151/solr ready
[junit4] 2> 1766735 INFO (TEST-DeleteReplicaTest.deleteReplicaAndVerifyDirectoryCleanup-seed#[79CAD9B151692749]) [ ] o.a.s.SolrTestCaseJ4 ###Starting deleteReplicaAndVerifyDirectoryCleanup
[junit4] 2> 1766815 INFO (qtp28357171-18214) [n:127.0.0.1:36769_solr ] o.a.s.h.a.CollectionsHandler Invoked Collection Action :create with params replicationFactor=2&collection.configName=conf&name=deletereplica_test&nrtReplicas=2&action=CREATE&numShards=1&wt=javabin&version=2 and sendToOCPQueue=true
[junit4] 2> 1766816 INFO (OverseerThreadFactory-5512-thread-1) [ ] o.a.s.c.a.c.CreateCollectionCmd Create collection deletereplica_test
[junit4] 2> 1766924 INFO (OverseerStateUpdate-72211732100284427-127.0.0.1:45235_solr-n_0000000000) [ ] o.a.s.c.o.SliceMutator createReplica() {
[junit4] 2> "operation":"ADDREPLICA",
[junit4] 2> "collection":"deletereplica_test",
[junit4] 2> "shard":"shard1",
[junit4] 2> "core":"deletereplica_test_shard1_replica_n1",
[junit4] 2> "state":"down",
[junit4] 2> "base_url":"https://127.0.0.1:36769/solr",
[junit4] 2> "type":"NRT",
[junit4] 2> "waitForFinalState":"false"}
[junit4] 2> 1766925 INFO (OverseerStateUpdate-72211732100284427-127.0.0.1:45235_solr-n_0000000000) [ ] o.a.s.c.o.SliceMutator createReplica() {
[junit4] 2> "operation":"ADDREPLICA",
[junit4] 2> "collection":"deletereplica_test",
[junit4] 2> "shard":"shard1",
[junit4] 2> "core":"deletereplica_test_shard1_replica_n2",
[junit4] 2> "state":"down",
[junit4] 2> "base_url":"https://127.0.0.1:39687/solr",
[junit4] 2> "type":"NRT",
[junit4] 2> "waitForFinalState":"false"}
[junit4] 2> 1767132 INFO (qtp28357171-18215) [n:127.0.0.1:36769_solr ] o.a.s.h.a.CoreAdminOperation core create command qt=/admin/cores&coreNodeName=core_node3&collection.configName=conf&newCollection=true&name=deletereplica_test_shard1_replica_n1&action=CREATE&numShards=1&collection=deletereplica_test&shard=shard1&wt=javabin&version=2&replicaType=NRT
[junit4] 2> 1767197 INFO (qtp8695802-18185) [n:127.0.0.1:39687_solr ] o.a.s.h.a.CoreAdminOperation core create command qt=/admin/cores&coreNodeName=core_node4&collection.configName=conf&newCollection=true&name=deletereplica_test_shard1_replica_n2&action=CREATE&numShards=1&collection=deletereplica_test&shard=shard1&wt=javabin&version=2&replicaType=NRT
[junit4] 2> 1767301 INFO (zkCallback-3162-thread-1) [ ] o.a.s.c.c.ZkStateReader A cluster state change: [WatchedEvent state:SyncConnected type:NodeDataChanged path:/collections/deletereplica_test/state.json] for collection [deletereplica_test] has occurred - updating... (live nodes size: [4])
[junit4] 2> 1767301 INFO (zkCallback-3175-thread-1) [ ] o.a.s.c.c.ZkStateReader A cluster state change: [WatchedEvent state:SyncConnected type:NodeDataChanged path:/collections/deletereplica_test/state.json] for collection [deletereplica_test] has occurred - updating... (live nodes size: [4])
[junit4] 2> 1767302 INFO (zkCallback-3162-thread-2) [ ] o.a.s.c.c.ZkStateReader A cluster state change: [WatchedEvent state:SyncConnected type:NodeDataChanged path:/collections/deletereplica_test/state.json] for collection [deletereplica_test] has occurred - updating... (live nodes size: [4])
[junit4] 2> 1767302 INFO (zkCallback-3175-thread-2) [ ] o.a.s.c.c.ZkStateReader A cluster state change: [WatchedEvent state:SyncConnected type:NodeDataChanged path:/collections/deletereplica_test/state.json] for collection [deletereplica_test] has occurred - updating... (live nodes size: [4])
[junit4] 2> 1768147 INFO (qtp28357171-18215) [n:127.0.0.1:36769_solr c:deletereplica_test s:shard1 r:core_node3 x:deletereplica_test_shard1_replica_n1] o.a.s.c.SolrConfig Using Lucene MatchVersion: 8.0.0
[junit4] 2> 1768160 INFO (qtp28357171-18215) [n:127.0.0.1:36769_solr c:deletereplica_test s:shard1 r:core_node3 x:deletereplica_test_shard1_replica_n1] o.a.s.s.IndexSchema [deletereplica_test_shard1_replica_n1] Schema name=minimal
[junit4] 2> 1768163 INFO (qtp28357171-18215) [n:127.0.0.1:36769_solr c:deletereplica_test s:shard1 r:core_node3 x:deletereplica_test_shard1_replica_n1] o.a.s.s.IndexSchema Loaded schema minimal/1.1 with uniqueid field id
[junit4] 2> 1768163 INFO (qtp28357171-18215) [n:127.0.0.1:36769_solr c:deletereplica_test s:shard1 r:core_node3 x:deletereplica_test_shard1_replica_n1] o.a.s.c.CoreContainer Creating SolrCore 'deletereplica_test_shard1_replica_n1' using configuration from collection deletereplica_test, trusted=true
[junit4] 2> 1768164 INFO (qtp28357171-18215) [n:127.0.0.1:36769_solr c:deletereplica_test s:shard1 r:core_node3 x:deletereplica_test_shard1_replica_n1] o.a.s.m.r.SolrJmxReporter JMX monitoring for 'solr_36769.solr.core.deletereplica_test.shard1.replica_n1' (registry 'solr.core.deletereplica_test.shard1.replica_n1') enabled at server: com.sun.jmx.mbeanserver.JmxMBeanServer@96fdc3
[junit4] 2> 1768164 INFO (qtp28357171-18215) [n:127.0.0.1:36769_solr c:deletereplica_test s:shard1 r:core_node3 x:deletereplica_test_shard1_replica_n1] o.a.s.c.SolrCore solr.RecoveryStrategy.Builder
[junit4] 2> 1768164 INFO (qtp28357171-18215) [n:127.0.0.1:36769_solr c:deletereplica_test s:shard1 r:core_node3 x:deletereplica_test_shard1_replica_n1] o.a.s.c.SolrCore [[deletereplica_test_shard1_replica_n1] ] Opening new SolrCore at [/home/jenkins/workspace/Lucene-Solr-BadApples-master-Linux/solr/build/solr-core/test/J0/temp/solr.cloud.DeleteReplicaTest_79CAD9B151692749-001/tempDir-001/node3/deletereplica_test_shard1_replica_n1], dataDir=[/home/jenkins/workspace/Lucene-Solr-BadApples-master-Linux/solr/build/solr-core/test/J0/temp/solr.cloud.DeleteReplicaTest_79CAD9B151692749-001/tempDir-001/node3/./deletereplica_test_shard1_replica_n1/data/]
[junit4] 2> 1768210 INFO (qtp8695802-18185) [n:127.0.0.1:39687_solr c:deletereplica_test s:shard1 r:core_node4 x:deletereplica_test_shard1_replica_n2] o.a.s.c.SolrConfig Using Lucene MatchVersion: 8.0.0
[junit4] 2> 1768220 INFO (qtp8695802-18185) [n:127.0.0.1:39687_solr c:deletereplica_test s:shard1 r:core_node4 x:deletereplica_test_shard1_replica_n2] o.a.s.s.IndexSchema [deletereplica_test_shard1_replica_n2] Schema name=minimal
[junit4] 2> 1768224 INFO (qtp8695802-18185) [n:127.0.0.1:39687_solr c:deletereplica_test s:shard1 r:core_node4 x:deletereplica_test_shard1_replica_n2] o.a.s.s.IndexSchema Loaded schema minimal/1.1 with uniqueid field id
[junit4] 2> 1768224 INFO (qtp8695802-18185) [n:127.0.0.1:39687_solr c:deletereplica_test s:shard1 r:core_node4 x:deletereplica_test_shard1_replica_n2] o.a.s.c.CoreContainer Creating SolrCore 'deletereplica_test_shard1_replica_n2' using configuration from collection deletereplica_test, trusted=true
[junit4] 2> 1768225 INFO (qtp8695802-18185) [n:127.0.0.1:39687_solr c:deletereplica_test s:shard1 r:core_node4 x:deletereplica_test_shard1_replica_n2] o.a.s.m.r.SolrJmxReporter JMX monitoring for 'solr_39687.solr.core.deletereplica_test.shard1.replica_n2' (registry 'solr.core.deletereplica_test.shard1.replica_n2') enabled at server: com.sun.jmx.mbeanserver.JmxMBeanServer@96fdc3
[junit4] 2> 1768225 INFO (qtp8695802-18185) [n:127.0.0.1:39687_solr c:deletereplica_test s:shard1 r:core_node4 x:deletereplica_test_shard1_replica_n2] o.a.s.c.SolrCore solr.RecoveryStrategy.Builder
[junit4] 2> 1768225 INFO (qtp8695802-18185) [n:127.0.0.1:39687_solr c:deletereplica_test s:shard1 r:core_node4 x:deletereplica_test_shard1_replica_n2] o.a.s.c.SolrCore [[deletereplica_test_shard1_replica_n2] ] Opening new SolrCore at [/home/jenkins/workspace/Lucene-Solr-BadApples-master-Linux/solr/build/solr-core/test/J0/temp/solr.cloud.DeleteReplicaTest_79CAD9B151692749-001/tempDir-001/node4/deletereplica_test_shard1_replica_n2], dataDir=[/home/jenkins/workspace/Lucene-Solr-BadApples-master-Linux/solr/build/solr-core/test/J0/temp/solr.cloud.DeleteReplicaTest_79CAD9B151692749-001/tempDir-001/node4/./deletereplica_test_shard1_replica_n2/data/]
[junit4] 2> 1768252 INFO (qtp28357171-18215) [n:127.0.0.1:36769_solr c:deletereplica_test s:shard1 r:core_node3 x:deletereplica_test_shard1_replica_n1] o.a.s.u.UpdateHandler Using UpdateLog implementation: org.apache.solr.update.UpdateLog
[junit4] 2> 1768252 INFO (qtp28357171-18215) [n:127.0.0.1:36769_solr c:deletereplica_test s:shard1 r:core_node3 x:deletereplica_test_shard1_replica_n1] o.a.s.u.UpdateLog Initializing UpdateLog: dataDir=null defaultSyncLevel=FLUSH numRecordsToKeep=100 maxNumLogsToKeep=10 numVersionBuckets=65536
[junit4] 2> 1768254 INFO (qtp28357171-18215) [n:127.0.0.1:36769_solr c:deletereplica_test s:shard1 r:core_node3 x:deletereplica_test_shard1_replica_n1] o.a.s.u.CommitTracker Hard AutoCommit: disabled
[junit4] 2> 1768254 INFO (qtp28357171-18215) [n:127.0.0.1:36769_solr c:deletereplica_test s:shard1 r:core_node3 x:deletereplica_test_shard1_replica_n1] o.a.s.u.CommitTracker Soft AutoCommit: disabled
[junit4] 2> 1768257 INFO (qtp28357171-18215) [n:127.0.0.1:36769_solr c:deletereplica_test s:shard1 r:core_node3 x:deletereplica_test_shard1_replica_n1] o.a.s.s.SolrIndexSearcher Opening [Searcher@18a3e35[deletereplica_test_shard1_replica_n1] main]
[junit4] 2> 1768258 INFO (qtp28357171-18215) [n:127.0.0.1:36769_solr c:deletereplica_test s:shard1 r:core_node3 x:deletereplica_test_shard1_replica_n1] o.a.s.r.ManagedResourceStorage Configured ZooKeeperStorageIO with znodeBase: /configs/conf
[junit4] 2> 1768258 INFO (qtp28357171-18215) [n:127.0.0.1:36769_solr c:deletereplica_test s:shard1 r:core_node3 x:deletereplica_test_shard1_replica_n1] o.a.s.r.ManagedResourceStorage Loaded null at path _rest_managed.json using ZooKeeperStorageIO:path=/configs/conf
[junit4] 2> 1768259 INFO (qtp28357171-18215) [n:127.0.0.1:36769_solr c:deletereplica_test s:shard1 r:core_node3 x:deletereplica_test_shard1_replica_n1] o.a.s.h.ReplicationHandler Commits will be reserved for 10000ms.
[junit4] 2> 1768261 INFO (searcherExecutor-5521-thread-1-processing-n:127.0.0.1:36769_solr x:deletereplica_test_shard1_replica_n1 c:deletereplica_test s:shard1 r:core_node3) [n:127.0.0.1:36769_solr c:deletereplica_test s:shard1 r:core_node3 x:deletereplica_test_shard1_replica_n1] o.a.s.c.SolrCore [deletereplica_test_shard1_replica_n1] Registered new searcher Searcher@18a3e35[deletereplica_test_shard1_replica_n1] main{ExitableDirectoryReader(UninvertingDirectoryReader())}
[junit4] 2> 1768261 INFO (qtp28357171-18215) [n:127.0.0.1:36769_solr c:deletereplica_test s:shard1 r:core_node3 x:deletereplica_test_shard1_replica_n1] o.a.s.u.UpdateLog Could not find max version in index or recent updates, using new clock 1596157442331246592
[junit4] 2> 1768276 INFO (qtp28357171-18215) [n:127.0.0.1:36769_solr c:deletereplica_test s:shard1 r:core_node3 x:deletereplica_test_shard1_replica_n1] o.a.s.c.ZkShardTerms Successful update of terms at /collections/deletereplica_test/terms/shard1 to Terms{values={core_node3=0}, version=0}
[junit4] 2> 1768280 INFO (qtp28357171-18215) [n:127.0.0.1:36769_solr c:deletereplica_test s:shard1 r:core_node3 x:deletereplica_test_shard1_replica_n1] o.a.s.c.ShardLeaderElectionContext Waiting until we see more replicas up for shard shard1: total=2 found=1 timeoutin=9999ms
[junit4] 2> 1768306 INFO (qtp8695802-18185) [n:127.0.0.1:39687_solr c:deletereplica_test s:shard1 r:core_node4 x:deletereplica_test_shard1_replica_n2] o.a.s.u.UpdateHandler Using UpdateLog implementation: org.apache.solr.update.UpdateLog
[junit4] 2> 1768306 INFO (qtp8695802-18185) [n:127.0.0.1:39687_solr c:deletereplica_test s:shard1 r:core_node4 x:deletereplica_test_shard1_replica_n2] o.a.s.u.UpdateLog Initializing UpdateLog: dataDir=null defaultSyncLevel=FLUSH numRecordsToKeep=100 maxNumLogsToKeep=10 numVersionBuckets=65536
[junit4] 2> 1768308 INFO (qtp8695802-18185) [n:127.0.0.1:39687_solr c:deletereplica_test s:shard1 r:core_node4 x:deletereplica_test_shard1_replica_n2] o.a.s.u.CommitTracker Hard AutoCommit: disabled
[junit4] 2> 1768308 INFO (qtp8695802-18185) [n:127.0.0.1:39687_solr c:deletereplica_test s:shard1 r:core_node4 x:deletereplica_test_shard1_replica_n2] o.a.s.u.CommitTracker Soft AutoCommit: disabled
[junit4] 2> 1768310 INFO (qtp8695802-18185) [n:127.0.0.1:39687_solr c:deletereplica_test s:shard1 r:core_node4 x:deletereplica_test_shard1_replica_n2] o.a.s.s.SolrIndexSearcher Opening [Searcher@b9a352[deletereplica_test_shard1_replica_n2] main]
[junit4] 2> 1768311 INFO (qtp8695802-18185) [n:127.0.0.1:39687_solr c:deletereplica_test s:shard1 r:core_node4 x:deletereplica_test_shard1_replica_n2] o.a.s.r.ManagedResourceStorage Configured ZooKeeperStorageIO with znodeBase: /configs/conf
[junit4] 2> 1768311 INFO (qtp8695802-18185) [n:127.0.0.1:39687_solr c:deletereplica_test s:shard1 r:core_node4 x:deletereplica_test_shard1_replica_n2] o.a.s.r.ManagedResourceStorage Loaded null at path _rest_managed.json using ZooKeeperStorageIO:path=/configs/conf
[junit4] 2> 1768313 INFO (qtp8695802-18185) [n:127.0.0.1:39687_solr c:deletereplica_test s:shard1 r:core_node4 x:deletereplica_test_shard1_replica_n2] o.a.s.h.ReplicationHandler Commits will be reserved for 10000ms.
[junit4] 2> 1768314 INFO (searcherExecutor-5523-thread-1-processing-n:127.0.0.1:39687_solr x:deletereplica_test_shard1_replica_n2 c:deletereplica_test s:shard1 r:core_node4) [n:127.0.0.1:39687_solr c:deletereplica_test s:shard1 r:core_node4 x:deletereplica_test_shard1_replica_n2] o.a.s.c.SolrCore [deletereplica_test_shard1_replica_n2] Registered new searcher Searcher@b9a352[deletereplica_test_shard1_replica_n2] main{ExitableDirectoryReader(UninvertingDirectoryReader())}
[junit4] 2> 1768314 INFO (qtp8695802-18185) [n:127.0.0.1:39687_solr c:deletereplica_test s:shard1 r:core_node4 x:deletereplica_test_shard1_replica_n2] o.a.s.u.UpdateLog Could not find max version in index or recent updates, using new clock 1596157442386821120
[junit4] 2> 1768318 INFO (qtp8695802-18185) [n:127.0.0.1:39687_solr c:deletereplica_test s:shard1 r:core_node4 x:deletereplica_test_shard1_replica_n2] o.a.s.c.ZkShardTerms Successful update of terms at /collections/deletereplica_test/terms/shard1 to Terms{values={core_node3=0, core_node4=0}, version=1}
[junit4] 2> 1768381 INFO (zkCallback-3162-thread-1) [ ] o.a.s.c.c.ZkStateReader A cluster state change: [WatchedEvent state:SyncConnected type:NodeDataChanged path:/collections/deletereplica_test/state.json] for collection [deletereplica_test] has occurred - updating... (live nodes size: [4])
[junit4] 2> 1768381 INFO (zkCallback-3162-thread-2) [ ] o.a.s.c.c.ZkStateReader A cluster state change: [WatchedEvent state:SyncConnected type:NodeDataChanged path:/collections/deletereplica_test/state.json] for collection [deletereplica_test] has occurred - updating... (live nodes size: [4])
[junit4] 2> 1768381 INFO (zkCallback-3175-thread-2) [ ] o.a.s.c.c.ZkStateReader A cluster state change: [WatchedEvent state:SyncConnected type:NodeDataChanged path:/collections/deletereplica_test/state.json] for collection [deletereplica_test] has occurred - updating... (live nodes size: [4])
[junit4] 2> 1768381 INFO (zkCallback-3175-thread-1) [ ] o.a.s.c.c.ZkStateReader A cluster state change: [WatchedEvent state:SyncConnected type:NodeDataChanged path:/collections/deletereplica_test/state.json] for collection [deletereplica_test] has occurred - updating... (live nodes size: [4])
[junit4] 2> 1768781 INFO (qtp28357171-18215) [n:127.0.0.1:36769_solr c:deletereplica_test s:shard1 r:core_node3 x:deletereplica_test_shard1_replica_n1] o.a.s.c.ShardLeaderElectionContext Enough replicas found to continue.
[junit4] 2> 1768781 INFO (qtp28357171-18215) [n:127.0.0.1:36769_solr c:deletereplica_test s:shard1 r:core_node3 x:deletereplica_test_shard1_replica_n1] o.a.s.c.ShardLeaderElectionContext I may be the new leader - try and sync
[junit4] 2> 1768781 INFO (qtp28357171-18215) [n:127.0.0.1:36769_solr c:deletereplica_test s:shard1 r:core_node3 x:deletereplica_test_shard1_replica_n1] o.a.s.c.SyncStrategy Sync replicas to https://127.0.0.1:36769/solr/deletereplica_test_shard1_replica_n1/
[junit4] 2> 1768782 INFO (qtp28357171-18215) [n:127.0.0.1:36769_solr c:deletereplica_test s:shard1 r:core_node3 x:deletereplica_test_shard1_replica_n1] o.a.s.u.PeerSync PeerSync: core=deletereplica_test_shard1_replica_n1 url=https://127.0.0.1:36769/solr START replicas=[https://127.0.0.1:39687/solr/deletereplica_test_shard1_replica_n2/] nUpdates=100
[junit4] 2> 1768789 INFO (qtp8695802-18181) [n:127.0.0.1:39687_solr c:deletereplica_test s:shard1 r:core_node4 x:deletereplica_test_shard1_replica_n2] o.a.s.c.S.Request [deletereplica_test_shard1_replica_n2] webapp=/solr path=/get params={distrib=false&qt=/get&fingerprint=false&getVersions=100&wt=javabin&version=2} status=0 QTime=0
[junit4] 2> 1769082 INFO (qtp28357171-18215) [n:127.0.0.1:36769_solr c:deletereplica_test s:shard1 r:core_node3 x:deletereplica_test_shard1_replica_n1] o.a.s.u.PeerSync PeerSync: core=deletereplica_test_shard1_replica_n1 url=https://127.0.0.1:36769/solr DONE. We have no versions. sync failed.
[junit4] 2> 1769082 INFO (qtp28357171-18215) [n:127.0.0.1:36769_solr c:deletereplica_test s:shard1 r:core_node3 x:deletereplica_test_shard1_replica_n1] o.a.s.c.SyncStrategy Leader's attempt to sync with shard failed, moving to the next candidate
[junit4] 2> 1769082 INFO (qtp28357171-18215) [n:127.0.0.1:36769_solr c:deletereplica_test s:shard1 r:core_node3 x:deletereplica_test_shard1_replica_n1] o.a.s.c.ShardLeaderElectionContext We failed sync, but we have no versions - we can't sync in that case - we were active before, so become leader anyway
[junit4] 2> 1769082 INFO (qtp28357171-18215) [n:127.0.0.1:36769_solr c:deletereplica_test s:shard1 r:core_node3 x:deletereplica_test_shard1_replica_n1] o.a.s.c.ShardLeaderElectionContext Found all replicas participating in election, clear LIR
[junit4] 2> 1769085 INFO (qtp28357171-18215) [n:127.0.0.1:36769_solr c:deletereplica_test s:shard1 r:core_node3 x:deletereplica_test_shard1_replica_n1] o.a.s.c.ShardLeaderElectionContext I am the new leader: https://127.0.0.1:36769/solr/deletereplica_test_shard1_replica_n1/ shard1
[junit4] 2> 1769187 INFO (zkCallback-3175-thread-2) [ ] o.a.s.c.c.ZkStateReader A cluster state change: [WatchedEvent state:SyncConnected type:NodeDataChanged path:/collections/deletereplica_test/state.json] for collection [deletereplica_test] has occurred - updating... (live nodes size: [4])
[junit4] 2> 1769187 INFO (zkCallback-3175-thread-1) [ ] o.a.s.c.c.ZkStateReader A cluster state change: [WatchedEvent state:SyncConnected type:NodeDataChanged path:/collections/deletereplica_test/state.json] for collection [deletereplica_test] has occurred - updating... (live nodes size: [4])
[junit4] 2> 1769187 INFO (zkCallback-3162-thread-1) [ ] o.a.s.c.c.ZkStateReader A cluster state change: [WatchedEvent state:SyncConnected type:NodeDataChanged path:/collections/deletereplica_test/state.json] for collection [deletereplica_test] has occurred - updating... (live nodes size: [4])
[junit4] 2> 1769187 INFO (zkCallback-3162-thread-2) [ ] o.a.s.c.c.ZkStateReader A cluster state change: [WatchedEvent state:SyncConnected type:NodeDataChanged path:/collections/deletereplica_test/state.json] for collection [deletereplica_test] has occurred - updating... (live nodes size: [4])
[junit4] 2> 1769236 INFO (qtp28357171-18215) [n:127.0.0.1:36769_solr c:deletereplica_test s:shard1 r:core_node3 x:deletereplica_test_shard1_replica_n1] o.a.s.c.ZkController I am the leader, no recovery necessary
[junit4] 2> 1769277 INFO (qtp28357171-18215) [n:127.0.0.1:36769_solr c:deletereplica_test s:shard1 r:core_node3 x:deletereplica_test_shard1_replica_n1] o.a.s.s.HttpSolrCall [admin] webapp=null path=/admin/cores params={qt=/admin/cores&coreNodeName=core_node3&collection.configName=conf&newCollection=true&name=deletereplica_test_shard1_replica_n1&action=CREATE&numShards=1&collection=deletereplica_test&shard=shard1&wt=javabin&version=2&replicaType=NRT} status=0 QTime=2144
[junit4] 2> 1769322 INFO (qtp8695802-18185) [n:127.0.0.1:39687_solr c:deletereplica_test s:shard1 r:core_node4 x:deletereplica_test_shard1_replica_n2] o.a.s.s.HttpSolrCall [admin] webapp=null path=/admin/cores params={qt=/admin/cores&coreNodeName=core_node4&collection.configName=conf&newCollection=true&name=deletereplica_test_shard1_replica_n2&action=CREATE&numShards=1&collection=deletereplica_test&shard=shard1&wt=javabin&version=2&replicaType=NRT} status=0 QTime=2124
[junit4] 2> 1769325 INFO (qtp28357171-18214) [n:127.0.0.1:36769_solr ] o.a.s.h.a.CollectionsHandler Wait for new collection to be active for at most 30 seconds. Check all shard replicas
[junit4] 2> 1769422 INFO (zkCallback-3162-thread-1) [ ] o.a.s.c.c.ZkStateReader A cluster state change: [WatchedEvent state:SyncConnected type:NodeDataChanged path:/collections/deletereplica_test/state.json] for collection [deletereplica_test] has occurred - updating... (live nodes size: [4])
[junit4] 2> 1769422 INFO (zkCallback-3175-thread-1) [ ] o.a.s.c.c.ZkStateReader A cluster state change: [WatchedEvent state:SyncConnected type:NodeDataChanged path:/collections/deletereplica_test/state.json] for collection [deletereplica_test] has occurred - updating... (live nodes size: [4])
[junit4] 2> 1769422 INFO (zkCallback-3162-thread-2) [ ] o.a.s.c.c.ZkStateReader A cluster state change: [WatchedEvent state:SyncConnected type:NodeDataChanged path:/collections/deletereplica_test/state.json] for collection [deletereplica_test] has occurred - updating... (live nodes size: [4])
[junit4] 2> 1769422 INFO (zkCallback-3175-thread-2) [ ] o.a.s.c.c.ZkStateReader A cluster state change: [WatchedEvent state:SyncConnected type:NodeDataChanged path:/collections/deletereplica_test/state.json] for collection [deletereplica_test] has occurred - updating... (live nodes size: [4])
[junit4] 2> 1770326 INFO (qtp28357171-18214) [n:127.0.0.1:36769_solr ] o.a.s.s.HttpSolrCall [admin] webapp=null path=/admin/collections params={replicationFactor=2&collection.configName=conf&name=deletereplica_test&nrtReplicas=2&action=CREATE&numShards=1&wt=javabin&version=2} status=0 QTime=3511
[junit4] 2> 1770329 INFO (qtp28357171-18217) [n:127.0.0.1:36769_solr ] o.a.s.s.HttpSolrCall [admin] webapp=null path=/admin/cores params={action=STATUS&indexInfo=true&wt=javabin&version=2} status=0 QTime=0
[junit4] 2> 1770333 INFO (qtp28357171-18214) [n:127.0.0.1:36769_solr ] o.a.s.h.a.CollectionsHandler Invoked Collection Action :deletereplica with params replica=core_node3&action=DELETEREPLICA&collection=deletereplica_test&shard=shard1&wt=javabin&version=2 and sendToOCPQueue=true
[junit4] 2> 1770335 INFO (OverseerCollectionConfigSetProcessor-72211732100284427-127.0.0.1:45235_solr-n_0000000000) [ ] o.a.s.c.OverseerTaskQueue Response ZK path: /overseer/collection-queue-work/qnr-0000000000 doesn't exist. Requestor may have disconnected from ZooKeeper
[junit4] 2> 1770337 INFO (qtp28357171-18200) [n:127.0.0.1:36769_solr ] o.a.s.m.SolrMetricManager Closing metric reporters for registry=solr.core.deletereplica_test.shard1.replica_n1, tag=null
[junit4] 2> 1770338 INFO (qtp28357171-18200) [n:127.0.0.1:36769_solr ] o.a.s.m.r.SolrJmxReporter Closing reporter [org.apache.solr.metrics.reporters.SolrJmxReporter@119ea7e: rootName = solr_36769, domain = solr.core.deletereplica_test.shard1.replica_n1, service url = null, agent id = null] for registry solr.core.deletereplica_test.shard1.replica_n1 / com.codahale.metrics.MetricRegistry@5c3e0e
[junit4] 2> 1770358 INFO (qtp28357171-18200) [n:127.0.0.1:36769_solr ] o.a.s.c.SolrCore [deletereplica_test_shard1_replica_n1] CLOSING SolrCore org.apache.solr.core.SolrCore@1c89f62
[junit4] 2> 1770358 INFO (qtp28357171-18200) [n:127.0.0.1:36769_solr ] o.a.s.m.SolrMetricManager Closing metric reporters for registry=solr.core.deletereplica_test.shard1.replica_n1, tag=29925218
[junit4] 2> 1770358 INFO (qtp28357171-18200) [n:127.0.0.1:36769_solr ] o.a.s.m.SolrMetricManager Closing metric reporters for registry=solr.collection.deletereplica_test.shard1.leader, tag=29925218
[junit4] 2> 1770360 INFO (qtp28357171-18200) [n:127.0.0.1:36769_solr ] o.a.s.c.ZkShardTerms Successful update of terms at /collections/deletereplica_test/terms/shard1 to Terms{values={core_node4=0}, version=2}
[junit4] 2> 1770361 INFO (qtp28357171-18200) [n:127.0.0.1:36769_solr ] o.a.s.s.HttpSolrCall [admin] webapp=null path=/admin/cores params={deleteInstanceDir=true&core=deletereplica_test_shard1_replica_n1&qt=/admin/cores&deleteDataDir=true&action=UNLOAD&wt=javabin&version=2&deleteIndex=true} status=0 QTime=23
[junit4] 2> 1770361 INFO (zkCallback-3162-thread-1) [n:127.0.0.1:39687_solr c:deletereplica_test s:shard1 r:core_node4 x:deletereplica_test_shard1_replica_n2] o.a.s.c.ShardLeaderElectionContext I may be the new leader - try and sync
[junit4] 2> 1770463 INFO (zkCallback-3162-thread-2) [ ] o.a.s.c.c.ZkStateReader A cluster state change: [WatchedEvent state:SyncConnected type:NodeDataChanged path:/collections/deletereplica_test/state.json] for collection [deletereplica_test] has occurred - updating... (live nodes size: [4])
[junit4] 2> 1770463 INFO (zkCallback-3162-thread-3) [ ] o.a.s.c.c.ZkStateReader A cluster state change: [WatchedEvent state:SyncConnected type:NodeDataChanged path:/collections/deletereplica_test/state.json] for collection [deletereplica_test] has occurred - updating... (live nodes size: [4])
[junit4] 2> 1770465 INFO (qtp28357171-18214) [n:127.0.0.1:36769_solr ] o.a.s.s.HttpSolrCall [admin] webapp=null path=/admin/collections params={replica=core_node3&action=DELETEREPLICA&collection=deletereplica_test&shard=shard1&wt=javabin&version=2} status=0 QTime=132
[junit4] 2> 1772337 INFO (OverseerCollectionConfigSetProcessor-72211732100284427-127.0.0.1:45235_solr-n_0000000000) [ ] o.a.s.c.OverseerTaskQueue Response ZK path: /overseer/collection-queue-work/qnr-0000000002 doesn't exist. Requestor may have disconnected from ZooKeeper
[junit4] 2> 1772861 INFO (zkCallback-3162-thread-1) [n:127.0.0.1:39687_solr c:deletereplica_test s:shard1 r:core_node4 x:deletereplica_test_shard1_replica_n2] o.a.s.c.SyncStrategy Sync replicas to https://127.0.0.1:39687/solr/deletereplica_test_shard1_replica_n2/
[junit4] 2> 1772862 INFO (zkCallback-3162-thread-1) [n:127.0.0.1:39687_solr c:deletereplica_test s:shard1 r:core_node4 x:deletereplica_test_shard1_replica_n2] o.a.s.c.SyncStrategy Sync Success - now sync replicas to me
[junit4] 2> 1772862 INFO (zkCallback-3162-thread-1) [n:127.0.0.1:39687_solr c:deletereplica_test s:shard1 r:core_node4 x:deletereplica_test_shard1_replica_n2] o.a.s.c.SyncStrategy https://127.0.0.1:39687/solr/deletereplica_test_shard1_replica_n2/ has no replicas
[junit4] 2> 1772865 INFO (zkCallback-3162-thread-1) [n:127.0.0.1:39687_solr c:deletereplica_test s:shard1 r:core_node4 x:deletereplica_test_shard1_replica_n2] o.a.s.c.ShardLeaderElectionContext I am the new leader: https://127.0.0.1:39687/solr/deletereplica_test_shard1_replica_n2/ shard1
[junit4] 2> 1772865 INFO (zkCallback-3162-thread-1) [ ] o.a.s.c.c.ZkStateReader A cluster state change: [WatchedEvent state:SyncConnected type:NodeDataChanged path:/collections/deletereplica_test/state.json] for collection [deletereplica_test] has occurred - updating... (live nodes size: [4])
[junit4] 2> 1772865 INFO (zkCallback-3162-thread-3) [ ] o.a.s.c.c.ZkStateReader A cluster state change: [WatchedEvent state:SyncConnected type:NodeDataChanged path:/collections/deletereplica_test/state.json] for collection [deletereplica_test] has occurred - updating... (live nodes size: [4])
[junit4] 2> 1772893 INFO (TEST-DeleteReplicaTest.deleteReplicaAndVerifyDirectoryCleanup-seed#[79CAD9B151692749]) [ ] o.a.s.SolrTestCaseJ4 ###Ending deleteReplicaAndVerifyDirectoryCleanup
[junit4] 2> 1772925 INFO (TEST-DeleteReplicaTest.deleteReplicaByCountForAllShards-seed#[79CAD9B151692749]) [ ] o.a.s.SolrTestCaseJ4 ###Starting deleteReplicaByCountForAllShards
[junit4] 2> 1772926 INFO (qtp28357171-18217) [n:127.0.0.1:36769_solr ] o.a.s.h.a.CollectionsHandler Invoked Collection Action :create with params replicationFactor=2&collection.configName=conf&name=deleteByCountNew&nrtReplicas=2&action=CREATE&numShards=2&wt=javabin&version=2 and sendToOCPQueue=true
[junit4] 2> 1772928 INFO (OverseerThreadFactory-5512-thread-3) [ ] o.a.s.c.a.c.CreateCollectionCmd Create collection deleteByCountNew
[junit4] 2> 1773136 INFO (OverseerStateUpdate-72211732100284427-127.0.0.1:45235_solr-n_0000000000) [ ] o.a.s.c.o.SliceMutator createReplica() {
[junit4] 2> "operation":"ADDREPLICA",
[junit4] 2> "collection":"deleteByCountNew",
[junit4] 2> "shard":"shard1",
[junit4] 2> "core":"deleteByCountNew_shard1_replica_n1",
[junit4] 2> "state":"down",
[junit4] 2> "base_url":"https://127.0.0.1:39687/solr",
[junit4] 2> "type":"NRT",
[junit4] 2> "waitForFinalState":"false"}
[junit4] 2> 1773137 INFO (OverseerStateUpdate-72211732100284427-127.0.0.1:45235_solr-n_0000000000) [ ] o.a.s.c.o.SliceMutator createReplica() {
[junit4] 2> "operation":"ADDREPLICA",
[junit4] 2> "collection":"deleteByCountNew",
[junit4] 2> "shard":"shard1",
[junit4] 2> "core":"deleteByCountNew_shard1_replica_n2",
[junit4] 2> "state":"down",
[junit4] 2> "base_url":"https://127.0.0.1:37029/solr",
[junit4] 2> "type":"NRT",
[junit4] 2> "waitForFinalState":"false"}
[junit4] 2> 1773139 INFO (OverseerStateUpdate-72211732100284427-127.0.0.1:45235_solr-n_0000000000) [ ] o.a.s.c.o.SliceMutator createReplica() {
[junit4] 2> "operation":"ADDREPLICA",
[junit4] 2> "collection":"deleteByCountNew",
[junit4] 2> "shard":"shard2",
[junit4] 2> "core":"deleteByCountNew_shard2_replica_n4",
[junit4] 2> "state":"down",
[junit4] 2> "base_url":"https://127.0.0.1:45235/solr",
[junit4] 2> "type":"NRT",
[junit4] 2> "waitForFinalState":"false"}
[junit4] 2> 1773140 INFO (OverseerStateUpdate-72211732100284427-127.0.0.1:45235_solr-n_0000000000) [ ] o.a.s.c.o.SliceMutator createReplica() {
[junit4] 2> "operation":"ADDREPLICA",
[junit4] 2> "collection":"deleteByCountNew",
[junit4] 2> "shard":"shard2",
[junit4] 2> "core":"deleteByCountNew_shard2_replica_n6",
[junit4] 2> "state":"down",
[junit4] 2> "base_url":"https://127.0.0.1:36769/solr",
[junit4] 2> "type":"NRT",
[junit4] 2> "waitForFinalState":"false"}
[junit4] 2> 1773343 INFO (qtp28357171-18215) [n:127.0.0.1:36769_solr ] o.a.s.h.a.CoreAdminOperation core create command qt=/admin/cores&coreNodeName=core_node8&collection.configName=conf&newCollection=true&name=deleteByCountNew_shard2_replica_n6&action=CREATE&numShards=2&collection=deleteByCountNew&shard=shard2&wt=javabin&version=2&replicaType=NRT
[junit4] 2> 1773345 INFO (qtp8695802-18187) [n:127.0.0.1:39687_solr ] o.a.s.h.a.CoreAdminOperation core create command qt=/admin/cores&coreNodeName=core_node3&collection.configName=conf&newCollection=true&name=deleteByCountNew_shard1_replica_n1&action=CREATE&numShards=2&collection=deleteByCountNew&shard=shard1&wt=javabin&version=2&replicaType=NRT
[junit4] 2> 1773411 INFO (qtp31750384-18206) [n:127.0.0.1:45235_solr ] o.a.s.h.a.CoreAdminOperation core create command qt=/admin/cores&coreNodeName=core_node7&collection.configName=conf&newCollection=true&name=deleteByCountNew_shard2_replica_n4&action=CREATE&numShards=2&collection=deleteByCountNew&shard=shard2&wt=javabin&version=2&replicaType=NRT
[junit4] 2> 1773411 INFO (qtp31750384-18206) [n:127.0.0.1:45235_solr ] o.a.s.c.TransientSolrCoreCacheDefault Allocating transient cache for 2147483647 transient cores
[junit4] 2> 1773417 INFO (qtp682525-18193) [n:127.0.0.1:37029_solr ] o.a.s.h.a.CoreAdminOperation core create command qt=/admin/cores&coreNodeName=core_node5&collection.configName=conf&newCollection=true&name=deleteByCountNew_shard1_replica_n2&action=CREATE&numShards=2&collection=deleteByCountNew&shard=shard1&wt=javabin&version=2&replicaType=NRT
[junit4] 2> 1773520 INFO (zkCallback-3162-thread-3) [ ] o.a.s.c.c.ZkStateReader A cluster state change: [WatchedEvent state:SyncConnected type:NodeDataChanged path:/collections/deleteByCountNew/state.json] for collection [deleteByCountNew] has occurred - updating... (live nodes size: [4])
[junit4] 2> 1773521 INFO (zkCallback-3166-thread-1) [ ] o.a.s.c.c.ZkStateReader A cluster state change: [WatchedEvent state:SyncConnected type:NodeDataChanged path:/collections/deleteByCountNew/state.json] for collection [deleteByCountNew] has occurred - updating... (live nodes size: [4])
[junit4] 2> 1773521 INFO (zkCallback-3162-thread-1) [ ] o.a.s.c.c.ZkStateReader A cluster state change: [WatchedEvent state:SyncConnected type:NodeDataChanged path:/collections/deleteByCountNew/state.json] for collection [deleteByCountNew] has occurred - updating... (live nodes size: [4])
[junit4] 2> 1773520 INFO (zkCallback-3175-thread-1) [ ] o.a.s.c.c.ZkStateReader A cluster state change: [WatchedEvent state:SyncConnected type:NodeDataChanged path:/collections/deleteByCountNew/state.json] for collection [deleteByCountNew] has occurred - updating... (live nodes size: [4])
[junit4] 2> 1773520 INFO (zkCallback-3175-thread-2) [ ] o.a.s.c.c.ZkStateReader A cluster state change: [WatchedEvent state:SyncConnected type:NodeDataChanged path:/collections/deleteByCountNew/state.json] for collection [deleteByCountNew] has occurred - updating... (live nodes size: [4])
[junit4] 2> 1773521 INFO (zkCallback-3173-thread-2) [ ] o.a.s.c.c.ZkStateReader A cluster state change: [WatchedEvent state:SyncConnected type:NodeDataChanged path:/collections/deleteByCountNew/state.json] for collection [deleteByCountNew] has occurred - updating... (live nodes size: [4])
[junit4] 2> 1773521 INFO (zkCallback-3173-thread-1) [ ] o.a.s.c.c.ZkStateReader A cluster state change: [WatchedEvent state:SyncConnected type:NodeDataChanged path:/collections/deleteByCountNew/state.json] for collection [deleteByCountNew] has occurred - updating... (live nodes size: [4])
[junit4] 2> 1773522 INFO (zkCallback-3166-thread-2) [ ] o.a.s.c.c.ZkStateReader A cluster state change: [WatchedEvent state:SyncConnected type:NodeDataChanged path:/collections/deleteByCountNew/state.json] for collection [deleteByCountNew] has occurred - updating... (live nodes size: [4])
[junit4] 2> 1774357 INFO (qtp28357171-18215) [n:127.0.0.1:36769_solr c:deleteByCountNew s:shard2 r:core_node8 x:deleteByCountNew_shard2_replica_n6] o.a.s.c.SolrConfig Using Lucene MatchVersion: 8.0.0
[junit4] 2> 1774358 INFO (qtp8695802-18187) [n:127.0.0.1:39687_solr c:deleteByCountNew s:shard1 r:core_node3 x:deleteByCountNew_shard1_replica_n1] o.a.s.c.SolrConfig Using Lucene MatchVersion: 8.0.0
[junit4] 2> 1774367 INFO (qtp28357171-18215) [n:127.0.0.1:36769_solr c:deleteByCountNew s:shard2 r:core_node8 x:deleteByCountNew_shard2_replica_n6] o.a.s.s.IndexSchema [deleteByCountNew_shard2_replica_n6] Schema name=minimal
[junit4] 2> 1774370 INFO (qtp8695802-18187) [n:127.0.0.1:39687_solr c:deleteByCountNew s:shard1 r:core_node3 x:deleteByCountNew_shard1_replica_n1] o.a.s.s.IndexSchema [deleteByCountNew_shard1_replica_n1] Schema name=minimal
[junit4] 2> 1774370 INFO (qtp28357171-18215) [n:127.0.0.1:36769_solr c:deleteByCountNew s:shard2 r:core_node8 x:deleteByCountNew_shard2_replica_n6] o.a.s.s.IndexSchema Loaded schema minimal/1.1 with uniqueid field id
[junit4] 2> 1774370 INFO (qtp28357171-18215) [n:127.0.0.1:36769_solr c:deleteByCountNew s:shard2 r:core_node8 x:deleteByCountNew_shard2_replica_n6] o.a.s.c.CoreContainer Creating SolrCore 'deleteByCountNew_shard2_replica_n6' using configuration from collection deleteByCountNew, trusted=true
[junit4] 2> 1774371 INFO (qtp28357171-18215) [n:127.0.0.1:36769_solr c:deleteByCountNew s:shard2 r:core_node8 x:deleteByCountNew_shard2_replica_n6] o.a.s.m.r.SolrJmxReporter JMX monitoring for 'solr_36769.solr.core.deleteByCountNew.shard2.replica_n6' (registry 'solr.core.deleteByCountNew.shard2.replica_n6') enabled at server: com.sun.jmx.mbeanserver.JmxMBeanServer@96fdc3
[junit4] 2> 1774371 INFO (qtp28357171-18215) [n:127.0.0.1:36769_solr c:deleteByCountNew s:shard2 r:core_node8 x:deleteByCountNew_shard2_replica_n6] o.a.s.c.SolrCore solr.RecoveryStrategy.Builder
[junit4] 2> 1774372 INFO (qtp28357171-18215) [n:127.0.0.1:36769_solr c:deleteByCountNew s:shard2 r:core_node8 x:deleteByCountNew_shard2_replica_n6] o.a.s.c.SolrCore [[deleteByCountNew_shard2_replica_n6] ] Opening new SolrCore at [/home/jenkins/workspace/Lucene-Solr-BadApples-master-Linux/solr/build/solr-core/test/J0/temp/solr.cloud.DeleteReplicaTest_79CAD9B151692749-001/tempDir-001/node3/deleteByCountNew_shard2_replica_n6], dataDir=[/home/jenkins/workspace/Lucene-Solr-BadApples-master-Linux/solr/build/solr-core/test/J0/temp/solr.cloud.DeleteReplicaTest_79CAD9B151692749-001/tempDir-001/node3/./deleteByCountNew_shard2_replica_n6/data/]
[junit4] 2> 1774373 INFO (qtp8695802-18187) [n:127.0.0.1:39687_solr c:deleteByCountNew s:shard1 r:core_node3 x:deleteByCountNew_shard1_replica_n1] o.a.s.s.IndexSchema Loaded schema minimal/1.1 with uniqueid field id
[junit4] 2> 1774373 INFO (qtp8695802-18187) [n:127.0.0.1:39687_solr c:deleteByCountNew s:shard1 r:core_node3 x:deleteByCountNew_shard1_replica_n1] o.a.s.c.CoreContainer Creating SolrCore 'deleteByCountNew_shard1_replica_n1' using configuration from collection deleteByCountNew, trusted=true
[junit4] 2> 1774374 INFO (qtp8695802-18187) [n:127.0.0.1:39687_solr c:deleteByCountNew s:shard1 r:core_node3 x:deleteByCountNew_shard1_replica_n1] o.a.s.m.r.SolrJmxReporter JMX monitoring for 'solr_39687.solr.core.deleteByCountNew.shard1.replica_n1' (registry 'solr.core.deleteByCountNew.shard1.replica_n1') enabled at server: com.sun.jmx.mbeanserver.JmxMBeanServer@96fdc3
[junit4] 2> 1774374 INFO (qtp8695802-18187) [n:127.0.0.1:39687_solr c:deleteByCountNew s:shard1 r:core_node3 x:deleteByCountNew_shard1_replica_n1] o.a.s.c.SolrCore solr.RecoveryStrategy.Builder
[junit4] 2> 1774375 INFO (qtp8695802-18187) [n:127.0.0.1:39687_solr c:deleteByCountNew s:shard1 r:core_node3 x:deleteByCountNew_shard1_replica_n1] o.a.s.c.SolrCore [[deleteByCountNew_shard1_replica_n1] ] Opening new SolrCore at [/home/jenkins/workspace/Lucene-Solr-BadApples-master-Linux/solr/build/solr-core/test/J0/temp/solr.cloud.DeleteReplicaTest_79CAD9B151692749-001/tempDir-001/node4/deleteByCountNew_shard1_replica_n1], dataDir=[/home/jenkins/workspace/Lucene-Solr-BadApples-master-Linux/solr/build/solr-core/test/J0/temp/solr.cloud.DeleteReplicaTest_79CAD9B151692749-001/tempDir-001/node4/./deleteByCountNew_shard1_replica_n1/data/]
[junit4] 2> 1774423 INFO (qtp31750384-18206) [n:127.0.0.1:45235_solr c:deleteByCountNew s:shard2 r:core_node7 x:deleteByCountNew_shard2_replica_n4] o.a.s.c.SolrConfig Using Lucene MatchVersion: 8.0.0
[junit4] 2> 1774427 INFO (qtp682525-18193) [n:127.0.0.1:37029_solr c:deleteByCountNew s:shard1 r:core_node5 x:deleteByCountNew_shard1_replica_n2] o.a.s.c.SolrConfig Using Lucene MatchVersion: 8.0.0
[junit4] 2> 1774431 INFO (qtp31750384-18206) [n:127.0.0.1:45235_solr c:deleteByCountNew s:shard2 r:core_node7 x:deleteByCountNew_shard2_replica_n4] o.a.s.s.IndexSchema [deleteByCountNew_shard2_replica_n4] Schema name=minimal
[junit4] 2> 1774433 INFO (qtp31750384-18206) [n:127.0.0.1:45235_solr c:deleteByCountNew s:shard2 r:core_node7 x:deleteByCountNew_shard2_replica_n4] o.a.s.s.IndexSchema Loaded schema minimal/1.1 with uniqueid field id
[junit4] 2> 1774433 INFO (qtp31750384-18206) [n:127.0.0.1:45235_solr c:deleteByCountNew s:shard2 r:core_node7 x:deleteByCountNew_shard2_replica_n4] o.a.s.c.CoreContainer Creating SolrCore 'deleteByCountNew_shard2_replica_n4' using configuration from collection deleteByCountNew, trusted=true
[junit4] 2> 1774434 INFO (qtp31750384-18206) [n:127.0.0.1:45235_solr c:deleteByCountNew s:shard2 r:core_node7 x:deleteByCountNew_shard2_replica_n4] o.a.s.m.r.SolrJmxReporter JMX monitoring for 'solr_45235.solr.core.deleteByCountNew.shard2.replica_n4' (registry 'solr.core.deleteByCountNew.shard2.replica_n4') enabled at server: com.sun.jmx.mbeanserver.JmxMBeanServer@96fdc3
[junit4] 2> 1774434 INFO (qtp31750384-18206) [n:127.0.0.1:45235_solr c:deleteByCountNew s:shard2 r:core_node7 x:deleteByCountNew_shard2_replica_n4] o.a.s.c.SolrCore solr.RecoveryStrategy.Builder
[junit4] 2> 1774434 INFO (qtp31750384-18206) [n:127.0.0.1:45235_solr c:deleteByCountNew s:shard2 r:core_node7 x:deleteByCountNew_shard2_replica_n4] o.a.s.c.SolrCore [[deleteByCountNew_shard2_replica_n4] ] Opening new SolrCore at [/home/jenkins/workspace/Lucene-Solr-BadApples-master-Linux/solr/build/solr-core/test/J0/temp/solr.cloud.DeleteReplicaTest_79CAD9B151692749-001/tempDir-001/node1/deleteByCountNew_shard2_replica_n4], dataDir=[/home/jenkins/workspace/Lucene-Solr-BadApples-master-Linux/solr/build/solr-core/test/J0/temp/solr.cloud.DeleteReplicaTest_79CAD9B151692749-001/tempDir-001/node1/./deleteByCountNew_shard2_replica_n4/data/]
[junit4] 2> 1774437 INFO (qtp682525-18193) [n:127.0.0.1:37029_solr c:deleteByCountNew s:shard1 r:core_node5 x:deleteByCountNew_shard1_replica_n2] o.a.s.s.IndexSchema [deleteByCountNew_shard1_replica_n2] Schema name=minimal
[junit4] 2> 1774440 INFO (qtp682525-18193) [n:127.0.0.1:37029_solr c:deleteByCountNew s:shard1 r:core_node5 x:deleteByCountNew_shard1_replica_n2] o.a.s.s.IndexSchema Loaded schema minimal/1.1 with uniqueid field id
[junit4] 2> 1774440 INFO (qtp682525-18193) [n:127.0.0.1:37029_solr c:deleteByCountNew s:shard1 r:core_node5 x:deleteByCountNew_shard1_replica_n2] o.a.s.c.CoreContainer Creating SolrCore 'deleteByCountNew_shard1_replica_n2' using configuration from collection deleteByCountNew, trusted=true
[junit4] 2> 1774440 INFO (qtp682525-18193) [n:127.0.0.1:37029_solr c:deleteByCountNew s:shard1 r:core_node5 x:deleteByCountNew_shard1_replica_n2] o.a.s.m.r.SolrJmxReporter JMX monitoring for 'solr_37029.solr.core.deleteByCountNew.shard1.replica_n2' (registry 'solr.core.deleteByCountNew.shard1.replica_n2') enabled at server: com.sun.jmx.mbeanserver.JmxMBeanServer@96fdc3
[junit4] 2> 1774440 INFO (qtp682525-18193) [n:127.0.0.1:37029_solr c:deleteByCountNew s:shard1 r:core_node5 x:deleteByCountNew_shard1_replica_n2] o.a.s.c.SolrCore solr.RecoveryStrategy.Builder
[junit4] 2> 1774441 INFO (qtp682525-18193) [n:127.0.0.1:37029_solr c:deleteByCountNew s:shard1 r:core_node5 x:deleteByCountNew_shard1_replica_n2] o.a.s.c.SolrCore [[deleteByCountNew_shard1_replica_n2] ] Opening new SolrCore at [/home/jenkins/workspace/Lucene-Solr-BadApples-master-Linux/solr/build/solr-core/test/J0/temp/solr.cloud.DeleteReplicaTest_79CAD9B151692749-001/tempDir-001/node2/deleteByCountNew_shard1_replica_n2], dataDir=[/home/jenkins/workspace/Lucene-Solr-BadApples-master-Linux/solr/build/solr-core/test/J0/temp/solr.cloud.DeleteReplicaTest_79CAD9B151692749-001/tempDir-001/node2/./deleteByCountNew_shard1_replica_n2/data/]
[junit4] 2> 1774464 INFO (qtp28357171-18215) [n:127.0.0.1:36769_solr c:deleteByCountNew s:shard2 r:core_node8 x:deleteByCountNew_shard2_replica_n6] o.a.s.u.UpdateHandler Using UpdateLog implementation: org.apache.solr.update.UpdateLog
[junit4] 2> 1774464 INFO (qtp28357171-18215) [n:127.0.0.1:36769_solr c:deleteByCountNew s:shard2 r:core_node8 x:deleteByCountNew_shard2_replica_n6] o.a.s.u.UpdateLog Initializing UpdateLog: dataDir=null defaultSyncLevel=FLUSH numRecordsToKeep=100 maxNumLogsToKeep=10 numVersionBuckets=65536
[junit4] 2> 1774466 INFO (qtp8695802-18187) [n:127.0.0.1:39687_solr c:deleteByCountNew s:shard1 r:core_node3 x:deleteByCountNew_shard1_replica_n1] o.a.s.u.UpdateHandler Using UpdateLog implementation: org.apache.sol
[...truncated too long message...]
ateReader Updated live nodes from ZooKeeper... (2) -> (1)
[junit4] 2> 669400 INFO (zkCallback-1156-thread-1) [ ] o.a.s.c.c.ZkStateReader Updated live nodes from ZooKeeper... (2) -> (1)
[junit4] 2> 669400 INFO (jetty-closer-590-thread-2) [ ] o.a.s.m.SolrMetricManager Closing metric reporters for registry=solr.cluster, tag=null
[junit4] 2> 669402 INFO (jetty-closer-590-thread-1) [ ] o.a.s.m.SolrMetricManager Closing metric reporters for registry=solr.jvm, tag=null
[junit4] 2> 669403 INFO (jetty-closer-590-thread-1) [ ] o.a.s.m.r.SolrJmxReporter Closing reporter [org.apache.solr.metrics.reporters.SolrJmxReporter@61b579: rootName = solr_37321, domain = solr.jvm, service url = null, agent id = null] for registry solr.jvm / com.codahale.metrics.MetricRegistry@5bea7a
[junit4] 2> 669409 INFO (jetty-closer-590-thread-2) [ ] o.e.j.s.h.ContextHandler Stopped o.e.j.s.ServletContextHandler@3ac958{/solr,null,UNAVAILABLE}
[junit4] 2> 669409 INFO (jetty-closer-590-thread-2) [ ] o.e.j.s.session Stopped scavenging
[junit4] 2> 669411 INFO (jetty-closer-590-thread-1) [ ] o.a.s.m.SolrMetricManager Closing metric reporters for registry=solr.jetty, tag=null
[junit4] 2> 669411 INFO (jetty-closer-590-thread-1) [ ] o.a.s.m.r.SolrJmxReporter Closing reporter [org.apache.solr.metrics.reporters.SolrJmxReporter@b4bec8: rootName = solr_37321, domain = solr.jetty, service url = null, agent id = null] for registry solr.jetty / com.codahale.metrics.MetricRegistry@2701e5
[junit4] 2> 669413 INFO (jetty-closer-590-thread-1) [ ] o.a.s.c.ZkController Remove node as live in ZooKeeper:/live_nodes/127.0.0.1:37321_solr
[junit4] 2> 669413 INFO (jetty-closer-590-thread-1) [ ] o.a.s.m.SolrMetricManager Closing metric reporters for registry=solr.cluster, tag=null
[junit4] 2> 669413 INFO (zkCallback-1145-thread-1) [ ] o.a.s.c.c.ZkStateReader Updated live nodes from ZooKeeper... (1) -> (0)
[junit4] 2> 669414 INFO (zkCallback-1140-thread-2) [ ] o.a.s.c.c.ZkStateReader Updated live nodes from ZooKeeper... (1) -> (0)
[junit4] 2> 669415 INFO (jetty-closer-590-thread-1) [ ] o.a.s.c.Overseer Overseer (id=72211888476455082-127.0.0.1:37321_solr-n_0000000037) closing
[junit4] 2> 669415 INFO (OverseerStateUpdate-72211888476455082-127.0.0.1:37321_solr-n_0000000037) [ ] o.a.s.c.Overseer Overseer Loop exiting : 127.0.0.1:37321_solr
[junit4] 2> 669415 WARN (OverseerAutoScalingTriggerThread-72211888476455082-127.0.0.1:37321_solr-n_0000000037) [ ] o.a.s.c.a.OverseerTriggerThread OverseerTriggerThread woken up but we are closed, exiting.
[junit4] 2> 669419 DEBUG (jetty-closer-590-thread-1) [ ] o.a.s.c.a.OverseerTriggerThread OverseerTriggerThread has been closed explicitly
[junit4] 2> 669420 INFO (jetty-closer-590-thread-1) [ ] o.e.j.s.h.ContextHandler Stopped o.e.j.s.ServletContextHandler@1eccc24{/solr,null,UNAVAILABLE}
[junit4] 2> 669421 INFO (jetty-closer-590-thread-1) [ ] o.e.j.s.session Stopped scavenging
[junit4] 2> 669421 ERROR (SUITE-TriggerIntegrationTest-seed#[79CAD9B151692749]-worker) [ ] o.a.z.s.ZooKeeperServer ZKShutdownHandler is not registered, so ZooKeeper server won't take any action on ERROR or SHUTDOWN server state changes
[junit4] 2> 669421 INFO (SUITE-TriggerIntegrationTest-seed#[79CAD9B151692749]-worker) [ ] o.a.s.c.ZkTestServer connecting to 127.0.0.1:33025 33025
[junit4] 2> 669447 INFO (Thread-466) [ ] o.a.s.c.ZkTestServer connecting to 127.0.0.1:33025 33025
[junit4] 2> 669448 WARN (Thread-466) [ ] o.a.s.c.ZkTestServer Watch limit violations:
[junit4] 2> Maximum concurrent create/delete watches above limit:
[junit4] 2>
[junit4] 2> 96 /solr/aliases.json
[junit4] 2> 96 /solr/clusterprops.json
[junit4] 2> 47 /solr/collections/collection1/terms/shard1
[junit4] 2> 40 /solr/security.json
[junit4] 2> 33 /solr/collections/testMetricTrigger/terms/shard1
[junit4] 2> 23 /solr/collections/testScheduledTrigger/terms/shard1
[junit4] 2> 9 /solr/configs/conf
[junit4] 2> 7 /solr/collections/testMetricTrigger/terms/shard2
[junit4] 2> 4 /solr/configs/testScheduledTrigger.AUTOCREATED/managed-schema
[junit4] 2> 3 /solr/configs/testScheduledTrigger.AUTOCREATED
[junit4] 2>
[junit4] 2> Maximum concurrent data watches above limit:
[junit4] 2>
[junit4] 2> 96 /solr/clusterstate.json
[junit4] 2> 58 /solr/collections/testMetricTrigger/state.json
[junit4] 2> 48 /solr/collections/collection1/state.json
[junit4] 2> 25 /solr/autoscaling.json
[junit4] 2> 20 /solr/collections/testScheduledTrigger/state.json
[junit4] 2> 4 /solr/overseer_elect/election/72211888476455065-127.0.0.1:45395_solr-n_0000000033
[junit4] 2> 3 /solr/overseer_elect/election/72211888476454926-127.0.0.1:40025_solr-n_0000000002
[junit4] 2> 3 /solr/collections/collection1/leader_elect/shard1/election/72211888476454939-core_node4-n_0000000000
[junit4] 2> 2 /solr/collections/collection1/leader_elect/shard1/election/72211888476454926-core_node6-n_0000000002
[junit4] 2> 2 /solr/overseer_elect/election/72211888476455013-127.0.0.1:46609_solr-n_0000000022
[junit4] 2> 2 /solr/overseer_elect/election/72211888476455026-127.0.0.1:34757_solr-n_0000000025
[junit4] 2> 2 /solr/overseer_elect/election/72211888476454982-127.0.0.1:44321_solr-n_0000000015
[junit4] 2> 2 /solr/overseer_elect/election/72211888476455035-127.0.0.1:36995_solr-n_0000000027
[junit4] 2> 2 /solr/overseer_elect/election/72211888476454974-127.0.0.1:43841_solr-n_0000000013
[junit4] 2> 2 /solr/overseer_elect/election/72211888476454948-127.0.0.1:35597_solr-n_0000000007
[junit4] 2> 2 /solr/overseer_elect/election/72211888476455045-127.0.0.1:32919_solr-n_0000000029
[junit4] 2> 2 /solr/collections/testMetricTrigger/leader_elect/shard1/election/72211888476455050-core_node5-n_0000000000
[junit4] 2> 2 /solr/overseer_elect/election/72211888476454991-127.0.0.1:35953_solr-n_0000000017
[junit4] 2>
[junit4] 2> Maximum concurrent children watches above limit:
[junit4] 2>
[junit4] 2> 688 /solr/live_nodes
[junit4] 2> 147 /solr/collections
[junit4] 2> 25 /solr/overseer/queue-work
[junit4] 2> 25 /solr/autoscaling/events/.scheduled_maintenance
[junit4] 2> 25 /solr/overseer/queue
[junit4] 2> 25 /solr/overseer/collection-queue-work
[junit4] 2> 24 /solr/autoscaling/events/.auto_add_replicas
[junit4] 2> 2 /solr/autoscaling/events/node_lost_triggerMR
[junit4] 2> 2 /solr/autoscaling/events/node_added_triggerCTOOR
[junit4] 2> 2 /solr/autoscaling/events/node_added_cooldown_trigger
[junit4] 2>
[junit4] 2> NOTE: leaving temporary files on disk at: /home/jenkins/workspace/Lucene-Solr-BadApples-master-Linux/solr/build/solr-core/test/J1/temp/solr.cloud.autoscaling.TriggerIntegrationTest_79CAD9B151692749-001
[junit4] 2> Mar 28, 2018 6:04:17 AM com.carrotsearch.randomizedtesting.ThreadLeakControl checkThreadLeaks
[junit4] 2> WARNING: Will linger awaiting termination of 6 leaked thread(s).
[junit4] 2> NOTE: test params are: codec=Asserting(Lucene70): {_version_=FST50, id=PostingsFormat(name=Asserting), x_s=Lucene50(blocksize=128)}, docValues:{_version_=DocValuesFormat(name=Memory)}, maxPointsInLeafNode=1214, maxMBSortInHeap=5.410630024830205, sim=Asserting(org.apache.lucene.search.similarities.AssertingSimilarity@1f9b625), locale=ja-JP, timezone=Europe/Mariehamn
[junit4] 2> NOTE: Linux 4.13.0-36-generic i386/Oracle Corporation 1.8.0_162 (32-bit)/cpus=8,threads=1,free=89229552,total=236191744
[junit4] 2> NOTE: All tests run in this JVM: [TriggerIntegrationTest, TriggerIntegrationTest]
[junit4] Completed [10/10 (3!)] on J1 in 318.91s, 15 tests, 1 failure <<< FAILURES!
[...truncated 13 lines...]
BUILD FAILED
/home/jenkins/workspace/Lucene-Solr-BadApples-master-Linux/lucene/common-build.xml:1568: The following error occurred while executing this line:
/home/jenkins/workspace/Lucene-Solr-BadApples-master-Linux/lucene/common-build.xml:1092: There were test failures: 10 suites, 105 tests, 1 error, 2 failures [seed: 79CAD9B151692749]
Total time: 11 minutes 12 seconds
[repro] Setting last failure code to 256
[repro] Failures:
[repro] 1/5 failed: org.apache.solr.cloud.DeleteReplicaTest
[repro] 2/5 failed: org.apache.solr.cloud.autoscaling.TriggerIntegrationTest
[repro] Exiting with code 256
+ mv lucene/build lucene/build.repro
+ mv solr/build solr/build.repro
+ mv lucene/build.orig lucene/build
+ mv solr/build.orig solr/build
Archiving artifacts
Setting ANT_1_8_2_HOME=/var/lib/jenkins/tools/hudson.tasks.Ant_AntInstallation/ANT_1.8.2
[WARNINGS] Parsing warnings in console log with parser Java Compiler (javac)
Setting ANT_1_8_2_HOME=/var/lib/jenkins/tools/hudson.tasks.Ant_AntInstallation/ANT_1.8.2
Setting ANT_1_8_2_HOME=/var/lib/jenkins/tools/hudson.tasks.Ant_AntInstallation/ANT_1.8.2
<Git Blamer> Using GitBlamer to create author and commit information for all warnings.
<Git Blamer> GIT_COMMIT=f8af2747836afb1d821ccff37a6e9e1e8eab0989, workspace=/var/lib/jenkins/workspace/Lucene-Solr-BadApples-master-Linux
[WARNINGS] Computing warning deltas based on reference build #14
Recording test results
Setting ANT_1_8_2_HOME=/var/lib/jenkins/tools/hudson.tasks.Ant_AntInstallation/ANT_1.8.2
Build step 'Publish JUnit test result report' changed build result to UNSTABLE
Email was triggered for: Unstable (Test Failures)
Sending email for trigger: Unstable (Test Failures)
Setting ANT_1_8_2_HOME=/var/lib/jenkins/tools/hudson.tasks.Ant_AntInstallation/ANT_1.8.2
Setting ANT_1_8_2_HOME=/var/lib/jenkins/tools/hudson.tasks.Ant_AntInstallation/ANT_1.8.2
Setting ANT_1_8_2_HOME=/var/lib/jenkins/tools/hudson.tasks.Ant_AntInstallation/ANT_1.8.2
Setting ANT_1_8_2_HOME=/var/lib/jenkins/tools/hudson.tasks.Ant_AntInstallation/ANT_1.8.2
[JENKINS] Lucene-Solr-BadApples-master-Linux (64bit/jdk-10) - Build
# 16 - Still Unstable!
Posted by Policeman Jenkins Server <je...@thetaphi.de>.
Build: https://jenkins.thetaphi.de/job/Lucene-Solr-BadApples-master-Linux/16/
Java: 64bit/jdk-10 -XX:+UseCompressedOops -XX:+UseSerialGC
1 tests failed.
FAILED: org.apache.solr.cloud.SSLMigrationTest.test
Error Message:
Replica didn't have the proper urlScheme in the ClusterState
Stack Trace:
java.lang.AssertionError: Replica didn't have the proper urlScheme in the ClusterState
at __randomizedtesting.SeedInfo.seed([F06E2829749A49C1:783A17F3DA662439]:0)
at org.junit.Assert.fail(Assert.java:93)
at org.junit.Assert.assertTrue(Assert.java:43)
at org.apache.solr.cloud.SSLMigrationTest.assertReplicaInformation(SSLMigrationTest.java:104)
at org.apache.solr.cloud.SSLMigrationTest.testMigrateSSL(SSLMigrationTest.java:97)
at org.apache.solr.cloud.SSLMigrationTest.test(SSLMigrationTest.java:61)
at java.base/jdk.internal.reflect.NativeMethodAccessorImpl.invoke0(Native Method)
at java.base/jdk.internal.reflect.NativeMethodAccessorImpl.invoke(NativeMethodAccessorImpl.java:62)
at java.base/jdk.internal.reflect.DelegatingMethodAccessorImpl.invoke(DelegatingMethodAccessorImpl.java:43)
at java.base/java.lang.reflect.Method.invoke(Method.java:564)
at com.carrotsearch.randomizedtesting.RandomizedRunner.invoke(RandomizedRunner.java:1737)
at com.carrotsearch.randomizedtesting.RandomizedRunner$8.evaluate(RandomizedRunner.java:934)
at com.carrotsearch.randomizedtesting.RandomizedRunner$9.evaluate(RandomizedRunner.java:970)
at com.carrotsearch.randomizedtesting.RandomizedRunner$10.evaluate(RandomizedRunner.java:984)
at org.apache.solr.BaseDistributedSearchTestCase$ShardsRepeatRule$ShardsFixedStatement.callStatement(BaseDistributedSearchTestCase.java:993)
at org.apache.solr.BaseDistributedSearchTestCase$ShardsRepeatRule$ShardsStatement.evaluate(BaseDistributedSearchTestCase.java:968)
at com.carrotsearch.randomizedtesting.rules.SystemPropertiesRestoreRule$1.evaluate(SystemPropertiesRestoreRule.java:57)
at org.apache.lucene.util.TestRuleSetupTeardownChained$1.evaluate(TestRuleSetupTeardownChained.java:49)
at org.apache.lucene.util.AbstractBeforeAfterRule$1.evaluate(AbstractBeforeAfterRule.java:45)
at org.apache.lucene.util.TestRuleThreadAndTestName$1.evaluate(TestRuleThreadAndTestName.java:48)
at org.apache.lucene.util.TestRuleIgnoreAfterMaxFailures$1.evaluate(TestRuleIgnoreAfterMaxFailures.java:64)
at org.apache.lucene.util.TestRuleMarkFailure$1.evaluate(TestRuleMarkFailure.java:47)
at com.carrotsearch.randomizedtesting.rules.StatementAdapter.evaluate(StatementAdapter.java:36)
at com.carrotsearch.randomizedtesting.ThreadLeakControl$StatementRunner.run(ThreadLeakControl.java:368)
at com.carrotsearch.randomizedtesting.ThreadLeakControl.forkTimeoutingTask(ThreadLeakControl.java:817)
at com.carrotsearch.randomizedtesting.ThreadLeakControl$3.evaluate(ThreadLeakControl.java:468)
at com.carrotsearch.randomizedtesting.RandomizedRunner.runSingleTest(RandomizedRunner.java:943)
at com.carrotsearch.randomizedtesting.RandomizedRunner$5.evaluate(RandomizedRunner.java:829)
at com.carrotsearch.randomizedtesting.RandomizedRunner$6.evaluate(RandomizedRunner.java:879)
at com.carrotsearch.randomizedtesting.RandomizedRunner$7.evaluate(RandomizedRunner.java:890)
at com.carrotsearch.randomizedtesting.rules.StatementAdapter.evaluate(StatementAdapter.java:36)
at com.carrotsearch.randomizedtesting.rules.SystemPropertiesRestoreRule$1.evaluate(SystemPropertiesRestoreRule.java:57)
at org.apache.lucene.util.AbstractBeforeAfterRule$1.evaluate(AbstractBeforeAfterRule.java:45)
at com.carrotsearch.randomizedtesting.rules.StatementAdapter.evaluate(StatementAdapter.java:36)
at org.apache.lucene.util.TestRuleStoreClassName$1.evaluate(TestRuleStoreClassName.java:41)
at com.carrotsearch.randomizedtesting.rules.NoShadowingOrOverridesOnMethodsRule$1.evaluate(NoShadowingOrOverridesOnMethodsRule.java:40)
at com.carrotsearch.randomizedtesting.rules.NoShadowingOrOverridesOnMethodsRule$1.evaluate(NoShadowingOrOverridesOnMethodsRule.java:40)
at com.carrotsearch.randomizedtesting.rules.StatementAdapter.evaluate(StatementAdapter.java:36)
at com.carrotsearch.randomizedtesting.rules.StatementAdapter.evaluate(StatementAdapter.java:36)
at org.apache.lucene.util.TestRuleAssertionsRequired$1.evaluate(TestRuleAssertionsRequired.java:53)
at org.apache.lucene.util.TestRuleMarkFailure$1.evaluate(TestRuleMarkFailure.java:47)
at org.apache.lucene.util.TestRuleIgnoreAfterMaxFailures$1.evaluate(TestRuleIgnoreAfterMaxFailures.java:64)
at org.apache.lucene.util.TestRuleIgnoreTestSuites$1.evaluate(TestRuleIgnoreTestSuites.java:54)
at com.carrotsearch.randomizedtesting.rules.StatementAdapter.evaluate(StatementAdapter.java:36)
at com.carrotsearch.randomizedtesting.ThreadLeakControl$StatementRunner.run(ThreadLeakControl.java:368)
at java.base/java.lang.Thread.run(Thread.java:844)
Build Log:
[...truncated 1852 lines...]
[junit4] JVM J0: stdout was not empty, see: /home/jenkins/workspace/Lucene-Solr-BadApples-master-Linux/lucene/build/core/test/temp/junit4-J0-20180402_031217_6777038658987871458553.sysout
[junit4] >>> JVM J0 emitted unexpected output (verbatim) ----
[junit4] codec: FastDecompressionCompressingStoredFields, pf: Direct, dvf: Direct
[junit4] <<< JVM J0: EOF ----
[...truncated 10357 lines...]
[junit4] Suite: org.apache.solr.cloud.SSLMigrationTest
[junit4] 2> Creating dataDir: /home/jenkins/workspace/Lucene-Solr-BadApples-master-Linux/solr/build/solr-core/test/J1/temp/solr.cloud.SSLMigrationTest_F06E2829749A49C1-001/init-core-data-001
[junit4] 2> 98953 WARN (SUITE-SSLMigrationTest-seed#[F06E2829749A49C1]-worker) [ ] o.a.s.SolrTestCaseJ4 startTrackingSearchers: numOpens=12 numCloses=12
[junit4] 2> 98953 INFO (SUITE-SSLMigrationTest-seed#[F06E2829749A49C1]-worker) [ ] o.a.s.SolrTestCaseJ4 Using PointFields (NUMERIC_POINTS_SYSPROP=true) w/NUMERIC_DOCVALUES_SYSPROP=true
[junit4] 2> 98954 INFO (SUITE-SSLMigrationTest-seed#[F06E2829749A49C1]-worker) [ ] o.a.s.SolrTestCaseJ4 Randomized ssl (false) and clientAuth (false) via: @org.apache.solr.SolrTestCaseJ4$SuppressSSL(bugUrl="None")
[junit4] 2> 98954 INFO (SUITE-SSLMigrationTest-seed#[F06E2829749A49C1]-worker) [ ] o.a.s.SolrTestCaseJ4 SecureRandom sanity checks: test.solr.allowed.securerandom=null & java.security.egd=file:/dev/./urandom
[junit4] 2> 98954 INFO (SUITE-SSLMigrationTest-seed#[F06E2829749A49C1]-worker) [ ] o.a.s.BaseDistributedSearchTestCase Setting hostContext system property: /
[junit4] 2> 98955 INFO (TEST-SSLMigrationTest.test-seed#[F06E2829749A49C1]) [ ] o.a.s.c.ZkTestServer STARTING ZK TEST SERVER
[junit4] 2> 98965 INFO (Thread-138) [ ] o.a.s.c.ZkTestServer client port:0.0.0.0/0.0.0.0:0
[junit4] 2> 98965 INFO (Thread-138) [ ] o.a.s.c.ZkTestServer Starting server
[junit4] 2> 98997 ERROR (Thread-138) [ ] o.a.z.s.ZooKeeperServer ZKShutdownHandler is not registered, so ZooKeeper server won't take any action on ERROR or SHUTDOWN server state changes
[junit4] 2> 99069 INFO (TEST-SSLMigrationTest.test-seed#[F06E2829749A49C1]) [ ] o.a.s.c.ZkTestServer start zk server on port:34755
[junit4] 2> 99097 INFO (zkConnectionManagerCallback-188-thread-1) [ ] o.a.s.c.c.ConnectionManager zkClient has connected
[junit4] 2> 99113 INFO (zkConnectionManagerCallback-190-thread-1) [ ] o.a.s.c.c.ConnectionManager zkClient has connected
[junit4] 2> 99116 INFO (TEST-SSLMigrationTest.test-seed#[F06E2829749A49C1]) [ ] o.a.s.c.AbstractZkTestCase put /home/jenkins/workspace/Lucene-Solr-BadApples-master-Linux/solr/core/src/test-files/solr/collection1/conf/solrconfig-tlog.xml to /configs/conf1/solrconfig.xml
[junit4] 2> 99117 INFO (TEST-SSLMigrationTest.test-seed#[F06E2829749A49C1]) [ ] o.a.s.c.AbstractZkTestCase put /home/jenkins/workspace/Lucene-Solr-BadApples-master-Linux/solr/core/src/test-files/solr/collection1/conf/schema.xml to /configs/conf1/schema.xml
[junit4] 2> 99118 INFO (TEST-SSLMigrationTest.test-seed#[F06E2829749A49C1]) [ ] o.a.s.c.AbstractZkTestCase put /home/jenkins/workspace/Lucene-Solr-BadApples-master-Linux/solr/core/src/test-files/solr/collection1/conf/solrconfig.snippet.randomindexconfig.xml to /configs/conf1/solrconfig.snippet.randomindexconfig.xml
[junit4] 2> 99119 INFO (TEST-SSLMigrationTest.test-seed#[F06E2829749A49C1]) [ ] o.a.s.c.AbstractZkTestCase put /home/jenkins/workspace/Lucene-Solr-BadApples-master-Linux/solr/core/src/test-files/solr/collection1/conf/stopwords.txt to /configs/conf1/stopwords.txt
[junit4] 2> 99119 INFO (TEST-SSLMigrationTest.test-seed#[F06E2829749A49C1]) [ ] o.a.s.c.AbstractZkTestCase put /home/jenkins/workspace/Lucene-Solr-BadApples-master-Linux/solr/core/src/test-files/solr/collection1/conf/protwords.txt to /configs/conf1/protwords.txt
[junit4] 2> 99120 INFO (TEST-SSLMigrationTest.test-seed#[F06E2829749A49C1]) [ ] o.a.s.c.AbstractZkTestCase put /home/jenkins/workspace/Lucene-Solr-BadApples-master-Linux/solr/core/src/test-files/solr/collection1/conf/currency.xml to /configs/conf1/currency.xml
[junit4] 2> 99121 INFO (TEST-SSLMigrationTest.test-seed#[F06E2829749A49C1]) [ ] o.a.s.c.AbstractZkTestCase put /home/jenkins/workspace/Lucene-Solr-BadApples-master-Linux/solr/core/src/test-files/solr/collection1/conf/enumsConfig.xml to /configs/conf1/enumsConfig.xml
[junit4] 2> 99122 INFO (TEST-SSLMigrationTest.test-seed#[F06E2829749A49C1]) [ ] o.a.s.c.AbstractZkTestCase put /home/jenkins/workspace/Lucene-Solr-BadApples-master-Linux/solr/core/src/test-files/solr/collection1/conf/open-exchange-rates.json to /configs/conf1/open-exchange-rates.json
[junit4] 2> 99123 INFO (TEST-SSLMigrationTest.test-seed#[F06E2829749A49C1]) [ ] o.a.s.c.AbstractZkTestCase put /home/jenkins/workspace/Lucene-Solr-BadApples-master-Linux/solr/core/src/test-files/solr/collection1/conf/mapping-ISOLatin1Accent.txt to /configs/conf1/mapping-ISOLatin1Accent.txt
[junit4] 2> 99124 INFO (TEST-SSLMigrationTest.test-seed#[F06E2829749A49C1]) [ ] o.a.s.c.AbstractZkTestCase put /home/jenkins/workspace/Lucene-Solr-BadApples-master-Linux/solr/core/src/test-files/solr/collection1/conf/old_synonyms.txt to /configs/conf1/old_synonyms.txt
[junit4] 2> 99125 INFO (TEST-SSLMigrationTest.test-seed#[F06E2829749A49C1]) [ ] o.a.s.c.AbstractZkTestCase put /home/jenkins/workspace/Lucene-Solr-BadApples-master-Linux/solr/core/src/test-files/solr/collection1/conf/synonyms.txt to /configs/conf1/synonyms.txt
[junit4] 2> 99128 INFO (TEST-SSLMigrationTest.test-seed#[F06E2829749A49C1]) [ ] o.a.s.c.AbstractFullDistribZkTestBase Will use NRT replicas unless explicitly asked otherwise
[junit4] 2> 99243 INFO (TEST-SSLMigrationTest.test-seed#[F06E2829749A49C1]) [ ] o.e.j.s.Server jetty-9.4.8.v20171121, build timestamp: ????-??-??T??:??:??Z, git hash: 82b8fb23f757335bb3329d540ce37a2a2615f0a8
[junit4] 2> 99269 INFO (TEST-SSLMigrationTest.test-seed#[F06E2829749A49C1]) [ ] o.e.j.s.session DefaultSessionIdManager workerName=node0
[junit4] 2> 99269 INFO (TEST-SSLMigrationTest.test-seed#[F06E2829749A49C1]) [ ] o.e.j.s.session No SessionScavenger set, using defaults
[junit4] 2> 99269 INFO (TEST-SSLMigrationTest.test-seed#[F06E2829749A49C1]) [ ] o.e.j.s.session Scavenging every 600000ms
[junit4] 2> 99270 INFO (TEST-SSLMigrationTest.test-seed#[F06E2829749A49C1]) [ ] o.e.j.s.h.ContextHandler Started o.e.j.s.ServletContextHandler@6248d791{/,null,AVAILABLE}
[junit4] 2> 99272 INFO (TEST-SSLMigrationTest.test-seed#[F06E2829749A49C1]) [ ] o.e.j.s.AbstractConnector Started ServerConnector@61c2aa0c{HTTP/1.1,[http/1.1]}{127.0.0.1:37269}
[junit4] 2> 99272 INFO (TEST-SSLMigrationTest.test-seed#[F06E2829749A49C1]) [ ] o.e.j.s.Server Started @99291ms
[junit4] 2> 99272 INFO (TEST-SSLMigrationTest.test-seed#[F06E2829749A49C1]) [ ] o.a.s.c.s.e.JettySolrRunner Jetty properties: {hostContext=/, solr.data.dir=/home/jenkins/workspace/Lucene-Solr-BadApples-master-Linux/solr/build/solr-core/test/J1/temp/solr.cloud.SSLMigrationTest_F06E2829749A49C1-001/tempDir-001/control/data, hostPort=37269, coreRootDirectory=/home/jenkins/workspace/Lucene-Solr-BadApples-master-Linux/solr/build/solr-core/test/J1/temp/solr.cloud.SSLMigrationTest_F06E2829749A49C1-001/control-001/cores}
[junit4] 2> 99272 ERROR (TEST-SSLMigrationTest.test-seed#[F06E2829749A49C1]) [ ] o.a.s.u.StartupLoggingUtils Missing Java Option solr.log.dir. Logging may be missing or incomplete.
[junit4] 2> 99272 INFO (TEST-SSLMigrationTest.test-seed#[F06E2829749A49C1]) [ ] o.a.s.s.SolrDispatchFilter Using logger factory org.apache.logging.slf4j.Log4jLoggerFactory
[junit4] 2> 99272 INFO (TEST-SSLMigrationTest.test-seed#[F06E2829749A49C1]) [ ] o.a.s.s.SolrDispatchFilter ___ _ Welcome to Apache Solr? version 8.0.0
[junit4] 2> 99272 INFO (TEST-SSLMigrationTest.test-seed#[F06E2829749A49C1]) [ ] o.a.s.s.SolrDispatchFilter / __| ___| |_ _ Starting in cloud mode on port null
[junit4] 2> 99272 INFO (TEST-SSLMigrationTest.test-seed#[F06E2829749A49C1]) [ ] o.a.s.s.SolrDispatchFilter \__ \/ _ \ | '_| Install dir: null
[junit4] 2> 99272 INFO (TEST-SSLMigrationTest.test-seed#[F06E2829749A49C1]) [ ] o.a.s.s.SolrDispatchFilter |___/\___/_|_| Start time: 2018-04-02T03:36:01.400838Z
[junit4] 2> 99285 INFO (zkConnectionManagerCallback-192-thread-1) [ ] o.a.s.c.c.ConnectionManager zkClient has connected
[junit4] 2> 99288 INFO (TEST-SSLMigrationTest.test-seed#[F06E2829749A49C1]) [ ] o.a.s.s.SolrDispatchFilter Loading solr.xml from SolrHome (not found in ZooKeeper)
[junit4] 2> 99288 INFO (TEST-SSLMigrationTest.test-seed#[F06E2829749A49C1]) [ ] o.a.s.c.SolrXmlConfig Loading container configuration from /home/jenkins/workspace/Lucene-Solr-BadApples-master-Linux/solr/build/solr-core/test/J1/temp/solr.cloud.SSLMigrationTest_F06E2829749A49C1-001/control-001/solr.xml
[junit4] 2> 99291 INFO (TEST-SSLMigrationTest.test-seed#[F06E2829749A49C1]) [ ] o.a.s.c.SolrXmlConfig Configuration parameter autoReplicaFailoverWorkLoopDelay is ignored
[junit4] 2> 99291 INFO (TEST-SSLMigrationTest.test-seed#[F06E2829749A49C1]) [ ] o.a.s.c.SolrXmlConfig Configuration parameter autoReplicaFailoverBadNodeExpiration is ignored
[junit4] 2> 99291 INFO (TEST-SSLMigrationTest.test-seed#[F06E2829749A49C1]) [ ] o.a.s.c.SolrXmlConfig MBean server found: com.sun.jmx.mbeanserver.JmxMBeanServer@409bbb8, but no JMX reporters were configured - adding default JMX reporter.
[junit4] 2> 99306 INFO (TEST-SSLMigrationTest.test-seed#[F06E2829749A49C1]) [ ] o.a.s.c.ZkContainer Zookeeper client=127.0.0.1:34755/solr
[junit4] 2> 99325 INFO (zkConnectionManagerCallback-196-thread-1) [ ] o.a.s.c.c.ConnectionManager zkClient has connected
[junit4] 2> 99345 INFO (zkConnectionManagerCallback-198-thread-1) [ ] o.a.s.c.c.ConnectionManager zkClient has connected
[junit4] 2> 99414 INFO (TEST-SSLMigrationTest.test-seed#[F06E2829749A49C1]) [n:127.0.0.1:37269_ ] o.a.s.c.Overseer Overseer (id=null) closing
[junit4] 2> 99415 INFO (TEST-SSLMigrationTest.test-seed#[F06E2829749A49C1]) [n:127.0.0.1:37269_ ] o.a.s.c.OverseerElectionContext I am going to be the leader 127.0.0.1:37269_
[junit4] 2> 99415 INFO (TEST-SSLMigrationTest.test-seed#[F06E2829749A49C1]) [n:127.0.0.1:37269_ ] o.a.s.c.Overseer Overseer (id=72067934739234820-127.0.0.1:37269_-n_0000000000) starting
[junit4] 2> 99473 INFO (zkConnectionManagerCallback-203-thread-1) [ ] o.a.s.c.c.ConnectionManager zkClient has connected
[junit4] 2> 99475 INFO (TEST-SSLMigrationTest.test-seed#[F06E2829749A49C1]) [n:127.0.0.1:37269_ ] o.a.s.c.s.i.ZkClientClusterStateProvider Cluster at 127.0.0.1:34755/solr ready
[junit4] 2> 99512 INFO (TEST-SSLMigrationTest.test-seed#[F06E2829749A49C1]) [n:127.0.0.1:37269_ ] o.a.s.c.ZkController Register node as live in ZooKeeper:/live_nodes/127.0.0.1:37269_
[junit4] 2> 99532 INFO (zkCallback-202-thread-1) [ ] o.a.s.c.c.ZkStateReader Updated live nodes from ZooKeeper... (0) -> (1)
[junit4] 2> 99548 INFO (OverseerStateUpdate-72067934739234820-127.0.0.1:37269_-n_0000000000) [ ] o.a.s.c.c.ZkStateReader Updated live nodes from ZooKeeper... (0) -> (1)
[junit4] 2> 99908 INFO (TEST-SSLMigrationTest.test-seed#[F06E2829749A49C1]) [n:127.0.0.1:37269_ ] o.a.s.m.r.SolrJmxReporter JMX monitoring for 'solr.node' (registry 'solr.node') enabled at server: com.sun.jmx.mbeanserver.JmxMBeanServer@409bbb8
[junit4] 2> 99917 INFO (TEST-SSLMigrationTest.test-seed#[F06E2829749A49C1]) [n:127.0.0.1:37269_ ] o.a.s.m.r.SolrJmxReporter JMX monitoring for 'solr.jvm' (registry 'solr.jvm') enabled at server: com.sun.jmx.mbeanserver.JmxMBeanServer@409bbb8
[junit4] 2> 99917 INFO (TEST-SSLMigrationTest.test-seed#[F06E2829749A49C1]) [n:127.0.0.1:37269_ ] o.a.s.m.r.SolrJmxReporter JMX monitoring for 'solr.jetty' (registry 'solr.jetty') enabled at server: com.sun.jmx.mbeanserver.JmxMBeanServer@409bbb8
[junit4] 2> 99918 INFO (TEST-SSLMigrationTest.test-seed#[F06E2829749A49C1]) [n:127.0.0.1:37269_ ] o.a.s.c.CorePropertiesLocator Found 0 core definitions underneath /home/jenkins/workspace/Lucene-Solr-BadApples-master-Linux/solr/build/solr-core/test/J1/temp/solr.cloud.SSLMigrationTest_F06E2829749A49C1-001/control-001/cores
[junit4] 2> 99985 INFO (zkConnectionManagerCallback-207-thread-1) [ ] o.a.s.c.c.ConnectionManager zkClient has connected
[junit4] 2> 99986 INFO (TEST-SSLMigrationTest.test-seed#[F06E2829749A49C1]) [ ] o.a.s.c.c.ZkStateReader Updated live nodes from ZooKeeper... (0) -> (1)
[junit4] 2> 99987 INFO (TEST-SSLMigrationTest.test-seed#[F06E2829749A49C1]) [ ] o.a.s.c.s.i.ZkClientClusterStateProvider Cluster at 127.0.0.1:34755/solr ready
[junit4] 2> 100008 INFO (qtp483172188-746) [n:127.0.0.1:37269_ ] o.a.s.h.a.CollectionsHandler Invoked Collection Action :create with params replicationFactor=1&collection.configName=conf1&name=control_collection&nrtReplicas=1&action=CREATE&numShards=1&createNodeSet=127.0.0.1:37269_&wt=javabin&version=2 and sendToOCPQueue=true
[junit4] 2> 100021 INFO (OverseerThreadFactory-396-thread-1) [ ] o.a.s.c.a.c.CreateCollectionCmd Create collection control_collection
[junit4] 2> 100131 INFO (qtp483172188-752) [n:127.0.0.1:37269_ ] o.a.s.h.a.CoreAdminOperation core create command qt=/admin/cores&collection.configName=conf1&newCollection=true&name=control_collection_shard1_replica_n1&action=CREATE&numShards=1&collection=control_collection&shard=shard1&wt=javabin&version=2&replicaType=NRT
[junit4] 2> 100132 INFO (qtp483172188-752) [n:127.0.0.1:37269_ ] o.a.s.c.TransientSolrCoreCacheDefault Allocating transient cache for 4 transient cores
[junit4] 2> 100239 INFO (zkCallback-197-thread-1) [ ] o.a.s.c.c.ZkStateReader A cluster state change: [WatchedEvent state:SyncConnected type:NodeDataChanged path:/collections/control_collection/state.json] for collection [control_collection] has occurred - updating... (live nodes size: [1])
[junit4] 2> 101188 INFO (qtp483172188-752) [n:127.0.0.1:37269_ c:control_collection s:shard1 x:control_collection_shard1_replica_n1] o.a.s.c.SolrConfig Using Lucene MatchVersion: 8.0.0
[junit4] 2> 101222 INFO (qtp483172188-752) [n:127.0.0.1:37269_ c:control_collection s:shard1 x:control_collection_shard1_replica_n1] o.a.s.s.IndexSchema [control_collection_shard1_replica_n1] Schema name=test
[junit4] 2> 101388 INFO (qtp483172188-752) [n:127.0.0.1:37269_ c:control_collection s:shard1 x:control_collection_shard1_replica_n1] o.a.s.s.IndexSchema Loaded schema test/1.0 with uniqueid field id
[junit4] 2> 101434 INFO (qtp483172188-752) [n:127.0.0.1:37269_ c:control_collection s:shard1 x:control_collection_shard1_replica_n1] o.a.s.c.CoreContainer Creating SolrCore 'control_collection_shard1_replica_n1' using configuration from collection control_collection, trusted=true
[junit4] 2> 101434 INFO (qtp483172188-752) [n:127.0.0.1:37269_ c:control_collection s:shard1 x:control_collection_shard1_replica_n1] o.a.s.m.r.SolrJmxReporter JMX monitoring for 'solr.core.control_collection.shard1.replica_n1' (registry 'solr.core.control_collection.shard1.replica_n1') enabled at server: com.sun.jmx.mbeanserver.JmxMBeanServer@409bbb8
[junit4] 2> 101434 INFO (qtp483172188-752) [n:127.0.0.1:37269_ c:control_collection s:shard1 x:control_collection_shard1_replica_n1] o.a.s.c.SolrCore solr.RecoveryStrategy.Builder
[junit4] 2> 101435 INFO (qtp483172188-752) [n:127.0.0.1:37269_ c:control_collection s:shard1 x:control_collection_shard1_replica_n1] o.a.s.c.SolrCore [[control_collection_shard1_replica_n1] ] Opening new SolrCore at [/home/jenkins/workspace/Lucene-Solr-BadApples-master-Linux/solr/build/solr-core/test/J1/temp/solr.cloud.SSLMigrationTest_F06E2829749A49C1-001/control-001/cores/control_collection_shard1_replica_n1], dataDir=[/home/jenkins/workspace/Lucene-Solr-BadApples-master-Linux/solr/build/solr-core/test/J1/temp/solr.cloud.SSLMigrationTest_F06E2829749A49C1-001/control-001/cores/control_collection_shard1_replica_n1/data/]
[junit4] 2> 101437 INFO (qtp483172188-752) [n:127.0.0.1:37269_ c:control_collection s:shard1 x:control_collection_shard1_replica_n1] o.a.s.u.RandomMergePolicy RandomMergePolicy wrapping class org.apache.lucene.index.LogByteSizeMergePolicy: [LogByteSizeMergePolicy: minMergeSize=1677721, mergeFactor=12, maxMergeSize=2147483648, maxMergeSizeForForcedMerge=9223372036854775807, calibrateSizeByDeletes=true, maxMergeDocs=2147483647, maxCFSSegmentSizeMB=8.796093022207999E12, noCFSRatio=0.2669734715023955]
[junit4] 2> 101467 WARN (qtp483172188-752) [n:127.0.0.1:37269_ c:control_collection s:shard1 x:control_collection_shard1_replica_n1] o.a.s.c.RequestHandlers INVALID paramSet a in requestHandler {type = requestHandler,name = /dump,class = DumpRequestHandler,attributes = {initParams=a, name=/dump, class=DumpRequestHandler},args = {defaults={a=A,b=B}}}
[junit4] 2> 101513 INFO (qtp483172188-752) [n:127.0.0.1:37269_ c:control_collection s:shard1 x:control_collection_shard1_replica_n1] o.a.s.u.UpdateHandler Using UpdateLog implementation: org.apache.solr.update.UpdateLog
[junit4] 2> 101514 INFO (qtp483172188-752) [n:127.0.0.1:37269_ c:control_collection s:shard1 x:control_collection_shard1_replica_n1] o.a.s.u.UpdateLog Initializing UpdateLog: dataDir= defaultSyncLevel=FLUSH numRecordsToKeep=100 maxNumLogsToKeep=10 numVersionBuckets=65536
[junit4] 2> 101515 INFO (qtp483172188-752) [n:127.0.0.1:37269_ c:control_collection s:shard1 x:control_collection_shard1_replica_n1] o.a.s.u.CommitTracker Hard AutoCommit: disabled
[junit4] 2> 101515 INFO (qtp483172188-752) [n:127.0.0.1:37269_ c:control_collection s:shard1 x:control_collection_shard1_replica_n1] o.a.s.u.CommitTracker Soft AutoCommit: disabled
[junit4] 2> 101516 INFO (qtp483172188-752) [n:127.0.0.1:37269_ c:control_collection s:shard1 x:control_collection_shard1_replica_n1] o.a.s.u.RandomMergePolicy RandomMergePolicy wrapping class org.apache.lucene.index.TieredMergePolicy: [TieredMergePolicy: maxMergeAtOnce=33, maxMergeAtOnceExplicit=10, maxMergedSegmentMB=64.4892578125, floorSegmentMB=1.458984375, forceMergeDeletesPctAllowed=18.212551476370834, segmentsPerTier=22.0, maxCFSSegmentSizeMB=8.796093022207999E12, noCFSRatio=0.0
[junit4] 2> 101517 INFO (qtp483172188-752) [n:127.0.0.1:37269_ c:control_collection s:shard1 x:control_collection_shard1_replica_n1] o.a.s.s.SolrIndexSearcher Opening [Searcher@d67f99c[control_collection_shard1_replica_n1] main]
[junit4] 2> 101518 INFO (qtp483172188-752) [n:127.0.0.1:37269_ c:control_collection s:shard1 x:control_collection_shard1_replica_n1] o.a.s.r.ManagedResourceStorage Configured ZooKeeperStorageIO with znodeBase: /configs/conf1
[junit4] 2> 101518 INFO (qtp483172188-752) [n:127.0.0.1:37269_ c:control_collection s:shard1 x:control_collection_shard1_replica_n1] o.a.s.r.ManagedResourceStorage Loaded null at path _rest_managed.json using ZooKeeperStorageIO:path=/configs/conf1
[junit4] 2> 101520 INFO (qtp483172188-752) [n:127.0.0.1:37269_ c:control_collection s:shard1 x:control_collection_shard1_replica_n1] o.a.s.h.ReplicationHandler Commits will be reserved for 10000ms.
[junit4] 2> 101521 INFO (searcherExecutor-399-thread-1-processing-n:127.0.0.1:37269_ x:control_collection_shard1_replica_n1 c:control_collection s:shard1) [n:127.0.0.1:37269_ c:control_collection s:shard1 x:control_collection_shard1_replica_n1] o.a.s.c.SolrCore [control_collection_shard1_replica_n1] Registered new searcher Searcher@d67f99c[control_collection_shard1_replica_n1] main{ExitableDirectoryReader(UninvertingDirectoryReader())}
[junit4] 2> 101521 INFO (qtp483172188-752) [n:127.0.0.1:37269_ c:control_collection s:shard1 x:control_collection_shard1_replica_n1] o.a.s.u.UpdateLog Could not find max version in index or recent updates, using new clock 1596603932238413824
[junit4] 2> 101527 INFO (qtp483172188-752) [n:127.0.0.1:37269_ c:control_collection s:shard1 x:control_collection_shard1_replica_n1] o.a.s.c.ZkShardTerms Successful update of terms at /collections/control_collection/terms/shard1 to Terms{values={core_node2=0}, version=0}
[junit4] 2> 101529 INFO (qtp483172188-752) [n:127.0.0.1:37269_ c:control_collection s:shard1 x:control_collection_shard1_replica_n1] o.a.s.c.ShardLeaderElectionContext Enough replicas found to continue.
[junit4] 2> 101529 INFO (qtp483172188-752) [n:127.0.0.1:37269_ c:control_collection s:shard1 x:control_collection_shard1_replica_n1] o.a.s.c.ShardLeaderElectionContext I may be the new leader - try and sync
[junit4] 2> 101529 INFO (qtp483172188-752) [n:127.0.0.1:37269_ c:control_collection s:shard1 x:control_collection_shard1_replica_n1] o.a.s.c.SyncStrategy Sync replicas to http://127.0.0.1:37269/control_collection_shard1_replica_n1/
[junit4] 2> 101529 INFO (qtp483172188-752) [n:127.0.0.1:37269_ c:control_collection s:shard1 x:control_collection_shard1_replica_n1] o.a.s.c.SyncStrategy Sync Success - now sync replicas to me
[junit4] 2> 101529 INFO (qtp483172188-752) [n:127.0.0.1:37269_ c:control_collection s:shard1 x:control_collection_shard1_replica_n1] o.a.s.c.SyncStrategy http://127.0.0.1:37269/control_collection_shard1_replica_n1/ has no replicas
[junit4] 2> 101529 INFO (qtp483172188-752) [n:127.0.0.1:37269_ c:control_collection s:shard1 x:control_collection_shard1_replica_n1] o.a.s.c.ShardLeaderElectionContext Found all replicas participating in election, clear LIR
[junit4] 2> 101533 INFO (qtp483172188-752) [n:127.0.0.1:37269_ c:control_collection s:shard1 x:control_collection_shard1_replica_n1] o.a.s.c.ShardLeaderElectionContext I am the new leader: http://127.0.0.1:37269/control_collection_shard1_replica_n1/ shard1
[junit4] 2> 101637 INFO (zkCallback-197-thread-2) [ ] o.a.s.c.c.ZkStateReader A cluster state change: [WatchedEvent state:SyncConnected type:NodeDataChanged path:/collections/control_collection/state.json] for collection [control_collection] has occurred - updating... (live nodes size: [1])
[junit4] 2> 101684 INFO (qtp483172188-752) [n:127.0.0.1:37269_ c:control_collection s:shard1 x:control_collection_shard1_replica_n1] o.a.s.c.ZkController I am the leader, no recovery necessary
[junit4] 2> 101732 INFO (qtp483172188-752) [n:127.0.0.1:37269_ c:control_collection s:shard1 x:control_collection_shard1_replica_n1] o.a.s.s.HttpSolrCall [admin] webapp=null path=/admin/cores params={qt=/admin/cores&collection.configName=conf1&newCollection=true&name=control_collection_shard1_replica_n1&action=CREATE&numShards=1&collection=control_collection&shard=shard1&wt=javabin&version=2&replicaType=NRT} status=0 QTime=1600
[junit4] 2> 101740 INFO (qtp483172188-746) [n:127.0.0.1:37269_ ] o.a.s.h.a.CollectionsHandler Wait for new collection to be active for at most 30 seconds. Check all shard replicas
[junit4] 2> 101789 INFO (zkCallback-197-thread-2) [ ] o.a.s.c.c.ZkStateReader A cluster state change: [WatchedEvent state:SyncConnected type:NodeDataChanged path:/collections/control_collection/state.json] for collection [control_collection] has occurred - updating... (live nodes size: [1])
[junit4] 2> 102023 INFO (OverseerCollectionConfigSetProcessor-72067934739234820-127.0.0.1:37269_-n_0000000000) [ ] o.a.s.c.OverseerTaskQueue Response ZK path: /overseer/collection-queue-work/qnr-0000000000 doesn't exist. Requestor may have disconnected from ZooKeeper
[junit4] 2> 102740 INFO (qtp483172188-746) [n:127.0.0.1:37269_ ] o.a.s.s.HttpSolrCall [admin] webapp=null path=/admin/collections params={replicationFactor=1&collection.configName=conf1&name=control_collection&nrtReplicas=1&action=CREATE&numShards=1&createNodeSet=127.0.0.1:37269_&wt=javabin&version=2} status=0 QTime=2732
[junit4] 2> 102765 INFO (zkConnectionManagerCallback-211-thread-1) [ ] o.a.s.c.c.ConnectionManager zkClient has connected
[junit4] 2> 102784 INFO (TEST-SSLMigrationTest.test-seed#[F06E2829749A49C1]) [ ] o.a.s.c.c.ZkStateReader Updated live nodes from ZooKeeper... (0) -> (1)
[junit4] 2> 102784 INFO (TEST-SSLMigrationTest.test-seed#[F06E2829749A49C1]) [ ] o.a.s.c.s.i.ZkClientClusterStateProvider Cluster at 127.0.0.1:34755/solr ready
[junit4] 2> 102784 INFO (TEST-SSLMigrationTest.test-seed#[F06E2829749A49C1]) [ ] o.a.s.c.ChaosMonkey monkey: init - expire sessions:false cause connection loss:false
[junit4] 2> 102788 INFO (qtp483172188-752) [n:127.0.0.1:37269_ ] o.a.s.h.a.CollectionsHandler Invoked Collection Action :create with params replicationFactor=1&collection.configName=conf1&name=collection1&nrtReplicas=1&action=CREATE&numShards=2&createNodeSet=&stateFormat=2&wt=javabin&version=2 and sendToOCPQueue=true
[junit4] 2> 102797 INFO (OverseerThreadFactory-396-thread-2) [ ] o.a.s.c.a.c.CreateCollectionCmd Create collection collection1
[junit4] 2> 102803 WARN (OverseerThreadFactory-396-thread-2) [ ] o.a.s.c.a.c.CreateCollectionCmd It is unusual to create a collection (collection1) without cores.
[junit4] 2> 103014 INFO (qtp483172188-752) [n:127.0.0.1:37269_ ] o.a.s.h.a.CollectionsHandler Wait for new collection to be active for at most 30 seconds. Check all shard replicas
[junit4] 2> 103015 INFO (qtp483172188-752) [n:127.0.0.1:37269_ ] o.a.s.s.HttpSolrCall [admin] webapp=null path=/admin/collections params={replicationFactor=1&collection.configName=conf1&name=collection1&nrtReplicas=1&action=CREATE&numShards=2&createNodeSet=&stateFormat=2&wt=javabin&version=2} status=0 QTime=227
[junit4] 2> 103099 INFO (TEST-SSLMigrationTest.test-seed#[F06E2829749A49C1]) [ ] o.a.s.c.AbstractFullDistribZkTestBase create jetty 1 in directory /home/jenkins/workspace/Lucene-Solr-BadApples-master-Linux/solr/build/solr-core/test/J1/temp/solr.cloud.SSLMigrationTest_F06E2829749A49C1-001/shard-1-001 of type NRT
[junit4] 2> 103100 INFO (TEST-SSLMigrationTest.test-seed#[F06E2829749A49C1]) [ ] o.e.j.s.Server jetty-9.4.8.v20171121, build timestamp: ????-??-??T??:??:??Z, git hash: 82b8fb23f757335bb3329d540ce37a2a2615f0a8
[junit4] 2> 103113 INFO (TEST-SSLMigrationTest.test-seed#[F06E2829749A49C1]) [ ] o.e.j.s.session DefaultSessionIdManager workerName=node0
[junit4] 2> 103113 INFO (TEST-SSLMigrationTest.test-seed#[F06E2829749A49C1]) [ ] o.e.j.s.session No SessionScavenger set, using defaults
[junit4] 2> 103114 INFO (TEST-SSLMigrationTest.test-seed#[F06E2829749A49C1]) [ ] o.e.j.s.session Scavenging every 660000ms
[junit4] 2> 103117 INFO (TEST-SSLMigrationTest.test-seed#[F06E2829749A49C1]) [ ] o.e.j.s.h.ContextHandler Started o.e.j.s.ServletContextHandler@69b81fdf{/,null,AVAILABLE}
[junit4] 2> 103119 INFO (TEST-SSLMigrationTest.test-seed#[F06E2829749A49C1]) [ ] o.e.j.s.AbstractConnector Started ServerConnector@72cdcae4{HTTP/1.1,[http/1.1]}{127.0.0.1:45251}
[junit4] 2> 103119 INFO (TEST-SSLMigrationTest.test-seed#[F06E2829749A49C1]) [ ] o.e.j.s.Server Started @103139ms
[junit4] 2> 103119 INFO (TEST-SSLMigrationTest.test-seed#[F06E2829749A49C1]) [ ] o.a.s.c.s.e.JettySolrRunner Jetty properties: {hostContext=/, solrconfig=solrconfig.xml, solr.data.dir=/home/jenkins/workspace/Lucene-Solr-BadApples-master-Linux/solr/build/solr-core/test/J1/temp/solr.cloud.SSLMigrationTest_F06E2829749A49C1-001/tempDir-001/jetty1, hostPort=45251, coreRootDirectory=/home/jenkins/workspace/Lucene-Solr-BadApples-master-Linux/solr/build/solr-core/test/J1/temp/solr.cloud.SSLMigrationTest_F06E2829749A49C1-001/shard-1-001/cores, replicaType=NRT}
[junit4] 2> 103120 ERROR (TEST-SSLMigrationTest.test-seed#[F06E2829749A49C1]) [ ] o.a.s.u.StartupLoggingUtils Missing Java Option solr.log.dir. Logging may be missing or incomplete.
[junit4] 2> 103120 INFO (TEST-SSLMigrationTest.test-seed#[F06E2829749A49C1]) [ ] o.a.s.s.SolrDispatchFilter Using logger factory org.apache.logging.slf4j.Log4jLoggerFactory
[junit4] 2> 103120 INFO (TEST-SSLMigrationTest.test-seed#[F06E2829749A49C1]) [ ] o.a.s.s.SolrDispatchFilter ___ _ Welcome to Apache Solr? version 8.0.0
[junit4] 2> 103120 INFO (TEST-SSLMigrationTest.test-seed#[F06E2829749A49C1]) [ ] o.a.s.s.SolrDispatchFilter / __| ___| |_ _ Starting in cloud mode on port null
[junit4] 2> 103120 INFO (TEST-SSLMigrationTest.test-seed#[F06E2829749A49C1]) [ ] o.a.s.s.SolrDispatchFilter \__ \/ _ \ | '_| Install dir: null
[junit4] 2> 103120 INFO (TEST-SSLMigrationTest.test-seed#[F06E2829749A49C1]) [ ] o.a.s.s.SolrDispatchFilter |___/\___/_|_| Start time: 2018-04-02T03:36:05.248651Z
[junit4] 2> 103132 INFO (zkConnectionManagerCallback-213-thread-1) [ ] o.a.s.c.c.ConnectionManager zkClient has connected
[junit4] 2> 103134 INFO (TEST-SSLMigrationTest.test-seed#[F06E2829749A49C1]) [ ] o.a.s.s.SolrDispatchFilter Loading solr.xml from SolrHome (not found in ZooKeeper)
[junit4] 2> 103134 INFO (TEST-SSLMigrationTest.test-seed#[F06E2829749A49C1]) [ ] o.a.s.c.SolrXmlConfig Loading container configuration from /home/jenkins/workspace/Lucene-Solr-BadApples-master-Linux/solr/build/solr-core/test/J1/temp/solr.cloud.SSLMigrationTest_F06E2829749A49C1-001/shard-1-001/solr.xml
[junit4] 2> 103137 INFO (TEST-SSLMigrationTest.test-seed#[F06E2829749A49C1]) [ ] o.a.s.c.SolrXmlConfig Configuration parameter autoReplicaFailoverWorkLoopDelay is ignored
[junit4] 2> 103137 INFO (TEST-SSLMigrationTest.test-seed#[F06E2829749A49C1]) [ ] o.a.s.c.SolrXmlConfig Configuration parameter autoReplicaFailoverBadNodeExpiration is ignored
[junit4] 2> 103137 INFO (TEST-SSLMigrationTest.test-seed#[F06E2829749A49C1]) [ ] o.a.s.c.SolrXmlConfig MBean server found: com.sun.jmx.mbeanserver.JmxMBeanServer@409bbb8, but no JMX reporters were configured - adding default JMX reporter.
[junit4] 2> 103144 INFO (TEST-SSLMigrationTest.test-seed#[F06E2829749A49C1]) [ ] o.a.s.c.ZkContainer Zookeeper client=127.0.0.1:34755/solr
[junit4] 2> 103145 INFO (zkConnectionManagerCallback-217-thread-1) [ ] o.a.s.c.c.ConnectionManager zkClient has connected
[junit4] 2> 103154 INFO (zkConnectionManagerCallback-219-thread-1) [ ] o.a.s.c.c.ConnectionManager zkClient has connected
[junit4] 2> 103159 INFO (TEST-SSLMigrationTest.test-seed#[F06E2829749A49C1]) [n:127.0.0.1:45251_ ] o.a.s.c.c.ZkStateReader Updated live nodes from ZooKeeper... (0) -> (1)
[junit4] 2> 103160 INFO (TEST-SSLMigrationTest.test-seed#[F06E2829749A49C1]) [n:127.0.0.1:45251_ ] o.a.s.c.Overseer Overseer (id=null) closing
[junit4] 2> 103161 INFO (TEST-SSLMigrationTest.test-seed#[F06E2829749A49C1]) [n:127.0.0.1:45251_ ] o.a.s.c.TransientSolrCoreCacheDefault Allocating transient cache for 4 transient cores
[junit4] 2> 103161 INFO (TEST-SSLMigrationTest.test-seed#[F06E2829749A49C1]) [n:127.0.0.1:45251_ ] o.a.s.c.ZkController Register node as live in ZooKeeper:/live_nodes/127.0.0.1:45251_
[junit4] 2> 103165 INFO (zkCallback-202-thread-1) [ ] o.a.s.c.c.ZkStateReader Updated live nodes from ZooKeeper... (1) -> (2)
[junit4] 2> 103165 INFO (zkCallback-197-thread-1) [ ] o.a.s.c.c.ZkStateReader Updated live nodes from ZooKeeper... (1) -> (2)
[junit4] 2> 103177 INFO (zkCallback-218-thread-1) [ ] o.a.s.c.c.ZkStateReader Updated live nodes from ZooKeeper... (1) -> (2)
[junit4] 2> 103178 INFO (zkCallback-210-thread-1) [ ] o.a.s.c.c.ZkStateReader Updated live nodes from ZooKeeper... (1) -> (2)
[junit4] 2> 103299 INFO (TEST-SSLMigrationTest.test-seed#[F06E2829749A49C1]) [n:127.0.0.1:45251_ ] o.a.s.m.r.SolrJmxReporter JMX monitoring for 'solr.node' (registry 'solr.node') enabled at server: com.sun.jmx.mbeanserver.JmxMBeanServer@409bbb8
[junit4] 2> 103309 INFO (TEST-SSLMigrationTest.test-seed#[F06E2829749A49C1]) [n:127.0.0.1:45251_ ] o.a.s.m.r.SolrJmxReporter JMX monitoring for 'solr.jvm' (registry 'solr.jvm') enabled at server: com.sun.jmx.mbeanserver.JmxMBeanServer@409bbb8
[junit4] 2> 103309 INFO (TEST-SSLMigrationTest.test-seed#[F06E2829749A49C1]) [n:127.0.0.1:45251_ ] o.a.s.m.r.SolrJmxReporter JMX monitoring for 'solr.jetty' (registry 'solr.jetty') enabled at server: com.sun.jmx.mbeanserver.JmxMBeanServer@409bbb8
[junit4] 2> 103310 INFO (TEST-SSLMigrationTest.test-seed#[F06E2829749A49C1]) [n:127.0.0.1:45251_ ] o.a.s.c.CorePropertiesLocator Found 0 core definitions underneath /home/jenkins/workspace/Lucene-Solr-BadApples-master-Linux/solr/build/solr-core/test/J1/temp/solr.cloud.SSLMigrationTest_F06E2829749A49C1-001/shard-1-001/cores
[junit4] 2> 103336 INFO (zkConnectionManagerCallback-224-thread-1) [ ] o.a.s.c.c.ConnectionManager zkClient has connected
[junit4] 2> 103338 INFO (TEST-SSLMigrationTest.test-seed#[F06E2829749A49C1]) [n:127.0.0.1:45251_ ] o.a.s.c.c.ZkStateReader Updated live nodes from ZooKeeper... (0) -> (2)
[junit4] 2> 103339 INFO (TEST-SSLMigrationTest.test-seed#[F06E2829749A49C1]) [n:127.0.0.1:45251_ ] o.a.s.c.s.i.ZkClientClusterStateProvider Cluster at 127.0.0.1:34755/solr ready
[junit4] 2> 103363 INFO (qtp483172188-751) [n:127.0.0.1:37269_ ] o.a.s.h.a.CollectionsHandler Invoked Collection Action :addreplica with params node=127.0.0.1:45251_&action=ADDREPLICA&collection=collection1&shard=shard2&type=NRT&wt=javabin&version=2 and sendToOCPQueue=true
[junit4] 2> 103382 INFO (OverseerCollectionConfigSetProcessor-72067934739234820-127.0.0.1:37269_-n_0000000000) [ ] o.a.s.c.OverseerTaskQueue Response ZK path: /overseer/collection-queue-work/qnr-0000000002 doesn't exist. Requestor may have disconnected from ZooKeeper
[junit4] 2> 103393 INFO (OverseerThreadFactory-396-thread-3) [ ] o.a.s.c.a.c.AddReplicaCmd Node Identified 127.0.0.1:45251_ for creating new replica
[junit4] 2> 103409 INFO (qtp1750275755-800) [n:127.0.0.1:45251_ ] o.a.s.h.a.CoreAdminOperation core create command qt=/admin/cores&collection.configName=conf1&name=collection1_shard2_replica_n41&action=CREATE&collection=collection1&shard=shard2&wt=javabin&version=2&replicaType=NRT
[junit4] 2> 103519 INFO (zkCallback-218-thread-1) [ ] o.a.s.c.c.ZkStateReader A cluster state change: [WatchedEvent state:SyncConnected type:NodeDataChanged path:/collections/collection1/state.json] for collection [collection1] has occurred - updating... (live nodes size: [2])
[junit4] 2> 104425 INFO (qtp1750275755-800) [n:127.0.0.1:45251_ c:collection1 s:shard2 x:collection1_shard2_replica_n41] o.a.s.c.SolrConfig Using Lucene MatchVersion: 8.0.0
[junit4] 2> 104441 INFO (qtp1750275755-800) [n:127.0.0.1:45251_ c:collection1 s:shard2 x:collection1_shard2_replica_n41] o.a.s.s.IndexSchema [collection1_shard2_replica_n41] Schema name=test
[junit4] 2> 104570 INFO (qtp1750275755-800) [n:127.0.0.1:45251_ c:collection1 s:shard2 x:collection1_shard2_replica_n41] o.a.s.s.IndexSchema Loaded schema test/1.0 with uniqueid field id
[junit4] 2> 104618 INFO (qtp1750275755-800) [n:127.0.0.1:45251_ c:collection1 s:shard2 x:collection1_shard2_replica_n41] o.a.s.c.CoreContainer Creating SolrCore 'collection1_shard2_replica_n41' using configuration from collection collection1, trusted=true
[junit4] 2> 104619 INFO (qtp1750275755-800) [n:127.0.0.1:45251_ c:collection1 s:shard2 x:collection1_shard2_replica_n41] o.a.s.m.r.SolrJmxReporter JMX monitoring for 'solr.core.collection1.shard2.replica_n41' (registry 'solr.core.collection1.shard2.replica_n41') enabled at server: com.sun.jmx.mbeanserver.JmxMBeanServer@409bbb8
[junit4] 2> 104619 INFO (qtp1750275755-800) [n:127.0.0.1:45251_ c:collection1 s:shard2 x:collection1_shard2_replica_n41] o.a.s.c.SolrCore solr.RecoveryStrategy.Builder
[junit4] 2> 104619 INFO (qtp1750275755-800) [n:127.0.0.1:45251_ c:collection1 s:shard2 x:collection1_shard2_replica_n41] o.a.s.c.SolrCore [[collection1_shard2_replica_n41] ] Opening new SolrCore at [/home/jenkins/workspace/Lucene-Solr-BadApples-master-Linux/solr/build/solr-core/test/J1/temp/solr.cloud.SSLMigrationTest_F06E2829749A49C1-001/shard-1-001/cores/collection1_shard2_replica_n41], dataDir=[/home/jenkins/workspace/Lucene-Solr-BadApples-master-Linux/solr/build/solr-core/test/J1/temp/solr.cloud.SSLMigrationTest_F06E2829749A49C1-001/shard-1-001/cores/collection1_shard2_replica_n41/data/]
[junit4] 2> 104622 INFO (qtp1750275755-800) [n:127.0.0.1:45251_ c:collection1 s:shard2 x:collection1_shard2_replica_n41] o.a.s.u.RandomMergePolicy RandomMergePolicy wrapping class org.apache.lucene.index.LogByteSizeMergePolicy: [LogByteSizeMergePolicy: minMergeSize=1677721, mergeFactor=12, maxMergeSize=2147483648, maxMergeSizeForForcedMerge=9223372036854775807, calibrateSizeByDeletes=true, maxMergeDocs=2147483647, maxCFSSegmentSizeMB=8.796093022207999E12, noCFSRatio=0.2669734715023955]
[junit4] 2> 104635 WARN (qtp1750275755-800) [n:127.0.0.1:45251_ c:collection1 s:shard2 x:collection1_shard2_replica_n41] o.a.s.c.RequestHandlers INVALID paramSet a in requestHandler {type = requestHandler,name = /dump,class = DumpRequestHandler,attributes = {initParams=a, name=/dump, class=DumpRequestHandler},args = {defaults={a=A,b=B}}}
[junit4] 2> 104720 INFO (qtp1750275755-800) [n:127.0.0.1:45251_ c:collection1 s:shard2 x:collection1_shard2_replica_n41] o.a.s.u.UpdateHandler Using UpdateLog implementation: org.apache.solr.update.UpdateLog
[junit4] 2> 104720 INFO (qtp1750275755-800) [n:127.0.0.1:45251_ c:collection1 s:shard2 x:collection1_shard2_replica_n41] o.a.s.u.UpdateLog Initializing UpdateLog: dataDir= defaultSyncLevel=FLUSH numRecordsToKeep=100 maxNumLogsToKeep=10 numVersionBuckets=65536
[junit4] 2> 104721 INFO (qtp1750275755-800) [n:127.0.0.1:45251_ c:collection1 s:shard2 x:collection1_shard2_replica_n41] o.a.s.u.CommitTracker Hard AutoCommit: disabled
[junit4] 2> 104721 INFO (qtp1750275755-800) [n:127.0.0.1:45251_ c:collection1 s:shard2 x:collection1_shard2_replica_n41] o.a.s.u.CommitTracker Soft AutoCommit: disabled
[junit4] 2> 104722 INFO (qtp1750275755-800) [n:127.0.0.1:45251_ c:collection1 s:shard2 x:collection1_shard2_replica_n41] o.a.s.u.RandomMergePolicy RandomMergePolicy wrapping class org.apache.lucene.index.TieredMergePolicy: [TieredMergePolicy: maxMergeAtOnce=33, maxMergeAtOnceExplicit=10, maxMergedSegmentMB=64.4892578125, floorSegmentMB=1.458984375, forceMergeDeletesPctAllowed=18.212551476370834, segmentsPerTier=22.0, maxCFSSegmentSizeMB=8.796093022207999E12, noCFSRatio=0.0
[junit4] 2> 104723 INFO (qtp1750275755-800) [n:127.0.0.1:45251_ c:collection1 s:shard2 x:collection1_shard2_replica_n41] o.a.s.s.SolrIndexSearcher Opening [Searcher@f7d47d7[collection1_shard2_replica_n41] main]
[junit4] 2> 104724 INFO (qtp1750275755-800) [n:127.0.0.1:45251_ c:collection1 s:shard2 x:collection1_shard2_replica_n41] o.a.s.r.ManagedResourceStorage Configured ZooKeeperStorageIO with znodeBase: /configs/conf1
[junit4] 2> 104724 INFO (qtp1750275755-800) [n:127.0.0.1:45251_ c:collection1 s:shard2 x:collection1_shard2_replica_n41] o.a.s.r.ManagedResourceStorage Loaded null at path _rest_managed.json using ZooKeeperStorageIO:path=/configs/conf1
[junit4] 2> 104725 INFO (qtp1750275755-800) [n:127.0.0.1:45251_ c:collection1 s:shard2 x:collection1_shard2_replica_n41] o.a.s.h.ReplicationHandler Commits will be reserved for 10000ms.
[junit4] 2> 104725 INFO (searcherExecutor-410-thread-1-processing-n:127.0.0.1:45251_ x:collection1_shard2_replica_n41 c:collection1 s:shard2) [n:127.0.0.1:45251_ c:collection1 s:shard2 x:collection1_shard2_replica_n41] o.a.s.c.SolrCore [collection1_shard2_replica_n41] Registered new searcher Searcher@f7d47d7[collection1_shard2_replica_n41] main{ExitableDirectoryReader(UninvertingDirectoryReader())}
[junit4] 2> 104725 INFO (qtp1750275755-800) [n:127.0.0.1:45251_ c:collection1 s:shard2 x:collection1_shard2_replica_n41] o.a.s.u.UpdateLog Could not find max version in index or recent updates, using new clock 1596603935598051328
[junit4] 2> 104728 INFO (qtp1750275755-800) [n:127.0.0.1:45251_ c:collection1 s:shard2 x:collection1_shard2_replica_n41] o.a.s.c.ZkShardTerms Successful update of terms at /collections/collection1/terms/shard2 to Terms{values={core_node42=0}, version=0}
[junit4] 2> 104730 INFO (qtp1750275755-800) [n:127.0.0.1:45251_ c:collection1 s:shard2 x:collection1_shard2_replica_n41] o.a.s.c.ShardLeaderElectionContext Enough replicas found to continue.
[junit4] 2> 104730 INFO (qtp1750275755-800) [n:127.0.0.1:45251_ c:collection1 s:shard2 x:collection1_shard2_replica_n41] o.a.s.c.ShardLeaderElectionContext I may be the new leader - try and sync
[junit4] 2> 104730 INFO (qtp1750275755-800) [n:127.0.0.1:45251_ c:collection1 s:shard2 x:collection1_shard2_replica_n41] o.a.s.c.SyncStrategy Sync replicas to http://127.0.0.1:45251/collection1_shard2_replica_n41/
[junit4] 2> 104730 INFO (qtp1750275755-800) [n:127.0.0.1:45251_ c:collection1 s:shard2 x:collection1_shard2_replica_n41] o.a.s.c.SyncStrategy Sync Success - now sync replicas to me
[junit4] 2> 104730 INFO (qtp1750275755-800) [n:127.0.0.1:45251_ c:collection1 s:shard2 x:collection1_shard2_replica_n41] o.a.s.c.SyncStrategy http://127.0.0.1:45251/collection1_shard2_replica_n41/ has no replicas
[junit4] 2> 104730 INFO (qtp1750275755-800) [n:127.0.0.1:45251_ c:collection1 s:shard2 x:collection1_shard2_replica_n41] o.a.s.c.ShardLeaderElectionContext Found all replicas participating in election, clear LIR
[junit4] 2> 104733 INFO (qtp1750275755-800) [n:127.0.0.1:45251_ c:collection1 s:shard2 x:collection1_shard2_replica_n41] o.a.s.c.ShardLeaderElectionContext I am the new leader: http://127.0.0.1:45251/collection1_shard2_replica_n41/ shard2
[junit4] 2> 104834 INFO (zkCallback-218-thread-1) [ ] o.a.s.c.c.ZkStateReader A cluster state change: [WatchedEvent state:SyncConnected type:NodeDataChanged path:/collections/collection1/state.json] for collection [collection1] has occurred - updating... (live nodes size: [2])
[junit4] 2> 104834 INFO (qtp1750275755-800) [n:127.0.0.1:45251_ c:collection1 s:shard2 x:collection1_shard2_replica_n41] o.a.s.c.ZkController I am the leader, no recovery necessary
[junit4] 2> 104936 INFO (zkCallback-218-thread-1) [ ] o.a.s.c.c.ZkStateReader A cluster state change: [WatchedEvent state:SyncConnected type:NodeDataChanged path:/collections/collection1/state.json] for collection [collection1] has occurred - updating... (live nodes size: [2])
[junit4] 2> 104972 INFO (qtp1750275755-800) [n:127.0.0.1:45251_ c:collection1 s:shard2 x:collection1_shard2_replica_n41] o.a.s.s.HttpSolrCall [admin] webapp=null path=/admin/cores params={qt=/admin/cores&collection.configName=conf1&name=collection1_shard2_replica_n41&action=CREATE&collection=collection1&shard=shard2&wt=javabin&version=2&replicaType=NRT} status=0 QTime=1563
[junit4] 2> 104975 INFO (qtp483172188-751) [n:127.0.0.1:37269_ ] o.a.s.s.HttpSolrCall [admin] webapp=null path=/admin/collections params={node=127.0.0.1:45251_&action=ADDREPLICA&collection=collection1&shard=shard2&type=NRT&wt=javabin&version=2} status=0 QTime=1612
[junit4] 2> 105107 INFO (TEST-SSLMigrationTest.test-seed#[F06E2829749A49C1]) [ ] o.a.s.c.AbstractFullDistribZkTestBase create jetty 2 in directory /home/jenkins/workspace/Lucene-Solr-BadApples-master-Linux/solr/build/solr-core/test/J1/temp/solr.cloud.SSLMigrationTest_F06E2829749A49C1-001/shard-2-001 of type NRT
[junit4] 2> 105107 INFO (TEST-SSLMigrationTest.test-seed#[F06E2829749A49C1]) [ ] o.e.j.s.Server jetty-9.4.8.v20171121, build timestamp: ????-??-??T??:??:??Z, git hash: 82b8fb23f757335bb3329d540ce37a2a2615f0a8
[junit4] 2> 105129 INFO (TEST-SSLMigrationTest.test-seed#[F06E2829749A49C1]) [ ] o.e.j.s.session DefaultSessionIdManager workerName=node0
[junit4] 2> 105129 INFO (TEST-SSLMigrationTest.test-seed#[F06E2829749A49C1]) [ ] o.e.j.s.session No SessionScavenger set, using defaults
[junit4] 2> 105129 INFO (TEST-SSLMigrationTest.test-seed#[F06E2829749A49C1]) [ ] o.e.j.s.session Scavenging every 600000ms
[junit4] 2> 105130 INFO (TEST-SSLMigrationTest.test-seed#[F06E2829749A49C1]) [ ] o.e.j.s.h.ContextHandler Started o.e.j.s.ServletContextHandler@3ffc1192{/,null,AVAILABLE}
[junit4] 2> 105131 INFO (TEST-SSLMigrationTest.test-seed#[F06E2829749A49C1]) [ ] o.e.j.s.AbstractConnector Started ServerConnector@4c3fa232{HTTP/1.1,[http/1.1]}{127.0.0.1:44661}
[junit4] 2> 105131 INFO (TEST-SSLMigrationTest.test-seed#[F06E2829749A49C1]) [ ] o.e.j.s.Server Started @105150ms
[junit4] 2> 105131 INFO (TEST-SSLMigrationTest.test-seed#[F06E2829749A49C1]) [ ] o.a.s.c.s.e.JettySolrRunner Jetty properties: {hostContext=/, solrconfig=solrconfig.xml, solr.data.dir=/home/jenkins/workspace/Lucene-Solr-BadApples-master-Linux/solr/build/solr-core/test/J1/temp/solr.cloud.SSLMigrationTest_F06E2829749A49C1-001/tempDir-001/jetty2, hostPort=44661, coreRootDirectory=/home/jenkins/workspace/Lucene-Solr-BadApples-master-Linux/solr/build/solr-core/test/J1/temp/solr.cloud.SSLMigrationTest_F06E2829749A49C1-001/shard-2-001/cores}
[junit4] 2> 105131 ERROR (TEST-SSLMigrationTest.test-seed#[F06E2829749A49C1]) [ ] o.a.s.u.StartupLoggingUtils Missing Java Option solr.log.dir. Logging may be missing or incomplete.
[junit4] 2> 105135 INFO (TEST-SSLMigrationTest.test-seed#[F06E2829749A49C1]) [ ] o.a.s.s.SolrDispatchFilter Using logger factory org.apache.logging.slf4j.Log4jLoggerFactory
[junit4] 2> 105135 INFO (TEST-SSLMigrationTest.test-seed#[F06E2829749A49C1]) [ ] o.a.s.s.SolrDispatchFilter ___ _ Welcome to Apache Solr? version 8.0.0
[junit4] 2> 105137 INFO (TEST-SSLMigrationTest.test-seed#[F06E2829749A49C1]) [ ] o.a.s.s.SolrDispatchFilter / __| ___| |_ _ Starting in cloud mode on port null
[junit4] 2> 105137 INFO (TEST-SSLMigrationTest.test-seed#[F06E2829749A49C1]) [ ] o.a.s.s.SolrDispatchFilter \__ \/ _ \ | '_| Install dir: null
[junit4] 2> 105137 INFO (TEST-SSLMigrationTest.test-seed#[F06E2829749A49C1]) [ ] o.a.s.s.SolrDispatchFilter |___/\___/_|_| Start time: 2018-04-02T03:36:07.265164Z
[junit4] 2> 105144 INFO (zkConnectionManagerCallback-226-thread-1) [ ] o.a.s.c.c.ConnectionManager zkClient has connected
[junit4] 2> 105153 INFO (TEST-SSLMigrationTest.test-seed#[F06E2829749A49C1]) [ ] o.a.s.s.SolrDispatchFilter Loading solr.xml from SolrHome (not found in ZooKeeper)
[junit4] 2> 105153 INFO (TEST-SSLMigrationTest.test-seed#[F06E2829749A49C1]) [ ] o.a.s.c.SolrXmlConfig Loading container configuration from /home/jenkins/workspace/Lucene-Solr-BadApples-master-Linux/solr/build/solr-core/test/J1/temp/solr.cloud.SSLMigrationTest_F06E2829749A49C1-001/shard-2-001/solr.xml
[junit4] 2> 105156 INFO (TEST-SSLMigrationTest.test-seed#[F06E2829749A49C1]) [ ] o.a.s.c.SolrXmlConfig Configuration parameter autoReplicaFailoverWorkLoopDelay is ignored
[junit4] 2> 105156 INFO (TEST-SSLMigrationTest.test-seed#[F06E2829749A49C1]) [ ] o.a.s.c.SolrXmlConfig Configuration parameter autoReplicaFailoverBadNodeExpiration is ignored
[junit4] 2> 105156 INFO (TEST-SSLMigrationTest.test-seed#[F06E2829749A49C1]) [ ] o.a.s.c.SolrXmlConfig MBean server found: com.sun.jmx.mbeanserver.JmxMBeanServer@409bbb8, but no JMX reporters were configured - adding default JMX reporter.
[junit4] 2> 105217 INFO (TEST-SSLMigrationTest.test-seed#[F06E2829749A49C1]) [ ] o.a.s.c.ZkContainer Zookeeper client=127.0.0.1:34755/solr
[junit4] 2> 105245 INFO (zkConnectionManagerCallback-230-thread-1) [ ] o.a.s.c.c.ConnectionManager zkClient has connected
[junit4] 2> 105293 INFO (zkConnectionManagerCallback-232-thread-1) [ ] o.a.s.c.c.ConnectionManager zkClient has connected
[junit4] 2> 105298 INFO (TEST-SSLMigrationTest.test-seed#[F06E2829749A49C1]) [n:127.0.0.1:44661_ ] o.a.s.c.c.ZkStateReader Updated live nodes from ZooKeeper... (0) -> (2)
[junit4] 2> 105300 INFO (TEST-SSLMigrationTest.test-seed#[F06E2829749A49C1]) [n:127.0.0.1:44661_ ] o.a.s.c.Overseer Overseer (id=null) closing
[junit4] 2> 105302 INFO (TEST-SSLMigrationTest.test-seed#[F06E2829749A49C1]) [n:127.0.0.1:44661_ ] o.a.s.c.TransientSolrCoreCacheDefault Allocating transient cache for 4 transient cores
[junit4] 2> 105302 INFO (TEST-SSLMigrationTest.test-seed#[F06E2829749A49C1]) [n:127.0.0.1:44661_ ] o.a.s.c.ZkController Register node as live in ZooKeeper:/live_nodes/127.0.0.1:44661_
[junit4] 2> 105303 INFO (zkCallback-218-thread-1) [ ] o.a.s.c.c.ZkStateReader Updated live nodes from ZooKeeper... (2) -> (3)
[junit4] 2> 105303 INFO (zkCallback-210-thread-1) [ ] o.a.s.c.c.ZkStateReader Updated live nodes from ZooKeeper... (2) -> (3)
[junit4] 2> 105303 INFO (zkCallback-202-thread-1) [ ] o.a.s.c.c.ZkStateReader Updated live nodes from ZooKeeper... (2) -> (3)
[junit4] 2> 105303 INFO (zkCallback-197-thread-1) [ ] o.a.s.c.c.ZkStateReader Updated live nodes from ZooKeeper... (2) -> (3)
[junit4] 2> 105322 INFO (zkCallback-223-thread-1) [ ] o.a.s.c.c.ZkStateReader Updated live nodes from ZooKeeper... (2) -> (3)
[junit4] 2> 105335 INFO (zkCallback-231-thread-1) [ ] o.a.s.c.c.ZkStateReader Updated live nodes from ZooKeeper... (2) -> (3)
[junit4] 2> 105393 INFO (OverseerCollectionConfigSetProcessor-72067934739234820-127.0.0.1:37269_-n_0000000000) [ ] o.a.s.c.OverseerTaskQueue Response ZK path: /overseer/collection-queue-work/qnr-0000000004 doesn't exist. Requestor may have disconnected from ZooKeeper
[junit4] 2> 105409 INFO (TEST-SSLMigrationTest.test-seed#[F06E2829749A49C1]) [n:127.0.0.1:44661_ ] o.a.s.m.r.SolrJmxReporter JMX monitoring for 'solr.node' (registry 'solr.node') enabled at server: com.sun.jmx.mbeanserver.JmxMBeanServer@409bbb8
[junit4] 2> 105419 INFO (TEST-SSLMigrationTest.test-seed#[F06E2829749A49C1]) [n:127.0.0.1:44661_ ] o.a.s.m.r.SolrJmxReporter JMX monitoring for 'solr.jvm' (registry 'solr.jvm') enabled at server: com.sun.jmx.mbeanserver.JmxMBeanServer@409bbb8
[junit4] 2> 105419 INFO (TEST-SSLMigrationTest.test-seed#[F06E2829749A49C1]) [n:127.0.0.1:44661_ ] o.a.s.m.r.SolrJmxReporter JMX monitoring for 'solr.jetty' (registry 'solr.jetty') enabled at server: com.sun.jmx.mbeanserver.JmxMBeanServer@409bbb8
[junit4] 2> 105421 INFO (TEST-SSLMigrationTest.test-seed#[F06E2829749A49C1]) [n:127.0.0.1:44661_ ] o.a.s.c.CorePropertiesLocator Found 0 core definitions underneath /home/jenkins/workspace/Lucene-Solr-BadApples-master-Linux/solr/build/solr-core/test/J1/temp/solr.cloud.SSLMigrationTest_F06E2829749A49C1-001/shard-2-001/cores
[junit4] 2> 105476 INFO (zkConnectionManagerCallback-237-thread-1) [ ] o.a.s.c.c.ConnectionManager zkClient has connected
[junit4] 2> 105477 INFO (TEST-SSLMigrationTest.test-seed#[F06E2829749A49C1]) [n:127.0.0.1:44661_ ] o.a.s.c.c.ZkStateReader Updated live nodes from ZooKeeper... (0) -> (3)
[junit4] 2> 105478 INFO (TEST-SSLMigrationTest.test-seed#[F06E2829749A49C1]) [n:127.0.0.1:44661_ ] o.a.s.c.s.i.ZkClientClusterStateProvider Cluster at 127.0.0.1:34755/solr ready
[junit4] 2> 105498 INFO (qtp483172188-752) [n:127.0.0.1:37269_ ] o.a.s.h.a.CollectionsHandler Invoked Collection Action :addreplica with params node=127.0.0.1:44661_&action=ADDREPLICA&collection=collection1&shard=shard1&type=NRT&wt=javabin&version=2 and sendToOCPQueue=true
[junit4] 2> 105505 INFO (OverseerThreadFactory-396-thread-4) [ ] o.a.s.c.a.c.AddReplicaCmd Node Identified 127.0.0.1:44661_ for creating new replica
[junit4] 2> 105514 INFO (qtp107861527-835) [n:127.0.0.1:44661_ ] o.a.s.h.a.CoreAdminOperation core create command qt=/admin/cores&collection.configName=conf1&name=collection1_shard1_replica_n43&action=CREATE&collection=collection1&shard=shard1&wt=javabin&version=2&replicaType=NRT
[junit4] 2> 105617 INFO (zkCallback-218-thread-1) [ ] o.a.s.c.c.ZkStateReader A cluster state change: [WatchedEvent state:SyncConnected type:NodeDataChanged path:/collections/collection1/state.json] for collection [collection1] has occurred - updating... (live nodes size: [3])
[junit4] 2> 105618 INFO (zkCallback-231-thread-1) [ ] o.a.s.c.c.ZkStateReader A cluster state change: [WatchedEvent state:SyncConnected type:NodeDataChanged path:/collections/collection1/state.json] for collection [collection1] has occurred - updating... (live nodes size: [3])
[junit4] 2> 106765 INFO (qtp107861527-835) [n:127.0.0.1:44661_ c:collection1 s:shard1 x:collection1_shard1_replica_n43] o.a.s.c.SolrConfig Using Lucene MatchVersion: 8.0.0
[junit4] 2> 106795 INFO (qtp107861527-835) [n:127.0.0.1:44661_ c:collection1 s:shard1 x:collection1_shard1_replica_n43] o.a.s.s.IndexSchema [collection1_shard1_replica_n43] Schema name=test
[junit4] 2> 106932 INFO (qtp107861527-835) [n:127.0.0.1:44661_ c:collection1 s:shard1 x:collection1_shard1_replica_n43] o.a.s.s.IndexSchema Loaded schema test/1.0 with uniqueid field id
[junit4] 2> 106970 INFO (qtp107861527-835) [n:127.0.0.1:44661_ c:collection1 s:shard1 x:collection1_shard1_replica_n43] o.a.s.c.CoreContainer Creating SolrCore 'collection1_shard1_replica_n43' using configuration from collection collection1, trusted=true
[junit4] 2> 106970 INFO (qtp107861527-835) [n:127.0.0.1:44661_ c:collection1 s:shard1 x:collection1_shard1_replica_n43] o.a.s.m.r.SolrJmxReporter JMX monitoring for 'solr.core.collection1.shard1.replica_n43' (registry 'solr.core.collection1.shard1.replica_n43') enabled at server: com.sun.jmx.mbeanserver.JmxMBeanServer@409bbb8
[junit4] 2> 106970 INFO (qtp107861527-835) [n:127.0.0.1:44661_ c:collection1 s:shard1 x:collection1_shard1_replica_n43] o.a.s.c.SolrCore solr.RecoveryStrategy.Builder
[junit4] 2> 106970 INFO (qtp107861527-835) [n:127.0.0.1:44661_ c:collection1 s:shard1 x:collection1_shard1_replica_n43] o.a.s.c.SolrCore [[collection1_shard1_replica_n43] ] Opening new SolrCore at [/home/jenkins/workspace/Lucene-Solr-BadApples-master-Linux/solr/build/solr-core/test/J1/temp/solr.cloud.SSLMigrationTest_F06E2829749A49C1-001/shard-2-001/cores/collection1_shard1_replica_n43], dataDir=[/home/jenkins/workspace/Lucene-Solr-BadApples-master-Linux/solr/build/solr-core/test/J1/temp/solr.cloud.SSLMigrationTest_F06E2829749A49C1-001/shard-2-001/cores/collection1_shard1_replica_n43/data/]
[junit4] 2> 106974 INFO (qtp107861527-835) [n:127.0.0.1:44661_ c:collection1 s:shard1 x:collection1_shard1_replica_n43] o.a.s.u.RandomMergePolicy RandomMergePolicy wrapping class org.apache.lucene.index.LogByteSizeMergePolicy: [LogByteSizeMergePolicy: minMergeSize=1677721, mergeFactor=12, maxMergeSize=2147483648, maxMergeSizeForForcedMerge=9223372036854775807, calibrateSizeByDeletes=true, maxMergeDocs=2147483647, maxCFSSegmentSizeMB=8.796093022207999E12, noCFSRatio=0.2669734715023955]
[junit4] 2> 106991 WARN (qtp107861527-835) [n:127.0.0.1:44661_ c:collection1 s:shard1 x:collection1_shard1_replica_n43] o.a.s.c.RequestHandlers INVALID paramSet a in requestHandler {type = requestHandler,name = /dump,class = DumpRequestHandler,attributes = {initParams=a, name=/dump, class=DumpRequestHandler},args = {defaults={a=A,b=B}}}
[junit4] 2> 107053 INFO (qtp107861527-835) [n:127.0.0.1:44661_ c:collection1 s:shard1 x:collection1_shard1_replica_n43] o.a.s.u.UpdateHandler Using UpdateLog implementation: org.apache.solr.update.UpdateLog
[junit4] 2> 107053 INFO (qtp107861527-835) [n:127.0.0.1:44661_ c:collection1 s:shard1 x:collection1_shard1_replica_n43] o.a.s.u.UpdateLog Initializing UpdateLog: dataDir= defaultSyncLevel=FLUSH numRecordsToKeep=100 maxNumLogsToKeep=10 numVersionBuckets=65536
[junit4] 2> 107090 INFO (qtp107861527-835) [n:127.0.0.1:44661_ c:collection1 s:shard1 x:collection1_shard1_replica_n43] o.a.s.u.CommitTracker Hard AutoCommit: disabled
[junit4] 2> 107090 INFO (qtp107861527-835) [n:127.0.0.1:44661_ c:collection1 s:shard1 x:collection1_shard1_replica_n43] o.a.s.u.CommitTracker Soft AutoCommit: disabled
[junit4] 2> 107091 INFO (qtp107861527-835) [n:127.0.0.1:44661_ c:collection1 s:shard1 x:collection1_shard1_replica_n43] o.a.s.u.RandomMergePolicy RandomMergePolicy wrapping class org.apache.lucene.index.TieredMergePolicy: [TieredMergePolicy: maxMergeAtOnce=33, maxMergeAtOnceExplicit=10, maxMergedSegmentMB=64.4892578125, floorSegmentMB=1.458984375, forceMergeDeletesPctAllowed=18.212551476370834, segmentsPerTier=22.0, maxCFSSegmentSizeMB=8.796093022207999E12, noCFSRatio=0.0
[junit4] 2> 107092 INFO (qtp107861527-835) [n:127.0.0.1:44661_ c:collection1 s:shard1 x:collection1_shard1_replica_n43] o.a.s.s.SolrIndexSearcher Opening [Searcher@2ff50ac0[collection1_shard1_replica_n43] main]
[junit4] 2> 107093 INFO (qtp107861527-835) [n:127.0.0.1:44661_ c:collection1 s:shard1 x:collection1_shard1_replica_n43] o.a.s.r.ManagedResourceStorage Configured ZooKeeperStorageIO with znodeBase: /configs/conf1
[junit4] 2> 107093 INFO (qtp107861527-835) [n:127.0.0.1:44661_ c:collection1 s:shard1 x:collection1_shard1_replica_n43] o.a.s.r.ManagedResourceStorage Loaded null at path _rest_managed.json using ZooKeeperStorageIO:path=/configs/conf1
[junit4] 2> 107094 INFO (qtp107861527-835) [n:127.0.0.1:44661_ c:collection1 s:shard1 x:collection1_shard1_replica_n43] o.a.s.h.ReplicationHandler Commits will be reserved for 10000ms.
[junit4] 2> 107094 INFO (qtp107861527-835) [n:127.0.0.1:44661_ c:collection1 s:shard1 x:collection1_shard1_replica_n43] o.a.s.u.UpdateLog Could not find max version in index or recent updates, using new clock 1596603938082127872
[junit4] 2> 107096 INFO (searcherExecutor-421-thread-1-processing-n:127.0.0.1:44661_ x:collection1_shard1_replica_n43 c:collection1 s:shard1) [n:127.0.0.1:44661_ c:collection1 s:shard1 x:collection1_shard1_replica_n43] o.a.s.c.SolrCore [collection1_shard1_replica_n43] Registered new searcher Searcher@2ff50ac0[collection1_shard1_replica_n43] main{ExitableDirectoryReader(UninvertingDirectoryReader())}
[junit4] 2> 107098 INFO (qtp107861527-835) [n:127.0.0.1:44661_ c:collection1 s:shard1 x:collection1_shard1_replica_n43] o.a.s.c.ZkShardTerms Successful update of terms at /collections/collection1/terms/shard1 to Terms{values={core_node44=0}, version=0}
[junit4] 2> 107100 INFO (qtp107861527-835) [n:127.0.0.1:44661_ c:collection1 s:shard1 x:collection1_shard1_replica_n43] o.a.s.c.ShardLeaderElectionContext Enough replicas found to continue.
[junit4] 2> 107100 INFO (qtp107861527-835) [n:127.0.0.1:44661_ c:collection1 s:shard1 x:collection1_shard1_replica_n43] o.a.s.c.ShardLeaderElectionContext I may be the new leader - try and sync
[junit4] 2> 107100 INFO (qtp107861527-835) [n:127.0.0.1:44661_ c:collection1 s:shard1 x:collection1_shard1_replica_n43] o.a.s.c.SyncStrategy Sync replicas to http://127.0.0.1:44661/collection1_shard1_replica_n43/
[junit4] 2> 107100 INFO (qtp107861527-835) [n:127.0.0.1:44661_ c:collection1 s:shard1 x:collection1_shard1_replica_n43] o.a.s.c.SyncStrategy Sync Success - now sync replicas to me
[junit4] 2> 107100 INFO (qtp107861527-835) [n:127.0.0.1:44661_ c:collection1 s:shard1 x:collection1_shard1_replica_n43] o.a.s.c.SyncStrategy http://127.0.0.1:44661/collection1_shard1_replica_n43/ has no replicas
[junit4] 2> 107100 INFO (qtp107861527-835) [n:127.0.0.1:44661_ c:collection1 s:shard1 x:collection1_shard1_replica_n43] o.a.s.c.ShardLeaderElectionContext Found all replicas participating in election, clear LIR
[junit4] 2> 107102 INFO (qtp107861527-835) [n:127.0.0.1:44661_ c:collection1 s:shard1 x:collection1_shard1_replica_n43] o.a.s.c.ShardLeaderElectionContext I am the new leader: http://127.0.0.1:44661/collection1_shard1_replica_n43/ shard1
[junit4] 2> 107209 INFO (zkCallback-231-thread-1) [ ] o.a.s.c.c.ZkStateReader A cluster state change: [WatchedEvent state:SyncConnected type:NodeDataChanged path:/collections/collection1/state.json] for collection [collection1] has occurred - updating... (live nodes size: [3])
[junit4] 2> 107209 INFO (zkCallback-218-thread-1) [ ] o.a.s.c.c.ZkStateReader A cluster state change: [WatchedEvent state:SyncConnected type:NodeDataChanged path:/collections/collection1/state.json] for collection [collection1] has occurred - updating... (live nodes size: [3])
[junit4] 2> 107253 INFO (qtp107861527-835) [n:127.0.0.1:44661_ c:collection1 s:shard1 x:collection1_shard1_replica_n43] o.a.s.c.ZkController I am the leader, no recovery necessary
[junit4] 2> 107308 INFO (qtp107861527-835) [n:127.0.0.1:44661_ c:collection1 s:shard1 x:collection1_shard1_replica_n43] o.a.s.s.HttpSolrCall [admin] webapp=null path=/admin/cores params={qt=/admin/cores&collection.configName=conf1&name=collection1_shard1_replica_n43&action=CREATE&collection=collection1&shard=shard1&wt=javabin&version=2&replicaType=NRT} status=0 QTime=1794
[junit4] 2> 107311 INFO (qtp483172188-752) [n:127.0.0.1:37269_ ] o.a.s.s.HttpSolrCall [admin] webapp=null path=/admin/collections params={node=127.0.0.1:44661_&action=ADDREPLICA&collection=collection1&shard=shard1&type=NRT&wt=javabin&version=2} status=0 QTime=1812
[junit4] 2> 107357 INFO (zkCallback-231-thread-1) [ ] o.a.s.c.c.ZkStateReader A cluster state change: [WatchedEvent state:SyncConnected type:NodeDataChanged path:/collections/collection1/state.json] for collection [collection1] has occurred - updating... (live nodes size: [3])
[junit4] 2> 107357 INFO (zkCallback-218-thread-1) [ ] o.a.s.c.c.ZkStateReader A cluster state change: [WatchedEvent state:SyncConnected type:NodeDataChanged path:/collections/collection1/state.json] for collection [collection1] has occurred - updating... (live nodes size: [3])
[junit4] 2> 107405 INFO (TEST-SSLMigrationTest.test-seed#[F06E2829749A49C1]) [ ] o.a.s.c.AbstractFullDistribZkTestBase create jetty 3 in directory /home/jenkins/workspace/Lucene-Solr-BadApples-master-Linux/solr/build/solr-core/test/J1/temp/solr.cloud.SSLMigrationTest_F06E2829749A49C1-001/shard-3-001 of type NRT
[junit4] 2> 107405 INFO (TEST-SSLMigrationTest.test-seed#[F06E2829749A49C1]) [ ] o.e.j.s.Server jetty-9.4.8.v20171121, build timestamp: ????-??-??T??:??:??Z, git hash: 82b8fb23f757335bb3329d540ce37a2a2615f0a8
[junit4] 2> 107453 INFO (TEST-SSLMigrationTest.test-seed#[F06E2829749A49C1]) [ ] o.e.j.s.session DefaultSessionIdManager workerName=node0
[junit4] 2> 107453 INFO (TEST-SSLMigrationTest.test-seed#[F06E2829749A49C1]) [ ] o.e.j.s.session No SessionScavenger set, using defaults
[junit4] 2> 107453 INFO (TEST-SSLMigrationTest.test-seed#[F06E2829749A49C1]) [ ] o.e.j.s.session Scavenging every 600000ms
[junit4] 2> 107458 INFO (TEST-SSLMigrationTest.test-seed#[F06E2829749A49C1]) [ ] o.e.j.s.h.ContextHandler Started o.e.j.s.ServletContextHandler@c16cf62{/,null,AVAILABLE}
[junit4] 2> 107458 INFO (TEST-SSLMigrationTest.test-seed#[F06E2829749A49C1]) [ ] o.e.j.s.AbstractConnector Started ServerConnector@631bc7f8{HTTP/1.1,[http/1.1]}{127.0.0.1:46043}
[junit4] 2> 107458 INFO (TEST-SSLMigrationTest.test-seed#[F06E2829749A49C1]) [ ] o.e.j.s.Server Started @107478ms
[junit4] 2> 107458 INFO (TEST-SSLMigrationTest.test-seed#[F06E2829749A49C1]) [ ] o.a.s.c.s.e.JettySolrRunner Jetty properties: {hostContext=/, solrconfig=solrconfig.xml, solr.data.dir=/home/jenkins/workspace/Lucene-Solr-BadApples-master-Linux/solr/build/solr-core/test/J1/temp/solr.cloud.SSLMigrationTest_F06E2829749A49C1-001/tempDir-001/jetty3, hostPort=46043, coreRootDirectory=/home/jenkins/workspace/Lucene-Solr-BadApples-master-Linux/solr/build/solr-core/test/J1/temp/solr.cloud.SSLMigrationTest_F06E2829749A49C1-001/shard-3-001/cores, replicaType=NRT}
[junit4] 2> 107459 ERROR (TEST-SSLMigrationTest.test-seed#[F06E2829749A49C1]) [ ] o.a.s.u.StartupLoggingUtils Missing Java Option solr.log.dir. Logging may be missing or incomplete.
[junit4] 2> 107459 INFO (TEST-SSLMigrationTest.test-seed#[F06E2829749A49C1]) [ ] o.a.s.s.SolrDispatchFilter Using logger factory org.apache.logging.slf4j.Log4jLoggerFactory
[junit4] 2> 107459 INFO (TEST-SSLMigrationTest.test-seed#[F06E2829749A49C1]) [ ] o.a.s.s.SolrDispatchFilter ___ _ Welcome to Apache Solr? version 8.0.0
[junit4] 2> 107459 INFO (TEST-SSLMigrationTest.test-seed#[F06E2829749A49C1]) [ ] o.a.s.s.SolrDispatchFilter / __| ___| |_ _ Starting in cloud mode on port null
[junit4] 2> 107459 INFO (TEST-SSLMigrationTest.test-seed#[F06E2829749A49C1]) [ ] o.a.s.s.SolrDispatchFilter \__ \/ _ \ | '_| Install dir: null
[junit4] 2> 107459 INFO (TEST-SSLMigrationTest.test-seed#[F06E2829749A49C1]) [ ] o.a.s.s.SolrDispatchFilter |___/\___/_|_| Start time: 2018-04-02T03:36:09.587744Z
[junit4] 2> 107477 INFO (zkConnectionManagerCallback-239-thread-1) [ ] o.a.s.c.c.ConnectionManager zkClient has connected
[junit4] 2> 107479 INFO (TEST-SSLMigrationTest.test-seed#[F06E2829749A49C1]) [ ] o.a.s.s.SolrDispatchFilter Loading solr.xml from SolrHome (not found in ZooKeeper)
[junit4] 2> 107479 INFO (TEST-SSLMigrationTest.test-seed#[F06E2829749A49C1]) [ ] o.a.s.c.SolrXmlConfig Loading container configuration from /home/jenkins/workspace/Lucene-Solr-BadApples-master-Linux/solr/build/solr-core/test/J1/temp/solr.cloud.SSLMigrationTest_F06E2829749A49C1-001/shard-3-001/solr.xml
[junit4] 2> 107483 INFO (TEST-SSLMigrationTest.test-seed#[F06E2829749A49C1]) [ ] o.a.s.c.SolrXmlConfig Configuration parameter autoReplicaFailoverWorkLoopDelay is ignored
[junit4] 2> 107483 INFO (TEST-SSLMigrationTest.test-seed#[F06E2829749A49C1]) [ ] o.a.s.c.SolrXmlConfig Configuration parameter autoReplicaFailoverBadNodeExpiration is ignored
[junit4] 2> 107483 INFO (TEST-SSLMigrationTest.test-seed#[F06E2829749A49C1]) [ ] o.a.s.c.SolrXmlConfig MBean server found: com.sun.jmx.mbeanserver.JmxMBeanServer@409bbb8, but no JMX reporters were configured - adding default JMX reporter.
[junit4] 2> 107487 INFO (TEST-SSLMigrationTest.test-seed#[F06E2829749A49C1]) [ ] o.a.s.c.ZkContainer Zookeeper client=127.0.0.1:34755/solr
[junit4] 2> 107494 INFO (zkConnectionManagerCallback-243-thread-1) [ ] o.a.s.c.c.ConnectionManager zkClient has connected
[junit4] 2> 107498 INFO (zkConnectionManagerCallback-245-thread-1) [ ] o.a.s.c.c.ConnectionManager zkClient has connected
[junit4] 2> 107521 INFO (OverseerCollectionConfigSetProcessor-72067934739234820-127.0.0.1:37269_-n_0000000000) [ ] o.a.s.c.OverseerTaskQueue Response ZK path: /overseer/collection-queue-work/qnr-0000000006 doesn't exist. Requestor may have disconnected from ZooKeeper
[junit4] 2> 107543 INFO (TEST-SSLMigrationTest.test-seed#[F06E2829749A49C1]) [n:127.0.0.1:46043_ ] o.a.s.c.c.ZkStateReader Updated live nodes from ZooKeeper... (0) -> (3)
[junit4] 2> 107553 INFO (TEST-SSLMigrationTest.test-seed#[F06E2829749A49C1]) [n:127.0.0.1:46043_ ] o.a.s.c.Overseer Overseer (id=null) closing
[junit4] 2> 107555 INFO (TEST-SSLMigrationTest.test-seed#[F06E2829749A49C1]) [n:127.0.0.1:46043_ ] o.a.s.c.TransientSolrCoreCacheDefault Allocating transient cache for 4 transient cores
[junit4] 2> 107555 INFO (TEST-SSLMigrationTest.test-seed#[F06E2829749A49C1]) [n:127.0.0.1:46043_ ] o.a.s.c.ZkController Register node as live in ZooKeeper:/live_nodes/127.0.0.1:46043_
[junit4] 2> 107556 INFO (zkCallback-218-thread-1) [ ] o.a.s.c.c.ZkStateReader Updated live nodes from ZooKeeper... (3) -> (4)
[junit4] 2> 107556 INFO (zkCallback-210-thread-1) [ ] o.a.s.c.c.ZkStateReader Updated live nodes from ZooKeeper... (3) -> (4)
[junit4] 2> 107557 INFO (zkCallback-231-thread-1) [ ] o.a.s.c.c.ZkStateReader Updated live nodes from ZooKeeper... (3) -> (4)
[junit4] 2> 107557 INFO (zkCallback-223-thread-1) [ ] o.a.s.c.c.ZkStateReader Updated live nodes from ZooKeeper... (3) -> (4)
[junit4] 2> 107557 INFO (zkCallback-202-thread-1) [ ] o.a.s.c.c.ZkStateReader Updated live nodes from ZooKeeper... (3) -> (4)
[junit4] 2> 107558 INFO (zkCallback-197-thread-1) [ ] o.a.s.c.c.ZkStateReader Updated live nodes from ZooKeeper... (3) -> (4)
[junit4] 2> 107577 INFO (zkCallback-236-thread-1) [ ] o.a.s.c.c.ZkStateReader Updated live nodes from ZooKeeper... (3) -> (4)
[junit4] 2> 107580 INFO (zkCallback-244-thread-1) [ ] o.a.s.c.c.ZkStateReader Updated live nodes from ZooKeeper... (3) -> (4)
[junit4] 2> 107663 INFO (TEST-SSLMigrationTest.test-seed#[F06E2829749A49C1]) [n:127.0.0.1:46043_ ] o.a.s.m.r.SolrJmxReporter JMX monitoring for 'solr.node' (registry 'solr.node') enabled at server: com.sun.jmx.mbeanserver.JmxMBeanServer@409bbb8
[junit4] 2> 107672 INFO (TEST-SSLMigrationTest.test-seed#[F06E2829749A49C1]) [n:127.0.0.1:46043_ ] o.a.s.m.r.SolrJmxReporter JMX monitoring for 'solr.jvm' (registry 'solr.jvm') enabled at server: com.sun.jmx.mbeanserver.JmxMBeanServer@409bbb8
[junit4] 2> 107672 INFO (TEST-SSLMigrationTest.test-seed#[F06E2829749A49C1]) [n:127.0.0.1:46043_ ] o.a.s.m.r.SolrJmxReporter JMX monitoring for 'solr.jetty' (registry 'solr.jetty') enabled at server: com.sun.jmx.mbeanserver.JmxMBeanServer@409bbb8
[junit4] 2> 107674 INFO (TEST-SSLMigrationTest.test-seed#[F06E2829749A49C1]) [n:127.0.0.1:46043_ ] o.a.s.c.CorePropertiesLocator Found 0 core definitions underneath /home/jenkins/workspace/Lucene-Solr-BadApples-master-Linux/solr/build/solr-core/test/J1/temp/solr.cloud.SSLMigrationTest_F06E2829749A49C1-001/shard-3-001/cores
[junit4] 2> 107712 INFO (zkConnectionManagerCallback-250-thread-1) [ ] o.a.s.c.c.ConnectionManager zkClient has connected
[junit4] 2> 107714 INFO (TEST-SSLMigrationTest.test-seed#[F06E2829749A49C1]) [n:127.0.0.1:46043_ ] o.a.s.c.c.ZkStateReader Updated live nodes from ZooKeeper... (0) -> (4)
[junit4] 2> 107715 INFO (TEST-SSLMigrationTest.test-seed#[F06E2829749A49C1]) [n:127.0.0.1:46043_ ] o.a.s.c.s.i.ZkClientClusterStateProvider Cluster at 127.0.0.1:34755/solr ready
[junit4] 2> 107749 INFO (qtp483172188-751) [n:127.0.0.1:37269_ ] o.a.s.h.a.CollectionsHandler Invoked Collection Action :addreplica with params node=127.0.0.1:46043_&action=ADDREPLICA&collection=collection1&shard=shard2&type=NRT&wt=javabin&version=2 and sendToOCPQueue=true
[junit4] 2> 107757 INFO (OverseerThreadFactory-396-thread-5) [ ] o.a.s.c.a.c.AddReplicaCmd Node Identified 127.0.0.1:46043_ for creating new replica
[junit4] 2> 107760 INFO (qtp529632159-870) [n:127.0.0.1:46043_ ] o.a.s.h.a.CoreAdminOperation core create command qt=/admin/cores&collection.configName=conf1&name=collection1_shard2_replica_n45&action=CREATE&collection=collection1&shard=shard2&wt=javabin&version=2&replicaType=NRT
[junit4] 2> 107865 INFO (zkCallback-231-thread-1) [ ] o.a.s.c.c.ZkStateReader A cluster state change: [WatchedEvent state:SyncConnected type:NodeDataChanged path:/collections/collection1/state.json] for collection [collection1] has occurred - updating... (live nodes size: [4])
[junit4] 2> 107865 INFO (zkCallback-218-thread-1) [ ] o.a.s.c.c.ZkStateReader A cluster state change: [WatchedEvent state:SyncConnected type:NodeDataChanged path:/collections/collection1/state.json] for collection [collection1] has occurred - updating... (live nodes size: [4])
[junit4] 2> 107865 INFO (zkCallback-244-thread-1) [ ] o.a.s.c.c.ZkStateReader A cluster state change: [WatchedEvent state:SyncConnected type:NodeDataChanged path:/collections/collection1/state.json] for collection [collection1] has occurred - updating... (live nodes size: [4])
[junit4] 2> 108812 INFO (qtp529632159-870) [n:127.0.0.1:46043_ c:collection1 s:shard2 x:collection1_shard2_replica_n45] o.a.s.c.SolrConfig Using Lucene MatchVersion: 8.0.0
[junit4] 2> 108836 INFO (qtp529632159-870) [n:127.0.0.1:46043_ c:collection1 s:shard2 x:collection1_shard2_replica_n45] o.a.s.s.IndexSchema [collection1_shard2_replica_n45] Schema name=test
[junit4] 2> 108903 INFO (qtp529632159-870) [n:127.0.0.1:46043_ c:collection1 s:shard2 x:collection1_shard2_replica_n45] o.a.s.s.IndexSchema Loaded schema test/1.0 with uniqueid field id
[junit4] 2> 108917 INFO (qtp529632159-870) [n:127.0.0.1:46043_ c:collection1 s:shard2 x:collection1_shard2_replica_n45] o.a.s.c.CoreContainer Creating SolrCore 'collection1_shard2_replica_n45' using configuration from collection collection1, trusted=true
[junit4] 2> 108917 INFO (qtp529632159-870) [n:127.0.0.1:46043_ c:collection1 s:shard2 x:collection1_shard2_replica_n45] o.a.s.m.r.SolrJmxReporter JMX monitoring for 'solr.core.collection1.shard2.replica_n45' (registry 'solr.core.collection1.shard2.replica_n45') enabled at server: com.sun.jmx.mbeanserver.JmxMBeanServer@409bbb8
[junit4] 2> 108918 INFO (qtp529632159-870) [n:127.0.0.1:46043_ c:collection1 s:shard2 x:collection1_shard2_replica_n45] o.a.s.c.SolrCore solr.RecoveryStrategy.Builder
[junit4] 2> 108918 INFO (qtp529632159-870) [n:127.0.0.1:46043_ c:collection1 s:shard2 x:collection1_shard2_replica_n45] o.a.s.c.SolrCore [[collection1_shard2_replica_n45] ] Opening new SolrCore at [/home/jenkins/workspace/Lucene-Solr-BadApples-master-Linux/solr/build/solr-core/test/J1/temp/solr.cloud.SSLMigrationTest_F06E2829749A49C1-001/shard-3-001/cores/collection1_shard2_replica_n45], dataDir=[/home/jenkins/workspace/Lucene-Solr-BadApples-master-Linux/solr/build/solr-core/test/J1/temp/solr.cloud.SSLMigrationTest_F06E2829749A49C1-001/shard-3-001/cores/collection1_shard2_replica_n45/data/]
[junit4] 2> 108922 INFO (qtp529632159-870) [n:127.0.0.1:46043_ c:collection1 s:shard2 x:collection1_shard2_replica_n45] o.a.s.u.RandomMergePolicy RandomMergePolicy wrapping class org.apache.lucene.index.LogByteSizeMergePolicy: [LogByteSizeMergePolicy: minMergeSize=1677721, mergeFactor=12, maxMergeSize=2147483648, maxMergeSizeForForcedMerge=9223372036854775807, calibrateSizeByDeletes=true, maxMergeDocs=2147483647, maxCFSSegmentSizeMB=8.796093022207999E12, noCFSRatio=0.2669734715023955]
[junit4] 2> 108927 WARN (qtp529632159-870) [n:127.0.0.1:46043_ c:collection1 s:shard2 x:collection1_shard2_replica_n45] o.a.s.c.RequestHandlers INVALID paramSet a in requestHandler {type = requestHandler,name = /dump,class = DumpRequestHandler,attributes = {initParams=a, name=/dump, class=DumpRequestHandler},args = {defaults={a=A,b=B}}}
[junit4] 2> 108968 INFO (qtp529632159-870) [n:127.0.0.1:46043_ c:collection1 s:shard2 x:collection1_shard2_replica_n45] o.a.s.u.UpdateHandler Using UpdateLog implementation: org.apache.solr.update.UpdateLog
[junit4] 2> 108968 INFO (qtp529632159-870) [n:127.0.0.1:46043_ c:collection1 s:shard2 x:collection1_shard2_replica_n45] o.a.s.u.UpdateLog Initializing UpdateLog: dataDir= defaultSyncLevel=FLUSH numRecordsToKeep=100 maxNumLogsToKeep=10 numVersionBuckets=65536
[junit4] 2> 108969 INFO (qtp529632159-870) [n:127.0.0.1:46043_ c:collection1 s:shard2 x:collection1_shard2_replica_n45] o.a.s.u.CommitTracker Hard AutoCommit: disabled
[junit4] 2> 108969 INFO (qtp529632159-870) [n:127.0.0.1:46043_ c:collection1 s:shard2 x:collection1_shard2_replica_n45] o.a.s.u.CommitTracker Soft AutoCommit: disabled
[junit4] 2> 108970 INFO (qtp529632159-870) [n:127.0.0.1:46043_ c:collection1 s:shard2 x:collection1_shard2_replica_n45] o.a.s.u.RandomMergePolicy RandomMergePolicy wrapping class org.apache.lucene.index.TieredMergePolicy: [TieredMergePolicy: maxMergeAtOnce=33, maxMergeAtOnceExplicit=10, maxMergedSegmentMB=64.4892578125, floorSegmentMB=1.458984375, forceMergeDeletesPctAllowed=18.212551476370834, segmentsPerTier=22.0, maxCFSSegmentSizeMB=8.796093022207999E12, noCFSRatio=0.0
[junit4] 2> 108971 INFO (qtp529632159-870) [n:127.0.0.1:46043_ c:collection1 s:shard2 x:collection1_shard2_replica_n45] o.a.s.s.SolrIndexSearcher Opening [Searcher@252fb83f[collection1_shard2_replica_n45] main]
[junit4] 2> 108972 INFO (qtp529632159-870) [n:127.0.0.1:46043_ c:collection1 s:shard2 x:collection1_shard2_replica_n45] o.a.s.r.ManagedResourceStorage Configured ZooKeeperStorageIO with znodeBase: /configs/conf1
[junit4] 2> 108972 INFO (qtp529632159-870) [n:127.0.0.1:46043_ c:collection1 s:shard2 x:collection1_shard2_replica_n45] o.a.s.r.ManagedResourceStorage Loaded null at path _rest_managed.json using ZooKeeperStorageIO:path=/configs/conf1
[junit4] 2> 108973 INFO (qtp529632159-870) [n:127.0.0.1:46043_ c:collection1 s:shard2 x:collection1_shard2_replica_n45] o.a.s.h.ReplicationHandler Commits will be reserved for 10000ms.
[junit4] 2> 108973 INFO (qtp529632159-870) [n:127.0.0.1:46043_ c:collection1 s:shard2 x:collection1_shard2_replica_n45] o.a.s.u.UpdateLog Could not find max version in index or recent updates, using new clock 1596603940052402176
[junit4] 2> 108974 INFO (searcherExecutor-432-thread-1-processing-n:127.0.0.1:46043_ x:collection1_shard2_replica_n45 c:collection1 s:shard2) [n:127.0.0.1:46043_ c:collection1 s:shard2 x:collection1_shard2_replica_n45] o.a.s.c.SolrCore [collection1_shard2_replica_n45] Registered new searcher Searcher@252fb83f[collection1_shard2_replica_n45] main{ExitableDirectoryReader(UninvertingDirectoryReader())}
[junit4] 2> 108975 INFO (qtp529632159-870) [n:127.0.0.1:46043_ c:collection1 s:shard2 x:collection1_shard2_replica_n45] o.a.s.c.ZkShardTerms Successful update of terms at /collections/collection1/terms/shard2 to Terms{values={core_node42=0, core_node46=0}, version=1}
[junit4] 2> 108976 INFO (qtp529632159-870) [n:127.0.0.1:46043_ c:collection1 s:shard2 x:collection1_shard2_replica_n45] o.a.s.c.ZkController Core needs to recover:collection1_shard2_replica_n45
[junit4] 2> 108976 INFO (updateExecutor-240-thread-1-processing-n:127.0.0.1:46043_ x:collection1_shard2_replica_n45 c:collection1 s:shard2) [n:127.0.0.1:46043_ c:collection1 s:shard2 r:core_node46 x:collection1_shard2_replica_n45] o.a.s.u.DefaultSolrCoreState Running recovery
[junit4] 2> 108977 INFO (qtp529632159-870) [n:127.0.0.1:46043_ c:collection1 s:shard2 x:collection1_shard2_replica_n45] o.a.s.s.HttpSolrCall [admin] webapp=null path=/admin/cores params={qt=/admin/cores&collection.configName=conf1&name=collection1_shard2_replica_n45&action=CREATE&collection=collection1&shard=shard2&wt=javabin&version=2&replicaType=NRT} status=0 QTime=1216
[junit4] 2> 108977 INFO (recoveryExecutor-241-thread-1-processing-n:127.0.0.1:46043_ x:collection1_shard2_replica_n45 c:collection1 s:shard2 r:core_node46) [n:127.0.0.1:46043_ c:collection1 s:shard2 r:core_node46 x:collection1_shard2_replica_n45] o.a.s.c.RecoveryStrategy Starting recovery process. recoveringAfterStartup=true
[junit4] 2> 108977 INFO (recoveryExecutor-241-thread-1-processing-n:127.0.0.1:46043_ x:collection1_shard2_replica_n45 c:collection1 s:shard2 r:core_node46) [n:127.0.0.1:46043_ c:collection1 s:shard2 r:core_node46 x:collection1_shard2_replica_n45] o.a.s.c.RecoveryStrategy ###### startupVersions=[[]]
[junit4] 2> 108983 INFO (qtp1750275755-806) [n:127.0.0.1:45251_ c:collection1 s:shard2 r:core_node42 x:collection1_shard2_replica_n41] o.a.s.c.S.Request [collection1_shard2_replica_n41] webapp= path=/admin/ping params={wt=javabin&version=2} hits=0 status=0 QTime=0
[junit4] 2> 108983 INFO (qtp1750275755-806) [n:127.0.0.1:45251_ c:collection1 s:shard2 r:core_node42 x:collection1_shard2_replica_n41] o.a.s.c.S.Request [collection1_shard2_replica_n41] webapp= path=/admin/ping params={wt=javabin&version=2} status=0 QTime=0
[junit4] 2> 108984 INFO (recoveryExecutor-241-thread-1-processing-n:127.0.0.1:46043_ x:collection1_shard2_replica_n45 c:collection1 s:shard2 r:core_node46) [n:127.0.0.1:46043_ c:collection1 s:shard2 r:core_node46 x:collection1_shard2_replica_n45] o.a.s.c.RecoveryStrategy Begin buffering updates. core=[collection1_shard2_replica_n45]
[junit4] 2> 108984 INFO (recoveryExecutor-241-thread-1-processing-n:127.0.0.1:46043_ x:collection1_shard2_replica_n45 c:collection1 s:shard2 r:core_node46) [n:127.0.0.1:46043_ c:collection1 s:shard2 r:core_node46 x:collection1_shard2_replica_n45] o.a.s.u.UpdateLog Starting to buffer updates. FSUpdateLog{state=ACTIVE, tlog=null}
[junit4] 2> 108984 INFO (recoveryExecutor-241-thread-1-processing-n:127.0.0.1:46043_ x:collection1_shard2_replica_n45 c:collection1 s:shard2 r:core_node46) [n:127.0.0.1:46043_ c:collection1 s:shard2 r:core_node46 x:collection1_shard2_replica_n45] o.a.s.c.RecoveryStrategy Publishing state of core [collection1_shard2_replica_n45] as recovering, leader is [http://127.0.0.1:45251/collection1_shard2_replica_n41/] and I am [http://127.0.0.1:46043/collection1_shard2_replica_n45/]
[junit4] 2> 108986 INFO (recoveryExecutor-241-thread-1-processing-n:127.0.0.1:46043_ x:collection1_shard2_replica_n45 c:collection1 s:shard2 r:core_node46) [n:127.0.0.1:46043_ c:collection1 s:shard2 r:core_node46 x:collection1_shard2_replica_n45] o.a.s.c.ZkShardTerms Successful update of terms at /collections/collection1/terms/shard2 to Terms{values={core_node42=0, core_node46=0, core_node46_recovering=0}, version=2}
[junit4] 2> 108989 INFO (qtp483172188-751) [n:127.0.0.1:37269_ ] o.a.s.s.HttpSolrCall [admin] webapp=null path=/admin/collections params={node=127.0.0.1:46043_&action=ADDREPLICA&collection=collection1&shard=shard2&type=NRT&wt=javabin&version=2} status=0 QTime=1239
[junit4] 2> 109001 INFO (recoveryExecutor-241-thread-1-processing-n:127.0.0.1:46043_ x:collection1_shard2_replica_n45 c:collection1 s:shard2 r:core_node46) [n:127.0.0.1:46043_ c:collection1 s:shard2 r:core_node46 x:collection1_shard2_replica_n45] o.a.s.c.RecoveryStrategy Sending prep recovery command to [http://127.0.0.1:45251]; [WaitForState: action=PREPRECOVERY&core=collection1_shard2_replica_n41&nodeName=127.0.0.1:46043_&coreNodeName=core_node46&state=recovering&checkLive=true&onlyIfLeader=true&onlyIfLeaderActive=true]
[junit4] 2> 109003 INFO (qtp1750275755-806) [n:127.0.0.1:45251_ ] o.a.s.h.a.PrepRecoveryOp Going to wait for coreNodeName: core_node46, state: recovering, checkLive: true, onlyIfLeader: true, onlyIfLeaderActive: true, maxTime: 183 s
[junit4] 2> 109004 INFO (qtp1750275755-806) [n:127.0.0.1:45251_ ] o.a.s.h.a.PrepRecoveryOp In WaitForState(recovering): collection=collection1, shard=shard2, thisCore=collection1_shard2_replica_n41, leaderDoesNotNeedRecovery=false, isLeader? true, live=true, checkLive=true, currentState=down, localState=active, nodeName=127.0.0.1:46043_, coreNodeName=core_node46, onlyIfActiveCheckResult=false, nodeProps: core_node46:{"core":"collection1_shard2_replica_n45","base_url":"http://127.0.0.1:46043","node_name":"127.0.0.1:46043_","state":"down","type":"NRT"}
[junit4] 2> 109085 INFO (TEST-SSLMigrationTest.test-seed#[F06E2829749A49C1]) [ ] o.a.s.c.AbstractFullDistribZkTestBase create jetty 4 in directory /home/jenkins/workspace/Lucene-Solr-BadApples-master-Linux/solr/build/solr-core/test/J1/temp/solr.cloud.SSLMigrationTest_F06E2829749A49C1-001/shard-4-001 of type NRT
[junit4] 2> 109085 INFO (TEST-SSLMigrationTest.test-seed#[F06E2829749A49C1]) [ ] o.e.j.s.Server jetty-9.4.8.v20171121, build timestamp: ????-??-??T??:??:??Z, git hash: 82b8fb23f757335bb3329d540ce37a2a2615f0a8
[junit4] 2> 109086 INFO (TEST-SSLMigrationTest.test-seed#[F06E2829749A49C1]) [ ] o.e.j.s.session DefaultSessionIdManager workerName=node0
[junit4] 2> 109086 INFO (TEST-SSLMigrationTest.test-seed#[F06E2829749A49C1]) [ ] o.e.j.s.session No SessionScavenger set, using defaults
[junit4] 2> 109086 INFO (TEST-SSLMigrationTest.test-seed#[F06E2829749A49C1]) [ ] o.e.j.s.session Scavenging every 660000ms
[junit4] 2> 109087 INFO (TEST-SSLMigrationTest.test-seed#[F06E2829749A49C1]) [ ] o.e.j.s.h.ContextHandler Started o.e.j.s.ServletContextHandler@151bc2dd{/,null,AVAILABLE}
[junit4] 2> 109088 INFO (TEST-SSLMigrationTest.test-seed#[F06E2829749A49C1]) [ ] o.e.j.s.AbstractConnector Started ServerConnector@541d7047{HTTP/1.1,[http/1.1]}{127.0.0.1:45633}
[junit4] 2> 109088 INFO (TEST-SSLMigrationTest.test-seed#[F06E2829749A49C1]) [ ] o.e.j.s.Server Started @109107ms
[junit4] 2> 109088 INFO (TEST-SSLMigrationTest.test-seed#[F06E2829749A49C1]) [ ] o.a.s.c.s.e.JettySolrRunner Jetty properties: {hostContext=/, solrconfig=solrconfig
[...truncated too long message...]
ion1 s:shard1 r:core_node48 x:collection1_shard1_replica_n47] o.a.s.m.SolrMetricManager Closing metric reporters for registry=solr.collection.collection1.shard1.leader, tag=44d239e1
[junit4] 2> 124993 ERROR (coreZkRegister-489-thread-1-processing-n:127.0.0.1:45633_ x:collection1_shard1_replica_n47 c:collection1 s:shard1 r:core_node48) [n:127.0.0.1:45633_ c:collection1 s:shard1 r:core_node48 x:collection1_shard1_replica_n47] o.a.s.c.ZkController Error getting leader from zk
[junit4] 2> org.apache.solr.common.SolrException: CoreContainer is closed
[junit4] 2> at org.apache.solr.cloud.ZkController.getLeaderProps(ZkController.java:1268) ~[java/:?]
[junit4] 2> at org.apache.solr.cloud.ZkController.getLeaderProps(ZkController.java:1235) ~[java/:?]
[junit4] 2> at org.apache.solr.cloud.ZkController.getLeader(ZkController.java:1191) [java/:?]
[junit4] 2> at org.apache.solr.cloud.ZkController.register(ZkController.java:1091) [java/:?]
[junit4] 2> at org.apache.solr.cloud.ZkController.register(ZkController.java:1019) [java/:?]
[junit4] 2> at org.apache.solr.core.ZkContainer.lambda$registerInZk$0(ZkContainer.java:187) [java/:?]
[junit4] 2> at org.apache.solr.common.util.ExecutorUtil$MDCAwareThreadPoolExecutor.lambda$execute$0(ExecutorUtil.java:192) [java/:?]
[junit4] 2> at java.util.concurrent.ThreadPoolExecutor.runWorker(ThreadPoolExecutor.java:1135) [?:?]
[junit4] 2> at java.util.concurrent.ThreadPoolExecutor$Worker.run(ThreadPoolExecutor.java:635) [?:?]
[junit4] 2> at java.lang.Thread.run(Thread.java:844) [?:?]
[junit4] 2> 124994 ERROR (coreZkRegister-489-thread-1-processing-n:127.0.0.1:45633_ x:collection1_shard1_replica_n47 c:collection1 s:shard1 r:core_node48) [n:127.0.0.1:45633_ c:collection1 s:shard1 r:core_node48 x:collection1_shard1_replica_n47] o.a.s.c.ZkContainer :org.apache.solr.common.SolrException: Error while saving shard term for collection: collection1
[junit4] 2> at org.apache.solr.cloud.ZkShardTerms.saveTerms(ZkShardTerms.java:307)
[junit4] 2> at org.apache.solr.cloud.ZkShardTerms.removeTerm(ZkShardTerms.java:182)
[junit4] 2> at org.apache.solr.cloud.ZkShardTerms.removeTerm(ZkShardTerms.java:173)
[junit4] 2> at org.apache.solr.cloud.ZkCollectionTerms.remove(ZkCollectionTerms.java:52)
[junit4] 2> at org.apache.solr.cloud.ZkController.unregister(ZkController.java:1506)
[junit4] 2> at org.apache.solr.cloud.ZkController.register(ZkController.java:1151)
[junit4] 2> at org.apache.solr.cloud.ZkController.register(ZkController.java:1019)
[junit4] 2> at org.apache.solr.core.ZkContainer.lambda$registerInZk$0(ZkContainer.java:187)
[junit4] 2> at org.apache.solr.common.util.ExecutorUtil$MDCAwareThreadPoolExecutor.lambda$execute$0(ExecutorUtil.java:192)
[junit4] 2> at java.base/java.util.concurrent.ThreadPoolExecutor.runWorker(ThreadPoolExecutor.java:1135)
[junit4] 2> at java.base/java.util.concurrent.ThreadPoolExecutor$Worker.run(ThreadPoolExecutor.java:635)
[junit4] 2> at java.base/java.lang.Thread.run(Thread.java:844)
[junit4] 2> Caused by: org.apache.zookeeper.KeeperException$SessionExpiredException: KeeperErrorCode = Session expired for /collections/collection1/terms/shard1
[junit4] 2> at org.apache.zookeeper.KeeperException.create(KeeperException.java:130)
[junit4] 2> at org.apache.zookeeper.KeeperException.create(KeeperException.java:54)
[junit4] 2> at org.apache.zookeeper.ZooKeeper.setData(ZooKeeper.java:1330)
[junit4] 2> at org.apache.solr.common.cloud.SolrZkClient.lambda$setData$6(SolrZkClient.java:352)
[junit4] 2> at org.apache.solr.common.cloud.ZkCmdExecutor.retryOperation(ZkCmdExecutor.java:60)
[junit4] 2> at org.apache.solr.common.cloud.SolrZkClient.setData(SolrZkClient.java:352)
[junit4] 2> at org.apache.solr.cloud.ZkShardTerms.saveTerms(ZkShardTerms.java:297)
[junit4] 2> ... 11 more
[junit4] 2>
[junit4] 2> 124995 INFO (TEST-SSLMigrationTest.test-seed#[F06E2829749A49C1]) [ ] o.e.j.s.AbstractConnector Stopped ServerConnector@79d9f992{SSL,[ssl, http/1.1]}{127.0.0.1:45633}
[junit4] 2> 124995 INFO (TEST-SSLMigrationTest.test-seed#[F06E2829749A49C1]) [ ] o.e.j.s.h.ContextHandler Stopped o.e.j.s.ServletContextHandler@4d21782b{/,null,UNAVAILABLE}
[junit4] 2> 124995 INFO (TEST-SSLMigrationTest.test-seed#[F06E2829749A49C1]) [ ] o.e.j.s.session Stopped scavenging
[junit4] 2> 125000 ERROR (TEST-SSLMigrationTest.test-seed#[F06E2829749A49C1]) [ ] o.a.z.s.ZooKeeperServer ZKShutdownHandler is not registered, so ZooKeeper server won't take any action on ERROR or SHUTDOWN server state changes
[junit4] 2> 125000 INFO (TEST-SSLMigrationTest.test-seed#[F06E2829749A49C1]) [ ] o.a.s.c.ZkTestServer connecting to 127.0.0.1:34755 34755
[junit4] 2> 125493 INFO (Thread-138) [ ] o.a.s.c.ZkTestServer connecting to 127.0.0.1:34755 34755
[junit4] 2> 125493 WARN (Thread-138) [ ] o.a.s.c.ZkTestServer Watch limit violations:
[junit4] 2> Maximum concurrent create/delete watches above limit:
[junit4] 2>
[junit4] 2> 20 /solr/aliases.json
[junit4] 2> 13 /solr/collections/collection1/terms/shard2
[junit4] 2> 9 /solr/security.json
[junit4] 2> 9 /solr/configs/conf1
[junit4] 2> 9 /solr/collections/collection1/terms/shard1
[junit4] 2> 2 /solr/collections/control_collection/terms/shard1
[junit4] 2>
[junit4] 2> Maximum concurrent data watches above limit:
[junit4] 2>
[junit4] 2> 20 /solr/clusterprops.json
[junit4] 2> 20 /solr/clusterstate.json
[junit4] 2> 8 /solr/collections/collection1/state.json
[junit4] 2> 5 /solr/overseer_elect/election/72067934739234820-127.0.0.1:37269_-n_0000000000
[junit4] 2> 5 /solr/autoscaling.json
[junit4] 2>
[junit4] 2> Maximum concurrent children watches above limit:
[junit4] 2>
[junit4] 2> 20 /solr/live_nodes
[junit4] 2> 20 /solr/collections
[junit4] 2> 5 /solr/overseer/queue
[junit4] 2> 5 /solr/autoscaling/events/.scheduled_maintenance
[junit4] 2> 5 /solr/autoscaling/events/.auto_add_replicas
[junit4] 2> 5 /solr/overseer/collection-queue-work
[junit4] 2> 5 /solr/overseer/queue-work
[junit4] 2>
[junit4] 2> NOTE: reproduce with: ant test -Dtestcase=SSLMigrationTest -Dtests.method=test -Dtests.seed=F06E2829749A49C1 -Dtests.multiplier=3 -Dtests.slow=true -Dtests.badapples=true -Dtests.locale=or-IN -Dtests.timezone=BST -Dtests.asserts=true -Dtests.file.encoding=ISO-8859-1
[junit4] FAILURE 26.5s J1 | SSLMigrationTest.test <<<
[junit4] > Throwable #1: java.lang.AssertionError: Replica didn't have the proper urlScheme in the ClusterState
[junit4] > at __randomizedtesting.SeedInfo.seed([F06E2829749A49C1:783A17F3DA662439]:0)
[junit4] > at org.apache.solr.cloud.SSLMigrationTest.assertReplicaInformation(SSLMigrationTest.java:104)
[junit4] > at org.apache.solr.cloud.SSLMigrationTest.testMigrateSSL(SSLMigrationTest.java:97)
[junit4] > at org.apache.solr.cloud.SSLMigrationTest.test(SSLMigrationTest.java:61)
[junit4] > at java.base/jdk.internal.reflect.NativeMethodAccessorImpl.invoke0(Native Method)
[junit4] > at java.base/jdk.internal.reflect.NativeMethodAccessorImpl.invoke(NativeMethodAccessorImpl.java:62)
[junit4] > at java.base/jdk.internal.reflect.DelegatingMethodAccessorImpl.invoke(DelegatingMethodAccessorImpl.java:43)
[junit4] > at java.base/java.lang.reflect.Method.invoke(Method.java:564)
[junit4] > at org.apache.solr.BaseDistributedSearchTestCase$ShardsRepeatRule$ShardsFixedStatement.callStatement(BaseDistributedSearchTestCase.java:993)
[junit4] > at org.apache.solr.BaseDistributedSearchTestCase$ShardsRepeatRule$ShardsStatement.evaluate(BaseDistributedSearchTestCase.java:968)
[junit4] > at java.base/java.lang.Thread.run(Thread.java:844)
[junit4] 2> NOTE: leaving temporary files on disk at: /home/jenkins/workspace/Lucene-Solr-BadApples-master-Linux/solr/build/solr-core/test/J1/temp/solr.cloud.SSLMigrationTest_F06E2829749A49C1-001
[junit4] 2> NOTE: test params are: codec=Asserting(Lucene70): {}, docValues:{}, maxPointsInLeafNode=394, maxMBSortInHeap=6.030383186524963, sim=Asserting(org.apache.lucene.search.similarities.AssertingSimilarity@70304292), locale=or-IN, timezone=BST
[junit4] 2> NOTE: Linux 4.13.0-37-generic amd64/Oracle Corporation 10 (64-bit)/cpus=8,threads=1,free=307575888,total=518979584
[junit4] 2> NOTE: All tests run in this JVM: [TestReplicaProperties, SuggesterFSTTest, OverseerTest, TestQueryUtils, TestLuceneIndexBackCompat, SearchRateTriggerTest, SolrIndexMetricsTest, SSLMigrationTest]
[junit4] Completed [43/795 (1!)] on J1 in 26.57s, 1 test, 1 failure <<< FAILURES!
[...truncated 45223 lines...]
[repro] Jenkins log URL: https://jenkins.thetaphi.de/job/Lucene-Solr-BadApples-master-Linux/16/consoleText
[repro] Revision: a4789db47788daeef0ba2ab426b4047d2fa47070
[repro] Repro line: ant test -Dtestcase=SSLMigrationTest -Dtests.method=test -Dtests.seed=F06E2829749A49C1 -Dtests.multiplier=3 -Dtests.slow=true -Dtests.badapples=true -Dtests.locale=or-IN -Dtests.timezone=BST -Dtests.asserts=true -Dtests.file.encoding=ISO-8859-1
[repro] ant clean
[...truncated 6 lines...]
[repro] Test suites by module:
[repro] solr/core
[repro] SSLMigrationTest
[repro] ant compile-test
[...truncated 3301 lines...]
[repro] ant test-nocompile -Dtests.dups=5 -Dtests.maxfailures=5 -Dtests.class="*.SSLMigrationTest" -Dtests.showOutput=onerror -Dtests.seed=F06E2829749A49C1 -Dtests.multiplier=3 -Dtests.slow=true -Dtests.badapples=true -Dtests.locale=or-IN -Dtests.timezone=BST -Dtests.asserts=true -Dtests.file.encoding=ISO-8859-1
[...truncated 76 lines...]
[repro] Failures:
[repro] 0/5 failed: org.apache.solr.cloud.SSLMigrationTest
[repro] Exiting with code 0
[...truncated 40 lines...]