You are viewing a plain text version of this content. The canonical link for it is here.
Posted to dev@ode.apache.org by Apache Jenkins Server <je...@builds.apache.org> on 2013/05/14 12:33:09 UTC
Build failed in Jenkins: ODE-1.x #182
See <https://builds.apache.org/job/ODE-1.x/182/changes>
Changes:
[Tammo van Lessen] fixing a class loading issue.
[Tammo van Lessen] fixing tempfile generation.
[Tammo van Lessen] ignoring obsolete testcases.
------------------------------------------
Started by user Tammo van Lessen
Started by an SCM change
Started by an SCM change
Started by an SCM change
Started by an SCM change
Started by an SCM change
Building remotely on ubuntu6 in workspace <https://builds.apache.org/job/ODE-1.x/ws/>
Checkout:ODE-1.x / <https://builds.apache.org/job/ODE-1.x/ws/> - hudson.remoting.Channel@7dd1e429:ubuntu6
Using strategy: Default
Last Built Revision: Revision f7fb7313151d29e96cd3a639e148e2cf18c64036 (origin/ode-1.3.6.x)
Fetching changes from 1 remote Git repository
Fetching upstream changes from https://git-wip-us.apache.org/repos/asf/ode.git
Commencing build of Revision 8493242bcfa5e301f0ab1c8e2aaa6790845ffcc6 (origin/ode-1.3.6.x)
Checking out Revision 8493242bcfa5e301f0ab1c8e2aaa6790845ffcc6 (origin/ode-1.3.6.x)
[locks-and-latches] Checking to see if we really have the locks
[locks-and-latches] Have all the locks, build can start
[ODE-1.x] $ /bin/bash /tmp/hudson2999998523089064985.sh
Using /home/jenkins/.rvm/gems/jruby-1.7.3
Exception in thread "main" java.lang.NoClassDefFoundError: org/jruby/Main
Build step 'Execute shell' marked build as failure
[locks-and-latches] Releasing all the locks
[locks-and-latches] All the locks released
Recording fingerprints
Archiving artifacts
Recording test results
Jenkins build is back to normal : ODE-1.x #190
Posted by Apache Jenkins Server <je...@builds.apache.org>.
See <https://builds.apache.org/job/ODE-1.x/190/>
Build failed in Jenkins: ODE-1.x #189
Posted by Apache Jenkins Server <je...@builds.apache.org>.
See <https://builds.apache.org/job/ODE-1.x/189/>
------------------------------------------
Started by user Tammo van Lessen
Building remotely on ubuntu4 in workspace <https://builds.apache.org/job/ODE-1.x/ws/>
Checkout:ODE-1.x / <https://builds.apache.org/job/ODE-1.x/ws/> - hudson.remoting.Channel@33f60d5:ubuntu4
Using strategy: Default
Last Built Revision: Revision 8493242bcfa5e301f0ab1c8e2aaa6790845ffcc6 (origin/ode-1.3.6.x)
Fetching changes from 1 remote Git repository
Fetching upstream changes from https://git-wip-us.apache.org/repos/asf/ode.git
Commencing build of Revision 8493242bcfa5e301f0ab1c8e2aaa6790845ffcc6 (origin/ode-1.3.6.x)
Checking out Revision 8493242bcfa5e301f0ab1c8e2aaa6790845ffcc6 (origin/ode-1.3.6.x)
[locks-and-latches] Checking to see if we really have the locks
[locks-and-latches] Have all the locks, build can start
[ODE-1.x] $ /bin/bash /tmp/hudson7261847242876605223.sh
Using /home/jenkins/.rvm/gems/jruby-1.7.3
Exception in thread "main" java.lang.NoClassDefFoundError: org/jruby/Main
Caused by: java.lang.ClassNotFoundException: org.jruby.Main
at java.net.URLClassLoader$1.run(URLClassLoader.java:202)
at java.security.AccessController.doPrivileged(Native Method)
at java.net.URLClassLoader.findClass(URLClassLoader.java:190)
at java.lang.ClassLoader.loadClass(ClassLoader.java:306)
at sun.misc.Launcher$AppClassLoader.loadClass(Launcher.java:301)
at java.lang.ClassLoader.loadClass(ClassLoader.java:247)
Could not find the main class: org/jruby/Main. Program will exit.
Build step 'Execute shell' marked build as failure
[locks-and-latches] Releasing all the locks
[locks-and-latches] All the locks released
Recording fingerprints
Archiving artifacts
Recording test results
Build failed in Jenkins: ODE-1.x #188
Posted by Apache Jenkins Server <je...@builds.apache.org>.
See <https://builds.apache.org/job/ODE-1.x/188/>
------------------------------------------
Started by user Tammo van Lessen
Building remotely on ubuntu4 in workspace <https://builds.apache.org/job/ODE-1.x/ws/>
Checkout:ODE-1.x / <https://builds.apache.org/job/ODE-1.x/ws/> - hudson.remoting.Channel@33f60d5:ubuntu4
Using strategy: Default
Last Built Revision: Revision 8493242bcfa5e301f0ab1c8e2aaa6790845ffcc6 (origin/ode-1.3.6.x)
Fetching changes from 1 remote Git repository
Fetching upstream changes from https://git-wip-us.apache.org/repos/asf/ode.git
Commencing build of Revision 8493242bcfa5e301f0ab1c8e2aaa6790845ffcc6 (origin/ode-1.3.6.x)
Checking out Revision 8493242bcfa5e301f0ab1c8e2aaa6790845ffcc6 (origin/ode-1.3.6.x)
[locks-and-latches] Checking to see if we really have the locks
[locks-and-latches] Have all the locks, build can start
[ODE-1.x] $ /bin/bash /tmp/hudson46581177573141830.sh
Using /home/jenkins/.rvm/gems/jruby-1.7.3
Exception in thread "main" java.lang.NoClassDefFoundError: org/jruby/Main
Caused by: java.lang.ClassNotFoundException: org.jruby.Main
at java.net.URLClassLoader$1.run(URLClassLoader.java:202)
at java.security.AccessController.doPrivileged(Native Method)
at java.net.URLClassLoader.findClass(URLClassLoader.java:190)
at java.lang.ClassLoader.loadClass(ClassLoader.java:306)
at sun.misc.Launcher$AppClassLoader.loadClass(Launcher.java:301)
at java.lang.ClassLoader.loadClass(ClassLoader.java:247)
Could not find the main class: org/jruby/Main. Program will exit.
Build step 'Execute shell' marked build as failure
[locks-and-latches] Releasing all the locks
[locks-and-latches] All the locks released
Recording fingerprints
Archiving artifacts
Recording test results
Build failed in Jenkins: ODE-1.x #187
Posted by Apache Jenkins Server <je...@builds.apache.org>.
See <https://builds.apache.org/job/ODE-1.x/187/>
------------------------------------------
Started by user Tammo van Lessen
Building remotely on ubuntu6 in workspace <https://builds.apache.org/job/ODE-1.x/ws/>
Checkout:ODE-1.x / <https://builds.apache.org/job/ODE-1.x/ws/> - hudson.remoting.Channel@7dd1e429:ubuntu6
Using strategy: Default
Last Built Revision: Revision 8493242bcfa5e301f0ab1c8e2aaa6790845ffcc6 (origin/ode-1.3.6.x)
Fetching changes from 1 remote Git repository
Fetching upstream changes from https://git-wip-us.apache.org/repos/asf/ode.git
Commencing build of Revision 8493242bcfa5e301f0ab1c8e2aaa6790845ffcc6 (origin/ode-1.3.6.x)
Checking out Revision 8493242bcfa5e301f0ab1c8e2aaa6790845ffcc6 (origin/ode-1.3.6.x)
[locks-and-latches] Checking to see if we really have the locks
[locks-and-latches] Have all the locks, build can start
[ODE-1.x] $ /bin/bash /tmp/hudson2844449056592675539.sh
Using /home/jenkins/.rvm/gems/jruby-1.7.3
Exception in thread "main" java.lang.NoClassDefFoundError: org/jruby/Main
Caused by: java.lang.ClassNotFoundException: org.jruby.Main
at java.net.URLClassLoader$1.run(URLClassLoader.java:202)
at java.security.AccessController.doPrivileged(Native Method)
at java.net.URLClassLoader.findClass(URLClassLoader.java:190)
at java.lang.ClassLoader.loadClass(ClassLoader.java:306)
at sun.misc.Launcher$AppClassLoader.loadClass(Launcher.java:301)
at java.lang.ClassLoader.loadClass(ClassLoader.java:247)
Could not find the main class: org/jruby/Main. Program will exit.
Build step 'Execute shell' marked build as failure
[locks-and-latches] Releasing all the locks
[locks-and-latches] All the locks released
Recording fingerprints
Archiving artifacts
Recording test results
Build failed in Jenkins: ODE-1.x #186
Posted by Apache Jenkins Server <je...@builds.apache.org>.
See <https://builds.apache.org/job/ODE-1.x/186/>
------------------------------------------
Started by user Tammo van Lessen
Building remotely on ubuntu3 in workspace <https://builds.apache.org/job/ODE-1.x/ws/>
Checkout:ODE-1.x / <https://builds.apache.org/job/ODE-1.x/ws/> - hudson.remoting.Channel@7c00bcac:ubuntu3
Using strategy: Default
Last Built Revision: Revision 8493242bcfa5e301f0ab1c8e2aaa6790845ffcc6 (origin/ode-1.3.6.x)
Fetching changes from 1 remote Git repository
Fetching upstream changes from https://git-wip-us.apache.org/repos/asf/ode.git
Commencing build of Revision 8493242bcfa5e301f0ab1c8e2aaa6790845ffcc6 (origin/ode-1.3.6.x)
Checking out Revision 8493242bcfa5e301f0ab1c8e2aaa6790845ffcc6 (origin/ode-1.3.6.x)
[locks-and-latches] Checking to see if we really have the locks
[locks-and-latches] Have all the locks, build can start
[ODE-1.x] $ /bin/bash /tmp/hudson3738535884614083211.sh
Using /home/jenkins/.rvm/gems/jruby-1.7.3
LoadError: Could not open library 'ncursesw' : ncursesw: cannot open shared object file: No such file or directory. Could not open library 'libncursesw.so' : libncursesw.so: cannot open shared object file: No such file or directory. Could not open library 'libncursesw' : libncursesw: cannot open shared object file: No such file or directory. Could not open library 'ncurses' : ncurses: cannot open shared object file: No such file or directory. Could not open library 'libncurses.so' : libncurses.so: cannot open shared object file: No such file or directory. Could not open library 'libcurses' : libcurses: cannot open shared object file: No such file or directory. Could not open library 'libcurses.so' : libcurses.so: cannot open shared object file: No such file or directory
ffi_lib at /home/jenkins/.rvm/rubies/jruby-1.7.3/lib/ruby/shared/ffi/library.rb:83
map at org/jruby/RubyArray.java:2361
ffi_lib at /home/jenkins/.rvm/rubies/jruby-1.7.3/lib/ruby/shared/ffi/library.rb:65
NCurses at /home/jenkins/.rvm/gems/jruby-1.7.3/gems/ffi-ncurses-0.4.0/lib/ffi-ncurses.rb:64
FFI at /home/jenkins/.rvm/gems/jruby-1.7.3/gems/ffi-ncurses-0.4.0/lib/ffi-ncurses.rb:38
(root) at /home/jenkins/.rvm/gems/jruby-1.7.3/gems/ffi-ncurses-0.4.0/lib/ffi-ncurses.rb:37
require at org/jruby/RubyKernel.java:1027
require at /home/jenkins/.rvm/rubies/jruby-1.7.3/lib/ruby/shared/rubygems/custom_require.rb:60
require at /home/jenkins/.rvm/rubies/jruby-1.7.3/lib/ruby/shared/rubygems/custom_require.rb:55
(root) at /home/jenkins/.rvm/gems/jruby-1.7.3/gems/highline-1.6.2/lib/highline/system_extensions.rb:1
SystemExtensions at /home/jenkins/.rvm/gems/jruby-1.7.3/gems/highline-1.6.2/lib/highline/system_extensions.rb:90
HighLine at /home/jenkins/.rvm/gems/jruby-1.7.3/gems/highline-1.6.2/lib/highline/system_extensions.rb:13
require at org/jruby/RubyKernel.java:1027
require at /home/jenkins/.rvm/rubies/jruby-1.7.3/lib/ruby/shared/rubygems/custom_require.rb:36
(root) at /home/jenkins/.rvm/gems/jruby-1.7.3/gems/highline-1.6.2/lib/highline/system_extensions.rb:12
require at org/jruby/RubyKernel.java:1027
require at /home/jenkins/.rvm/rubies/jruby-1.7.3/lib/ruby/shared/rubygems/custom_require.rb:36
(root) at /home/jenkins/.rvm/gems/jruby-1.7.3/gems/highline-1.6.2/lib/highline.rb:1
require at org/jruby/RubyKernel.java:1027
require at /home/jenkins/.rvm/rubies/jruby-1.7.3/lib/ruby/shared/rubygems/custom_require.rb:36
(root) at /home/jenkins/.rvm/gems/jruby-1.7.3/gems/highline-1.6.2/lib/highline.rb:16
require at org/jruby/RubyKernel.java:1027
require at /home/jenkins/.rvm/rubies/jruby-1.7.3/lib/ruby/shared/rubygems/custom_require.rb:36
(root) at /home/jenkins/.rvm/gems/jruby-1.7.3/gems/highline-1.6.2/lib/highline/import.rb:1
load at org/jruby/RubyKernel.java:1046
(root) at /home/jenkins/.rvm/gems/jruby-1.7.3/gems/highline-1.6.2/lib/highline/import.rb:10
eval at org/jruby/RubyKernel.java:1066
(root) at /home/jenkins/.rvm/gems/jruby-1.7.3/bin/ruby_noexec_wrapper:14
Build step 'Execute shell' marked build as failure
[locks-and-latches] Releasing all the locks
[locks-and-latches] All the locks released
Recording fingerprints
Archiving artifacts
Recording test results
Build failed in Jenkins: ODE-1.x #185
Posted by Apache Jenkins Server <je...@builds.apache.org>.
See <https://builds.apache.org/job/ODE-1.x/185/>
------------------------------------------
Started by user Tammo van Lessen
Building remotely on ubuntu6 in workspace <https://builds.apache.org/job/ODE-1.x/ws/>
Checkout:ODE-1.x / <https://builds.apache.org/job/ODE-1.x/ws/> - hudson.remoting.Channel@7dd1e429:ubuntu6
Using strategy: Default
Last Built Revision: Revision 8493242bcfa5e301f0ab1c8e2aaa6790845ffcc6 (origin/ode-1.3.6.x)
Fetching changes from 1 remote Git repository
Fetching upstream changes from https://git-wip-us.apache.org/repos/asf/ode.git
Commencing build of Revision 8493242bcfa5e301f0ab1c8e2aaa6790845ffcc6 (origin/ode-1.3.6.x)
Checking out Revision 8493242bcfa5e301f0ab1c8e2aaa6790845ffcc6 (origin/ode-1.3.6.x)
[locks-and-latches] Checking to see if we really have the locks
[locks-and-latches] Have all the locks, build can start
[ODE-1.x] $ /bin/bash /tmp/hudson2636306276122824069.sh
Using /home/jenkins/.rvm/gems/jruby-1.7.3
Exception in thread "main" java.lang.NoClassDefFoundError: org/jruby/Main
Caused by: java.lang.ClassNotFoundException: org.jruby.Main
at java.net.URLClassLoader$1.run(URLClassLoader.java:202)
at java.security.AccessController.doPrivileged(Native Method)
at java.net.URLClassLoader.findClass(URLClassLoader.java:190)
at java.lang.ClassLoader.loadClass(ClassLoader.java:306)
at sun.misc.Launcher$AppClassLoader.loadClass(Launcher.java:301)
at java.lang.ClassLoader.loadClass(ClassLoader.java:247)
Could not find the main class: org/jruby/Main. Program will exit.
Build step 'Execute shell' marked build as failure
[locks-and-latches] Releasing all the locks
[locks-and-latches] All the locks released
Recording fingerprints
Archiving artifacts
Recording test results
Build failed in Jenkins: ODE-1.x #184
Posted by Apache Jenkins Server <je...@builds.apache.org>.
See <https://builds.apache.org/job/ODE-1.x/184/>
------------------------------------------
Started by user Tammo van Lessen
Building remotely on ubuntu1 in workspace <https://builds.apache.org/job/ODE-1.x/ws/>
Checkout:ODE-1.x / <https://builds.apache.org/job/ODE-1.x/ws/> - hudson.remoting.Channel@115efa5f:ubuntu1
Using strategy: Default
Last Built Revision: Revision 8493242bcfa5e301f0ab1c8e2aaa6790845ffcc6 (origin/ode-1.3.6.x)
Fetching changes from 1 remote Git repository
Fetching upstream changes from https://git-wip-us.apache.org/repos/asf/ode.git
Commencing build of Revision 8493242bcfa5e301f0ab1c8e2aaa6790845ffcc6 (origin/ode-1.3.6.x)
Checking out Revision 8493242bcfa5e301f0ab1c8e2aaa6790845ffcc6 (origin/ode-1.3.6.x)
[locks-and-latches] Checking to see if we really have the locks
[locks-and-latches] Have all the locks, build can start
[ODE-1.x] $ /bin/bash /tmp/hudson4062763745455158016.sh
Using /home/jenkins/.rvm/gems/jruby-1.7.3
Exception in thread "main" java.lang.NoClassDefFoundError: org/jruby/Main
Caused by: java.lang.ClassNotFoundException: org.jruby.Main
at java.net.URLClassLoader$1.run(URLClassLoader.java:202)
at java.security.AccessController.doPrivileged(Native Method)
at java.net.URLClassLoader.findClass(URLClassLoader.java:190)
at java.lang.ClassLoader.loadClass(ClassLoader.java:306)
at sun.misc.Launcher$AppClassLoader.loadClass(Launcher.java:301)
at java.lang.ClassLoader.loadClass(ClassLoader.java:247)
Could not find the main class: org/jruby/Main. Program will exit.
Build step 'Execute shell' marked build as failure
[locks-and-latches] Releasing all the locks
[locks-and-latches] All the locks released
Recording fingerprints
Archiving artifacts
Recording test results
Build failed in Jenkins: ODE-1.x #183
Posted by Apache Jenkins Server <je...@builds.apache.org>.
See <https://builds.apache.org/job/ODE-1.x/183/>
------------------------------------------
Started by user Tammo van Lessen
Building remotely on ubuntu3 in workspace <https://builds.apache.org/job/ODE-1.x/ws/>
Checkout:ODE-1.x / <https://builds.apache.org/job/ODE-1.x/ws/> - hudson.remoting.Channel@7c00bcac:ubuntu3
Using strategy: Default
Last Built Revision: Revision 8493242bcfa5e301f0ab1c8e2aaa6790845ffcc6 (origin/ode-1.3.6.x)
Fetching changes from 1 remote Git repository
Fetching upstream changes from https://git-wip-us.apache.org/repos/asf/ode.git
Commencing build of Revision 8493242bcfa5e301f0ab1c8e2aaa6790845ffcc6 (origin/ode-1.3.6.x)
Checking out Revision 8493242bcfa5e301f0ab1c8e2aaa6790845ffcc6 (origin/ode-1.3.6.x)
[locks-and-latches] Checking to see if we really have the locks
[locks-and-latches] Have all the locks, build can start
[ODE-1.x] $ /bin/bash /tmp/hudson169630739134877728.sh
Using /home/jenkins/.rvm/gems/jruby-1.7.3
Exception in thread "main" java.lang.UnsupportedClassVersionError: Bad version number in .class file
at java.lang.ClassLoader.findBootstrapClass(Native Method)
at java.lang.ClassLoader.findBootstrapClass0(ClassLoader.java:892)
at java.lang.ClassLoader.loadClass(ClassLoader.java:302)
at java.lang.ClassLoader.loadClass(ClassLoader.java:300)
at sun.misc.Launcher$AppClassLoader.loadClass(Launcher.java:268)
at java.lang.ClassLoader.loadClass(ClassLoader.java:252)
at java.lang.ClassLoader.loadClassInternal(ClassLoader.java:320)
Build step 'Execute shell' marked build as failure
[locks-and-latches] Releasing all the locks
[locks-and-latches] All the locks released
Recording fingerprints
Archiving artifacts
Recording test results